FailedConsole Output

Skipping 541 KB.. Full Log
7-12-13 10:21:00,410 [DEBUG] yardstick.ssh.kvm.LF-1d3ec479 ssh.py:294 stdout: u"/bin/sh ./libtool  --tag=CC   --mode=compile gcc -std=gnu99 -DHAVE_CONFIG_H -I.    -I ./include -I ./include -I ./lib -I ./lib    -Wstrict-prototypes -Wall -Wextra -Wno-sign-compare -Wpointer-arith -Wswitch-enum -Wunused-parameter -Wbad-function-cast -Wcast-align -Wmissing-prototypes -Wmissing-field-initializers -fno-strict-aliasing -mssse3 -I../../dpdk/dpdk/x86_64-native-linuxapp-gcc/include -D_FILE_OFFSET_BITS=64  -g -O2 -Wno-cast-align -MT ovsdb/ovsdb_libovsdb_la-monitor.lo -MD -MP -MF ovsdb/.deps/ovsdb_libovsdb_la-monitor.Tpo -c -o ovsdb/ovsdb_libovsdb_la-monitor.lo `test -f 'ovsdb/monitor.c' || echo './'`ovsdb/monitor.c\n"
2017-12-13 10:21:00,430 [DEBUG] yardstick.ssh.kvm.LF-1d3ec479 ssh.py:294 stdout: u'libtool: compile:  gcc -std=gnu99 -DHAVE_CONFIG_H -I. -I ./include -I ./include -I ./lib -I ./lib -Wstrict-prototypes -Wall -Wextra -Wno-sign-compare -Wpointer-arith -Wswitch-enum -Wunused-parameter -Wbad-function-cast -Wcast-align -Wmissing-prototypes -Wmissing-field-initializers -fno-strict-aliasing -mssse3 -I../../dpdk/dpdk/x86_64-native-linuxapp-gcc/include -D_FILE_OFFSET_BITS=64 -g -O2 -Wno-cast-align -MT ovsdb/ovsdb_libovsdb_la-monitor.lo -MD -MP -MF ovsdb/.deps/ovsdb_libovsdb_la-monitor.Tpo -c ovsdb/monitor.c -o ovsdb/ovsdb_libovsdb_la-monitor.o\n'
2017-12-13 10:21:01,034 [DEBUG] yardstick.ssh.kvm.LF-1d3ec479 ssh.py:294 stdout: u'mv -f ovsdb/.deps/ovsdb_libovsdb_la-monitor.Tpo ovsdb/.deps/ovsdb_libovsdb_la-monitor.Plo\n'
2017-12-13 10:21:01,035 [DEBUG] yardstick.ssh.kvm.LF-1d3ec479 ssh.py:294 stdout: u"/bin/sh ./libtool  --tag=CC   --mode=compile gcc -std=gnu99 -DHAVE_CONFIG_H -I.    -I ./include -I ./include -I ./lib -I ./lib    -Wstrict-prototypes -Wall -Wextra -Wno-sign-compare -Wpointer-arith -Wswitch-enum -Wunused-parameter -Wbad-function-cast -Wcast-align -Wmissing-prototypes -Wmissing-field-initializers -fno-strict-aliasing -mssse3 -I../../dpdk/dpdk/x86_64-native-linuxapp-gcc/include -D_FILE_OFFSET_BITS=64  -g -O2 -Wno-cast-align -MT ovsdb/ovsdb_libovsdb_la-query.lo -MD -MP -MF ovsdb/.deps/ovsdb_libovsdb_la-query.Tpo -c -o ovsdb/ovsdb_libovsdb_la-query.lo `test -f 'ovsdb/query.c' || echo './'`ovsdb/query.c\n"
2017-12-13 10:21:01,054 [DEBUG] yardstick.ssh.kvm.LF-1d3ec479 ssh.py:294 stdout: u'libtool: compile:  gcc -std=gnu99 -DHAVE_CONFIG_H -I. -I ./include -I ./include -I ./lib -I ./lib -Wstrict-prototypes -Wall -Wextra -Wno-sign-compare -Wpointer-arith -Wswitch-enum -Wunused-parameter -Wbad-function-cast -Wcast-align -Wmissing-prototypes -Wmissing-field-initializers -fno-strict-aliasing -mssse3 -I../../dpdk/dpdk/x86_64-native-linuxapp-gcc/include -D_FILE_OFFSET_BITS=64 -g -O2 -Wno-cast-align -MT ovsdb/ovsdb_libovsdb_la-query.lo -MD -MP -MF ovsdb/.deps/ovsdb_libovsdb_la-query.Tpo -c ovsdb/query.c -o ovsdb/ovsdb_libovsdb_la-query.o\n'
2017-12-13 10:21:01,133 [DEBUG] yardstick.ssh.kvm.LF-1d3ec479 ssh.py:294 stdout: u'mv -f ovsdb/.deps/ovsdb_libovsdb_la-query.Tpo ovsdb/.deps/ovsdb_libovsdb_la-query.Plo\n'
2017-12-13 10:21:01,134 [DEBUG] yardstick.ssh.kvm.LF-1d3ec479 ssh.py:294 stdout: u"/bin/sh ./libtool  --tag=CC   --mode=compile gcc -std=gnu99 -DHAVE_CONFIG_H -I.    -I ./include -I ./include -I ./lib -I ./lib    -Wstrict-prototypes -Wall -Wextra -Wno-sign-compare -Wpointer-arith -Wswitch-enum -Wunused-parameter -Wbad-function-cast -Wcast-align -Wmissing-prototypes -Wmissing-field-initializers -fno-strict-aliasing -mssse3 -I../../dpdk/dpdk/x86_64-native-linuxapp-gcc/include -D_FILE_OFFSET_BITS=64  -g -O2 -Wno-cast-align -MT ovsdb/ovsdb_libovsdb_la-replication.lo -MD -MP -MF ovsdb/.deps/ovsdb_libovsdb_la-replication.Tpo -c -o ovsdb/ovsdb_libovsdb_la-replication.lo `test -f 'ovsdb/replication.c' || echo './'`ovsdb/replication.c\n"
2017-12-13 10:21:01,153 [DEBUG] yardstick.ssh.kvm.LF-1d3ec479 ssh.py:294 stdout: u'libtool: compile:  gcc -std=gnu99 -DHAVE_CONFIG_H -I. -I ./include -I ./include -I ./lib -I ./lib -Wstrict-prototypes -Wall -Wextra -Wno-sign-compare -Wpointer-arith -Wswitch-enum -Wunused-parameter -Wbad-function-cast -Wcast-align -Wmissing-prototypes -Wmissing-field-initializers -fno-strict-aliasing -mssse3 -I../../dpdk/dpdk/x86_64-native-linuxapp-gcc/include -D_FILE_OFFSET_BITS=64 -g -O2 -Wno-cast-align -MT ovsdb/ovsdb_libovsdb_la-replication.lo -MD -MP -MF ovsdb/.deps/ovsdb_libovsdb_la-replication.Tpo -c ovsdb/replication.c -o ovsdb/ovsdb_libovsdb_la-replication.o\n'
2017-12-13 10:21:01,495 [DEBUG] yardstick.ssh.kvm.LF-1d3ec479 ssh.py:294 stdout: u'mv -f ovsdb/.deps/ovsdb_libovsdb_la-replication.Tpo ovsdb/.deps/ovsdb_libovsdb_la-replication.Plo\n'
2017-12-13 10:21:01,496 [DEBUG] yardstick.ssh.kvm.LF-1d3ec479 ssh.py:294 stdout: u"/bin/sh ./libtool  --tag=CC   --mode=compile gcc -std=gnu99 -DHAVE_CONFIG_H -I.    -I ./include -I ./include -I ./lib -I ./lib    -Wstrict-prototypes -Wall -Wextra -Wno-sign-compare -Wpointer-arith -Wswitch-enum -Wunused-parameter -Wbad-function-cast -Wcast-align -Wmissing-prototypes -Wmissing-field-initializers -fno-strict-aliasing -mssse3 -I../../dpdk/dpdk/x86_64-native-linuxapp-gcc/include -D_FILE_OFFSET_BITS=64  -g -O2 -Wno-cast-align -MT ovsdb/ovsdb_libovsdb_la-row.lo -MD -MP -MF ovsdb/.deps/ovsdb_libovsdb_la-row.Tpo -c -o ovsdb/ovsdb_libovsdb_la-row.lo `test -f 'ovsdb/row.c' || echo './'`ovsdb/row.c\n"
2017-12-13 10:21:01,515 [DEBUG] yardstick.ssh.kvm.LF-1d3ec479 ssh.py:294 stdout: u'libtool: compile:  gcc -std=gnu99 -DHAVE_CONFIG_H -I. -I ./include -I ./include -I ./lib -I ./lib -Wstrict-prototypes -Wall -Wextra -Wno-sign-compare -Wpointer-arith -Wswitch-enum -Wunused-parameter -Wbad-function-cast -Wcast-align -Wmissing-prototypes -Wmissing-field-initializers -fno-strict-aliasing -mssse3 -I../../dpdk/dpdk/x86_64-native-linuxapp-gcc/include -D_FILE_OFFSET_BITS=64 -g -O2 -Wno-cast-align -MT ovsdb/ovsdb_libovsdb_la-row.lo -MD -MP -MF ovsdb/.deps/ovsdb_libovsdb_la-row.Tpo -c ovsdb/row.c -o ovsdb/ovsdb_libovsdb_la-row.o\n'
2017-12-13 10:21:01,726 [DEBUG] yardstick.ssh.kvm.LF-1d3ec479 ssh.py:294 stdout: u'mv -f ovsdb/.deps/ovsdb_libovsdb_la-row.Tpo ovsdb/.deps/ovsdb_libovsdb_la-row.Plo\n'
2017-12-13 10:21:01,727 [DEBUG] yardstick.ssh.kvm.LF-1d3ec479 ssh.py:294 stdout: u"/bin/sh ./libtool  --tag=CC   --mode=compile gcc -std=gnu99 -DHAVE_CONFIG_H -I.    -I ./include -I ./include -I ./lib -I ./lib    -Wstrict-prototypes -Wall -Wextra -Wno-sign-compare -Wpointer-arith -Wswitch-enum -Wunused-parameter -Wbad-function-cast -Wcast-align -Wmissing-prototypes -Wmissing-field-initializers -fno-strict-aliasing -mssse3 -I../../dpdk/dpdk/x86_64-native-linuxapp-gcc/include -D_FILE_OFFSET_BITS=64  -g -O2 -Wno-cast-align -MT ovsdb/ovsdb_libovsdb_la-server.lo -MD -MP -MF ovsdb/.deps/ovsdb_libovsdb_la-server.Tpo -c -o ovsdb/ovsdb_libovsdb_la-server.lo `test -f 'ovsdb/server.c' || echo './'`ovsdb/server.c\n"
2017-12-13 10:21:01,746 [DEBUG] yardstick.ssh.kvm.LF-1d3ec479 ssh.py:294 stdout: u'libtool: compile:  gcc -std=gnu99 -DHAVE_CONFIG_H -I. -I ./include -I ./include -I ./lib -I ./lib -Wstrict-prototypes -Wall -Wextra -Wno-sign-compare -Wpointer-arith -Wswitch-enum -Wunused-parameter -Wbad-function-cast -Wcast-align -Wmissing-prototypes -Wmissing-field-initializers -fno-strict-aliasing -mssse3 -I../../dpdk/dpdk/x86_64-native-linuxapp-gcc/include -D_FILE_OFFSET_BITS=64 -g -O2 -Wno-cast-align -MT ovsdb/ovsdb_libovsdb_la-server.lo -MD -MP -MF ovsdb/.deps/ovsdb_libovsdb_la-server.Tpo -c ovsdb/server.c -o ovsdb/ovsdb_libovsdb_la-server.o\n'
2017-12-13 10:21:01,859 [DEBUG] yardstick.ssh.kvm.LF-1d3ec479 ssh.py:294 stdout: u'mv -f ovsdb/.deps/ovsdb_libovsdb_la-server.Tpo ovsdb/.deps/ovsdb_libovsdb_la-server.Plo\n'
2017-12-13 10:21:01,860 [DEBUG] yardstick.ssh.kvm.LF-1d3ec479 ssh.py:294 stdout: u"/bin/sh ./libtool  --tag=CC   --mode=compile gcc -std=gnu99 -DHAVE_CONFIG_H -I.    -I ./include -I ./include -I ./lib -I ./lib    -Wstrict-prototypes -Wall -Wextra -Wno-sign-compare -Wpointer-arith -Wswitch-enum -Wunused-parameter -Wbad-function-cast -Wcast-align -Wmissing-prototypes -Wmissing-field-initializers -fno-strict-aliasing -mssse3 -I../../dpdk/dpdk/x86_64-native-linuxapp-gcc/include -D_FILE_OFFSET_BITS=64  -g -O2 -Wno-cast-align -MT ovsdb/ovsdb_libovsdb_la-table.lo -MD -MP -MF ovsdb/.deps/ovsdb_libovsdb_la-table.Tpo -c -o ovsdb/ovsdb_libovsdb_la-table.lo `test -f 'ovsdb/table.c' || echo './'`ovsdb/table.c\n"
2017-12-13 10:21:01,880 [DEBUG] yardstick.ssh.kvm.LF-1d3ec479 ssh.py:294 stdout: u'libtool: compile:  gcc -std=gnu99 -DHAVE_CONFIG_H -I. -I ./include -I ./include -I ./lib -I ./lib -Wstrict-prototypes -Wall -Wextra -Wno-sign-compare -Wpointer-arith -Wswitch-enum -Wunused-parameter -Wbad-function-cast -Wcast-align -Wmissing-prototypes -Wmissing-field-initializers -fno-strict-aliasing -mssse3 -I../../dpdk/dpdk/x86_64-native-linuxapp-gcc/include -D_FILE_OFFSET_BITS=64 -g -O2 -Wno-cast-align -MT ovsdb/ovsdb_libovsdb_la-table.lo -MD -MP -MF ovsdb/.deps/ovsdb_libovsdb_la-table.Tpo -c ovsdb/table.c -o ovsdb/ovsdb_libovsdb_la-table.o\n'
2017-12-13 10:21:02,048 [DEBUG] yardstick.ssh.kvm.LF-1d3ec479 ssh.py:294 stdout: u'mv -f ovsdb/.deps/ovsdb_libovsdb_la-table.Tpo ovsdb/.deps/ovsdb_libovsdb_la-table.Plo\n'
2017-12-13 10:21:02,049 [DEBUG] yardstick.ssh.kvm.LF-1d3ec479 ssh.py:294 stdout: u"/bin/sh ./libtool  --tag=CC   --mode=compile gcc -std=gnu99 -DHAVE_CONFIG_H -I.    -I ./include -I ./include -I ./lib -I ./lib    -Wstrict-prototypes -Wall -Wextra -Wno-sign-compare -Wpointer-arith -Wswitch-enum -Wunused-parameter -Wbad-function-cast -Wcast-align -Wmissing-prototypes -Wmissing-field-initializers -fno-strict-aliasing -mssse3 -I../../dpdk/dpdk/x86_64-native-linuxapp-gcc/include -D_FILE_OFFSET_BITS=64  -g -O2 -Wno-cast-align -MT ovsdb/ovsdb_libovsdb_la-trigger.lo -MD -MP -MF ovsdb/.deps/ovsdb_libovsdb_la-trigger.Tpo -c -o ovsdb/ovsdb_libovsdb_la-trigger.lo `test -f 'ovsdb/trigger.c' || echo './'`ovsdb/trigger.c\n"
2017-12-13 10:21:02,069 [DEBUG] yardstick.ssh.kvm.LF-1d3ec479 ssh.py:294 stdout: u'libtool: compile:  gcc -std=gnu99 -DHAVE_CONFIG_H -I. -I ./include -I ./include -I ./lib -I ./lib -Wstrict-prototypes -Wall -Wextra -Wno-sign-compare -Wpointer-arith -Wswitch-enum -Wunused-parameter -Wbad-function-cast -Wcast-align -Wmissing-prototypes -Wmissing-field-initializers -fno-strict-aliasing -mssse3 -I../../dpdk/dpdk/x86_64-native-linuxapp-gcc/include -D_FILE_OFFSET_BITS=64 -g -O2 -Wno-cast-align -MT ovsdb/ovsdb_libovsdb_la-trigger.lo -MD -MP -MF ovsdb/.deps/ovsdb_libovsdb_la-trigger.Tpo -c ovsdb/trigger.c -o ovsdb/ovsdb_libovsdb_la-trigger.o\n'
2017-12-13 10:21:02,139 [DEBUG] yardstick.ssh.kvm.LF-1d3ec479 ssh.py:294 stdout: u'mv -f ovsdb/.deps/ovsdb_libovsdb_la-trigger.Tpo ovsdb/.deps/ovsdb_libovsdb_la-trigger.Plo\n'
2017-12-13 10:21:02,140 [DEBUG] yardstick.ssh.kvm.LF-1d3ec479 ssh.py:294 stdout: u"/bin/sh ./libtool  --tag=CC   --mode=compile gcc -std=gnu99 -DHAVE_CONFIG_H -I.    -I ./include -I ./include -I ./lib -I ./lib    -Wstrict-prototypes -Wall -Wextra -Wno-sign-compare -Wpointer-arith -Wswitch-enum -Wunused-parameter -Wbad-function-cast -Wcast-align -Wmissing-prototypes -Wmissing-field-initializers -fno-strict-aliasing -mssse3 -I../../dpdk/dpdk/x86_64-native-linuxapp-gcc/include -D_FILE_OFFSET_BITS=64  -g -O2 -Wno-cast-align -MT ovsdb/ovsdb_libovsdb_la-transaction.lo -MD -MP -MF ovsdb/.deps/ovsdb_libovsdb_la-transaction.Tpo -c -o ovsdb/ovsdb_libovsdb_la-transaction.lo `test -f 'ovsdb/transaction.c' || echo './'`ovsdb/transaction.c\n"
2017-12-13 10:21:02,160 [DEBUG] yardstick.ssh.kvm.LF-1d3ec479 ssh.py:294 stdout: u'libtool: compile:  gcc -std=gnu99 -DHAVE_CONFIG_H -I. -I ./include -I ./include -I ./lib -I ./lib -Wstrict-prototypes -Wall -Wextra -Wno-sign-compare -Wpointer-arith -Wswitch-enum -Wunused-parameter -Wbad-function-cast -Wcast-align -Wmissing-prototypes -Wmissing-field-initializers -fno-strict-aliasing -mssse3 -I../../dpdk/dpdk/x86_64-native-linuxapp-gcc/include -D_FILE_OFFSET_BITS=64 -g -O2 -Wno-cast-align -MT ovsdb/ovsdb_libovsdb_la-transaction.lo -MD -MP -MF ovsdb/.deps/ovsdb_libovsdb_la-transaction.Tpo -c ovsdb/transaction.c -o ovsdb/ovsdb_libovsdb_la-transaction.o\n'
2017-12-13 10:21:02,591 [DEBUG] yardstick.ssh.kvm.LF-1d3ec479 ssh.py:294 stdout: u'mv -f ovsdb/.deps/ovsdb_libovsdb_la-transaction.Tpo ovsdb/.deps/ovsdb_libovsdb_la-transaction.Plo\n'
2017-12-13 10:21:02,592 [DEBUG] yardstick.ssh.kvm.LF-1d3ec479 ssh.py:294 stdout: u'/bin/sh ./libtool  --tag=CC   --mode=link gcc -std=gnu99 -Wstrict-prototypes -Wall -Wextra -Wno-sign-compare -Wpointer-arith -Wswitch-enum -Wunused-parameter -Wbad-function-cast -Wcast-align -Wmissing-prototypes -Wmissing-field-initializers -fno-strict-aliasing -mssse3 -I../../dpdk/dpdk/x86_64-native-linuxapp-gcc/include -D_FILE_OFFSET_BITS=64  -g -O2 -Wno-cast-align -version-info 1:0:0 -Wl,--version-script=./ovsdb/libovsdb.sym  -L../../dpdk/dpdk/x86_64-native-linuxapp-gcc/lib   -o ovsdb/libovsdb.la -rpath /usr/local/lib ovsdb/ovsdb_libovsdb_la-column.lo ovsdb/ovsdb_libovsdb_la-condition.lo ovsdb/ovsdb_libovsdb_la-execution.lo ovsdb/ovsdb_libovsdb_la-file.lo ovsdb/ovsdb_libovsdb_la-jsonrpc-server.lo ovsdb/ovsdb_libovsdb_la-log.lo ovsdb/ovsdb_libovsdb_la-mutation.lo ovsdb/ovsdb_libovsdb_la-ovsdb.lo ovsdb/ovsdb_libovsdb_la-monitor.lo ovsdb/ovsdb_libovsdb_la-query.lo ovsdb/ovsdb_libovsdb_la-replication.lo ovsdb/ovsdb_libovsdb_la-row.lo ovsdb/ovsdb_libovsdb_la-server.lo ovsdb/ovsdb_libovsdb_la-table.lo ovsdb/ovsdb_libovsdb_la-trigger.lo ovsdb/ovsdb_libovsdb_la-transaction.lo  -ldpdk -ldl -lnuma -lpthread -lrt -lm  -lnuma\n'
2017-12-13 10:21:02,659 [DEBUG] yardstick.ssh.kvm.LF-1d3ec479 ssh.py:294 stdout: u'libtool: link: rm -fr  ovsdb/.libs/libovsdb.a ovsdb/.libs/libovsdb.la ovsdb/.libs/libovsdb.lai\n'
2017-12-13 10:21:02,666 [DEBUG] yardstick.ssh.kvm.LF-1d3ec479 ssh.py:294 stdout: u'libtool: link: ar cru ovsdb/.libs/libovsdb.a  ovsdb/ovsdb_libovsdb_la-column.o ovsdb/ovsdb_libovsdb_la-condition.o ovsdb/ovsdb_libovsdb_la-execution.o ovsdb/ovsdb_libovsdb_la-file.o ovsdb/ovsdb_libovsdb_la-jsonrpc-server.o ovsdb/ovsdb_libovsdb_la-log.o ovsdb/ovsdb_libovsdb_la-mutation.o ovsdb/ovsdb_libovsdb_la-ovsdb.o ovsdb/ovsdb_libovsdb_la-monitor.o ovsdb/ovsdb_libovsdb_la-query.o ovsdb/ovsdb_libovsdb_la-replication.o ovsdb/ovsdb_libovsdb_la-row.o ovsdb/ovsdb_libovsdb_la-server.o ovsdb/ovsdb_libovsdb_la-table.o ovsdb/ovsdb_libovsdb_la-trigger.o ovsdb/ovsdb_libovsdb_la-transaction.o\n'
2017-12-13 10:21:02,671 [DEBUG] yardstick.ssh.kvm.LF-1d3ec479 ssh.py:294 stdout: u'libtool: link: ranlib ovsdb/.libs/libovsdb.a\n'
2017-12-13 10:21:02,684 [DEBUG] yardstick.ssh.kvm.LF-1d3ec479 ssh.py:294 stdout: u'libtool: link: ( cd "ovsdb/.libs" && rm -f "libovsdb.la" && ln -s "../libovsdb.la" "libovsdb.la" )\n'
2017-12-13 10:21:02,687 [DEBUG] yardstick.ssh.kvm.LF-1d3ec479 ssh.py:294 stdout: u"depbase=`echo vtep/vtep-idl.lo | sed 's|[^/]*$|.deps/&|;s|\\.lo$||'`;\\\n/bin/sh ./libtool  --tag=CC   --mode=compile gcc -std=gnu99 -DHAVE_CONFIG_H -I.    -I ./include -I ./include -I ./lib -I ./lib    -Wstrict-prototypes -Wall -Wextra -Wno-sign-compare -Wpointer-arith -Wswitch-enum -Wunused-parameter -Wbad-function-cast -Wcast-align -Wmissing-prototypes -Wmissing-field-initializers -fno-strict-aliasing -mssse3 -I../../dpdk/dpdk/x86_64-native-linuxapp-gcc/include -D_FILE_OFFSET_BITS=64  -g -O2 -Wno-cast-align -MT vtep/vtep-idl.lo -MD -MP -MF $depbase.Tpo -c -o vtep/vtep-idl.lo vtep/vtep-idl.c &&\\\nmv -f $depbase.Tpo $depbase.Plo\n"
2017-12-13 10:21:02,708 [DEBUG] yardstick.ssh.kvm.LF-1d3ec479 ssh.py:294 stdout: u'libtool: compile:  gcc -std=gnu99 -DHAVE_CONFIG_H -I. -I ./include -I ./include -I ./lib -I ./lib -Wstrict-prototypes -Wall -Wextra -Wno-sign-compare -Wpointer-arith -Wswitch-enum -Wunused-parameter -Wbad-function-cast -Wcast-align -Wmissing-prototypes -Wmissing-field-initializers -fno-strict-aliasing -mssse3 -I../../dpdk/dpdk/x86_64-native-linuxapp-gcc/include -D_FILE_OFFSET_BITS=64 -g -O2 -Wno-cast-align -MT vtep/vtep-idl.lo -MD -MP -MF vtep/.deps/vtep-idl.Tpo -c vtep/vtep-idl.c -o vtep/vtep-idl.o\n'
2017-12-13 10:21:06,616 [DEBUG] yardstick.ssh.kvm.LF-1d3ec479 ssh.py:294 stdout: u'/bin/sh ./libtool  --tag=CC   --mode=link gcc -std=gnu99 -Wstrict-prototypes -Wall -Wextra -Wno-sign-compare -Wpointer-arith -Wswitch-enum -Wunused-parameter -Wbad-function-cast -Wcast-align -Wmissing-prototypes -Wmissing-field-initializers -fno-strict-aliasing -mssse3 -I../../dpdk/dpdk/x86_64-native-linuxapp-gcc/include -D_FILE_OFFSET_BITS=64  -g -O2 -Wno-cast-align -version-info 1:0:0 -Wl,--version-script=./vtep/libvtep.sym  -L../../dpdk/dpdk/x86_64-native-linuxapp-gcc/lib   -o vtep/libvtep.la -rpath /usr/local/lib vtep/vtep-idl.lo  -ldpdk -ldl -lnuma -lpthread -lrt -lm  -lnuma\n'
2017-12-13 10:21:06,677 [DEBUG] yardstick.ssh.kvm.LF-1d3ec479 ssh.py:294 stdout: u'libtool: link: rm -fr  vtep/.libs/libvtep.a vtep/.libs/libvtep.la vtep/.libs/libvtep.lai\n'
2017-12-13 10:21:06,683 [DEBUG] yardstick.ssh.kvm.LF-1d3ec479 ssh.py:294 stdout: u'libtool: link: ar cru vtep/.libs/libvtep.a  vtep/vtep-idl.o\n'
2017-12-13 10:21:06,688 [DEBUG] yardstick.ssh.kvm.LF-1d3ec479 ssh.py:294 stdout: u'libtool: link: ranlib vtep/.libs/libvtep.a\n'
2017-12-13 10:21:06,700 [DEBUG] yardstick.ssh.kvm.LF-1d3ec479 ssh.py:294 stdout: u'libtool: link: ( cd "vtep/.libs" && rm -f "libvtep.la" && ln -s "../libvtep.la" "libvtep.la" )\n'
2017-12-13 10:21:06,703 [DEBUG] yardstick.ssh.kvm.LF-1d3ec479 ssh.py:294 stdout: u"depbase=`echo ovn/lib/actions.lo | sed 's|[^/]*$|.deps/&|;s|\\.lo$||'`;\\\n/bin/sh ./libtool  --tag=CC   --mode=compile gcc -std=gnu99 -DHAVE_CONFIG_H -I.    -I ./include -I ./include -I ./lib -I ./lib    -Wstrict-prototypes -Wall -Wextra -Wno-sign-compare -Wpointer-arith -Wswitch-enum -Wunused-parameter -Wbad-function-cast -Wcast-align -Wmissing-prototypes -Wmissing-field-initializers -fno-strict-aliasing -mssse3 -I../../dpdk/dpdk/x86_64-native-linuxapp-gcc/include -D_FILE_OFFSET_BITS=64  -g -O2 -Wno-cast-align -MT ovn/lib/actions.lo -MD -MP -MF $depbase.Tpo -c -o ovn/lib/actions.lo ovn/lib/actions.c &&\\\nmv -f $depbase.Tpo $depbase.Plo\n"
2017-12-13 10:21:06,724 [DEBUG] yardstick.ssh.kvm.LF-1d3ec479 ssh.py:294 stdout: u'libtool: compile:  gcc -std=gnu99 -DHAVE_CONFIG_H -I. -I ./include -I ./include -I ./lib -I ./lib -Wstrict-prototypes -Wall -Wextra -Wno-sign-compare -Wpointer-arith -Wswitch-enum -Wunused-parameter -Wbad-function-cast -Wcast-align -Wmissing-prototypes -Wmissing-field-initializers -fno-strict-aliasing -mssse3 -I../../dpdk/dpdk/x86_64-native-linuxapp-gcc/include -D_FILE_OFFSET_BITS=64 -g -O2 -Wno-cast-align -MT ovn/lib/actions.lo -MD -MP -MF ovn/lib/.deps/actions.Tpo -c ovn/lib/actions.c -o ovn/lib/actions.o\n'
2017-12-13 10:21:07,361 [DEBUG] yardstick.ssh.kvm.LF-1d3ec479 ssh.py:294 stdout: u"depbase=`echo ovn/lib/expr.lo | sed 's|[^/]*$|.deps/&|;s|\\.lo$||'`;\\\n/bin/sh ./libtool  --tag=CC   --mode=compile gcc -std=gnu99 -DHAVE_CONFIG_H -I.    -I ./include -I ./include -I ./lib -I ./lib    -Wstrict-prototypes -Wall -Wextra -Wno-sign-compare -Wpointer-arith -Wswitch-enum -Wunused-parameter -Wbad-function-cast -Wcast-align -Wmissing-prototypes -Wmissing-field-initializers -fno-strict-aliasing -mssse3 -I../../dpdk/dpdk/x86_64-native-linuxapp-gcc/include -D_FILE_OFFSET_BITS=64  -g -O2 -Wno-cast-align -MT ovn/lib/expr.lo -MD -MP -MF $depbase.Tpo -c -o ovn/lib/expr.lo ovn/lib/expr.c &&\\\nmv -f $depbase.Tpo $depbase.Plo\n"
2017-12-13 10:21:07,382 [DEBUG] yardstick.ssh.kvm.LF-1d3ec479 ssh.py:294 stdout: u'libtool: compile:  gcc -std=gnu99 -DHAVE_CONFIG_H -I. -I ./include -I ./include -I ./lib -I ./lib -Wstrict-prototypes -Wall -Wextra -Wno-sign-compare -Wpointer-arith -Wswitch-enum -Wunused-parameter -Wbad-function-cast -Wcast-align -Wmissing-prototypes -Wmissing-field-initializers -fno-strict-aliasing -mssse3 -I../../dpdk/dpdk/x86_64-native-linuxapp-gcc/include -D_FILE_OFFSET_BITS=64 -g -O2 -Wno-cast-align -MT ovn/lib/expr.lo -MD -MP -MF ovn/lib/.deps/expr.Tpo -c ovn/lib/expr.c -o ovn/lib/expr.o\n'
2017-12-13 10:21:08,366 [DEBUG] yardstick.ssh.kvm.LF-1d3ec479 ssh.py:294 stdout: u"depbase=`echo ovn/lib/lex.lo | sed 's|[^/]*$|.deps/&|;s|\\.lo$||'`;\\\n/bin/sh ./libtool  --tag=CC   --mode=compile gcc -std=gnu99 -DHAVE_CONFIG_H -I.    -I ./include -I ./include -I ./lib -I ./lib    -Wstrict-prototypes -Wall -Wextra -Wno-sign-compare -Wpointer-arith -Wswitch-enum -Wunused-parameter -Wbad-function-cast -Wcast-align -Wmissing-prototypes -Wmissing-field-initializers -fno-strict-aliasing -mssse3 -I../../dpdk/dpdk/x86_64-native-linuxapp-gcc/include -D_FILE_OFFSET_BITS=64  -g -O2 -Wno-cast-align -MT ovn/lib/lex.lo -MD -MP -MF $depbase.Tpo -c -o ovn/lib/lex.lo ovn/lib/lex.c &&\\\nmv -f $depbase.Tpo $depbase.Plo\n"
2017-12-13 10:21:08,386 [DEBUG] yardstick.ssh.kvm.LF-1d3ec479 ssh.py:294 stdout: u'libtool: compile:  gcc -std=gnu99 -DHAVE_CONFIG_H -I. -I ./include -I ./include -I ./lib -I ./lib -Wstrict-prototypes -Wall -Wextra -Wno-sign-compare -Wpointer-arith -Wswitch-enum -Wunused-parameter -Wbad-function-cast -Wcast-align -Wmissing-prototypes -Wmissing-field-initializers -fno-strict-aliasing -mssse3 -I../../dpdk/dpdk/x86_64-native-linuxapp-gcc/include -D_FILE_OFFSET_BITS=64 -g -O2 -Wno-cast-align -MT ovn/lib/lex.lo -MD -MP -MF ovn/lib/.deps/lex.Tpo -c ovn/lib/lex.c -o ovn/lib/lex.o\n'
2017-12-13 10:21:08,688 [DEBUG] yardstick.ssh.kvm.LF-1d3ec479 ssh.py:294 stdout: u"depbase=`echo ovn/lib/ovn-util.lo | sed 's|[^/]*$|.deps/&|;s|\\.lo$||'`;\\\n/bin/sh ./libtool  --tag=CC   --mode=compile gcc -std=gnu99 -DHAVE_CONFIG_H -I.    -I ./include -I ./include -I ./lib -I ./lib    -Wstrict-prototypes -Wall -Wextra -Wno-sign-compare -Wpointer-arith -Wswitch-enum -Wunused-parameter -Wbad-function-cast -Wcast-align -Wmissing-prototypes -Wmissing-field-initializers -fno-strict-aliasing -mssse3 -I../../dpdk/dpdk/x86_64-native-linuxapp-gcc/include -D_FILE_OFFSET_BITS=64  -g -O2 -Wno-cast-align -MT ovn/lib/ovn-util.lo -MD -MP -MF $depbase.Tpo -c -o ovn/lib/ovn-util.lo ovn/lib/ovn-util.c &&\\\nmv -f $depbase.Tpo $depbase.Plo\n"
2017-12-13 10:21:08,709 [DEBUG] yardstick.ssh.kvm.LF-1d3ec479 ssh.py:294 stdout: u'libtool: compile:  gcc -std=gnu99 -DHAVE_CONFIG_H -I. -I ./include -I ./include -I ./lib -I ./lib -Wstrict-prototypes -Wall -Wextra -Wno-sign-compare -Wpointer-arith -Wswitch-enum -Wunused-parameter -Wbad-function-cast -Wcast-align -Wmissing-prototypes -Wmissing-field-initializers -fno-strict-aliasing -mssse3 -I../../dpdk/dpdk/x86_64-native-linuxapp-gcc/include -D_FILE_OFFSET_BITS=64 -g -O2 -Wno-cast-align -MT ovn/lib/ovn-util.lo -MD -MP -MF ovn/lib/.deps/ovn-util.Tpo -c ovn/lib/ovn-util.c -o ovn/lib/ovn-util.o\n'
2017-12-13 10:21:08,865 [DEBUG] yardstick.ssh.kvm.LF-1d3ec479 ssh.py:294 stdout: u"depbase=`echo ovn/lib/logical-fields.lo | sed 's|[^/]*$|.deps/&|;s|\\.lo$||'`;\\\n/bin/sh ./libtool  --tag=CC   --mode=compile gcc -std=gnu99 -DHAVE_CONFIG_H -I.    -I ./include -I ./include -I ./lib -I ./lib    -Wstrict-prototypes -Wall -Wextra -Wno-sign-compare -Wpointer-arith -Wswitch-enum -Wunused-parameter -Wbad-function-cast -Wcast-align -Wmissing-prototypes -Wmissing-field-initializers -fno-strict-aliasing -mssse3 -I../../dpdk/dpdk/x86_64-native-linuxapp-gcc/include -D_FILE_OFFSET_BITS=64  -g -O2 -Wno-cast-align -MT ovn/lib/logical-fields.lo -MD -MP -MF $depbase.Tpo -c -o ovn/lib/logical-fields.lo ovn/lib/logical-fields.c &&\\\nmv -f $depbase.Tpo $depbase.Plo\n"
2017-12-13 10:21:08,886 [DEBUG] yardstick.ssh.kvm.LF-1d3ec479 ssh.py:294 stdout: u'libtool: compile:  gcc -std=gnu99 -DHAVE_CONFIG_H -I. -I ./include -I ./include -I ./lib -I ./lib -Wstrict-prototypes -Wall -Wextra -Wno-sign-compare -Wpointer-arith -Wswitch-enum -Wunused-parameter -Wbad-function-cast -Wcast-align -Wmissing-prototypes -Wmissing-field-initializers -fno-strict-aliasing -mssse3 -I../../dpdk/dpdk/x86_64-native-linuxapp-gcc/include -D_FILE_OFFSET_BITS=64 -g -O2 -Wno-cast-align -MT ovn/lib/logical-fields.lo -MD -MP -MF ovn/lib/.deps/logical-fields.Tpo -c ovn/lib/logical-fields.c -o ovn/lib/logical-fields.o\n'
2017-12-13 10:21:08,996 [DEBUG] yardstick.ssh.kvm.LF-1d3ec479 ssh.py:294 stdout: u"depbase=`echo ovn/lib/ovn-nb-idl.lo | sed 's|[^/]*$|.deps/&|;s|\\.lo$||'`;\\\n/bin/sh ./libtool  --tag=CC   --mode=compile gcc -std=gnu99 -DHAVE_CONFIG_H -I.    -I ./include -I ./include -I ./lib -I ./lib    -Wstrict-prototypes -Wall -Wextra -Wno-sign-compare -Wpointer-arith -Wswitch-enum -Wunused-parameter -Wbad-function-cast -Wcast-align -Wmissing-prototypes -Wmissing-field-initializers -fno-strict-aliasing -mssse3 -I../../dpdk/dpdk/x86_64-native-linuxapp-gcc/include -D_FILE_OFFSET_BITS=64  -g -O2 -Wno-cast-align -MT ovn/lib/ovn-nb-idl.lo -MD -MP -MF $depbase.Tpo -c -o ovn/lib/ovn-nb-idl.lo ovn/lib/ovn-nb-idl.c &&\\\nmv -f $depbase.Tpo $depbase.Plo\n"
2017-12-13 10:21:09,017 [DEBUG] yardstick.ssh.kvm.LF-1d3ec479 ssh.py:294 stdout: u'libtool: compile:  gcc -std=gnu99 -DHAVE_CONFIG_H -I. -I ./include -I ./include -I ./lib -I ./lib -Wstrict-prototypes -Wall -Wextra -Wno-sign-compare -Wpointer-arith -Wswitch-enum -Wunused-parameter -Wbad-function-cast -Wcast-align -Wmissing-prototypes -Wmissing-field-initializers -fno-strict-aliasing -mssse3 -I../../dpdk/dpdk/x86_64-native-linuxapp-gcc/include -D_FILE_OFFSET_BITS=64 -g -O2 -Wno-cast-align -MT ovn/lib/ovn-nb-idl.lo -MD -MP -MF ovn/lib/.deps/ovn-nb-idl.Tpo -c ovn/lib/ovn-nb-idl.c -o ovn/lib/ovn-nb-idl.o\n'
2017-12-13 10:21:11,720 [DEBUG] yardstick.ssh.kvm.LF-1d3ec479 ssh.py:294 stdout: u"depbase=`echo ovn/lib/ovn-sb-idl.lo | sed 's|[^/]*$|.deps/&|;s|\\.lo$||'`;\\\n/bin/sh ./libtool  --tag=CC   --mode=compile gcc -std=gnu99 -DHAVE_CONFIG_H -I.    -I ./include -I ./include -I ./lib -I ./lib    -Wstrict-prototypes -Wall -Wextra -Wno-sign-compare -Wpointer-arith -Wswitch-enum -Wunused-parameter -Wbad-function-cast -Wcast-align -Wmissing-prototypes -Wmissing-field-initializers -fno-strict-aliasing -mssse3 -I../../dpdk/dpdk/x86_64-native-linuxapp-gcc/include -D_FILE_OFFSET_BITS=64  -g -O2 -Wno-cast-align -MT ovn/lib/ovn-sb-idl.lo -MD -MP -MF $depbase.Tpo -c -o ovn/lib/ovn-sb-idl.lo ovn/lib/ovn-sb-idl.c &&\\\nmv -f $depbase.Tpo $depbase.Plo\n"
2017-12-13 10:21:11,742 [DEBUG] yardstick.ssh.kvm.LF-1d3ec479 ssh.py:294 stdout: u'libtool: compile:  gcc -std=gnu99 -DHAVE_CONFIG_H -I. -I ./include -I ./include -I ./lib -I ./lib -Wstrict-prototypes -Wall -Wextra -Wno-sign-compare -Wpointer-arith -Wswitch-enum -Wunused-parameter -Wbad-function-cast -Wcast-align -Wmissing-prototypes -Wmissing-field-initializers -fno-strict-aliasing -mssse3 -I../../dpdk/dpdk/x86_64-native-linuxapp-gcc/include -D_FILE_OFFSET_BITS=64 -g -O2 -Wno-cast-align -MT ovn/lib/ovn-sb-idl.lo -MD -MP -MF ovn/lib/.deps/ovn-sb-idl.Tpo -c ovn/lib/ovn-sb-idl.c -o ovn/lib/ovn-sb-idl.o\n'
2017-12-13 10:21:13,496 [DEBUG] yardstick.ssh.kvm.LF-1d3ec479 ssh.py:294 stdout: u'/bin/sh ./libtool  --tag=CC   --mode=link gcc -std=gnu99 -Wstrict-prototypes -Wall -Wextra -Wno-sign-compare -Wpointer-arith -Wswitch-enum -Wunused-parameter -Wbad-function-cast -Wcast-align -Wmissing-prototypes -Wmissing-field-initializers -fno-strict-aliasing -mssse3 -I../../dpdk/dpdk/x86_64-native-linuxapp-gcc/include -D_FILE_OFFSET_BITS=64  -g -O2 -Wno-cast-align -version-info 1:0:0 -Wl,--version-script=./ovn/lib/libovn.sym  -L../../dpdk/dpdk/x86_64-native-linuxapp-gcc/lib   -o ovn/lib/libovn.la -rpath /usr/local/lib ovn/lib/actions.lo ovn/lib/expr.lo ovn/lib/lex.lo ovn/lib/ovn-util.lo ovn/lib/logical-fields.lo ovn/lib/ovn-nb-idl.lo ovn/lib/ovn-sb-idl.lo  -ldpdk -ldl -lnuma -lpthread -lrt -lm  -lnuma\n'
2017-12-13 10:21:13,559 [DEBUG] yardstick.ssh.kvm.LF-1d3ec479 ssh.py:294 stdout: u'libtool: link: rm -fr  ovn/lib/.libs/libovn.a ovn/lib/.libs/libovn.la ovn/lib/.libs/libovn.lai\n'
2017-12-13 10:21:13,566 [DEBUG] yardstick.ssh.kvm.LF-1d3ec479 ssh.py:294 stdout: u'libtool: link: ar cru ovn/lib/.libs/libovn.a  ovn/lib/actions.o ovn/lib/expr.o ovn/lib/lex.o ovn/lib/ovn-util.o ovn/lib/logical-fields.o ovn/lib/ovn-nb-idl.o ovn/lib/ovn-sb-idl.o\n'
2017-12-13 10:21:13,573 [DEBUG] yardstick.ssh.kvm.LF-1d3ec479 ssh.py:294 stdout: u'libtool: link: ranlib ovn/lib/.libs/libovn.a\n'
2017-12-13 10:21:13,587 [DEBUG] yardstick.ssh.kvm.LF-1d3ec479 ssh.py:294 stdout: u'libtool: link: ( cd "ovn/lib/.libs" && rm -f "libovn.la" && ln -s "../libovn.la" "libovn.la" )\n'
2017-12-13 10:21:13,590 [DEBUG] yardstick.ssh.kvm.LF-1d3ec479 ssh.py:294 stdout: u"depbase=`echo utilities/ovs-appctl.o | sed 's|[^/]*$|.deps/&|;s|\\.o$||'`;\\\ngcc -std=gnu99 -DHAVE_CONFIG_H -I.    -I ./include -I ./include -I ./lib -I ./lib    -Wstrict-prototypes -Wall -Wextra -Wno-sign-compare -Wpointer-arith -Wswitch-enum -Wunused-parameter -Wbad-function-cast -Wcast-align -Wmissing-prototypes -Wmissing-field-initializers -fno-strict-aliasing -mssse3 -I../../dpdk/dpdk/x86_64-native-linuxapp-gcc/include -D_FILE_OFFSET_BITS=64  -g -O2 -Wno-cast-align -MT utilities/ovs-appctl.o -MD -MP -MF $depbase.Tpo -c -o utilities/ovs-appctl.o utilities/ovs-appctl.c &&\\\nmv -f $depbase.Tpo $depbase.Po\n"
2017-12-13 10:21:13,694 [DEBUG] yardstick.ssh.kvm.LF-1d3ec479 ssh.py:294 stdout: u'/bin/sh ./libtool  --tag=CC   --mode=link gcc -std=gnu99 -Wstrict-prototypes -Wall -Wextra -Wno-sign-compare -Wpointer-arith -Wswitch-enum -Wunused-parameter -Wbad-function-cast -Wcast-align -Wmissing-prototypes -Wmissing-field-initializers -fno-strict-aliasing -mssse3 -I../../dpdk/dpdk/x86_64-native-linuxapp-gcc/include -D_FILE_OFFSET_BITS=64  -g -O2 -Wno-cast-align  -L../../dpdk/dpdk/x86_64-native-linuxapp-gcc/lib   -o utilities/ovs-appctl utilities/ovs-appctl.o lib/libopenvswitch.la -ldpdk -ldl -lnuma -lpthread -lrt -lm  -lnuma\n'
2017-12-13 10:21:13,767 [DEBUG] yardstick.ssh.kvm.LF-1d3ec479 ssh.py:294 stdout: u'libtool: link: gcc -std=gnu99 -Wstrict-prototypes -Wall -Wextra -Wno-sign-compare -Wpointer-arith -Wswitch-enum -Wunused-parameter -Wbad-function-cast -Wcast-align -Wmissing-prototypes -Wmissing-field-initializers -fno-strict-aliasing -mssse3 -I../../dpdk/dpdk/x86_64-native-linuxapp-gcc/include -D_FILE_OFFSET_BITS=64 -g -O2 -Wno-cast-align -o utilities/ovs-appctl utilities/ovs-appctl.o  -L../../dpdk/dpdk/x86_64-native-linuxapp-gcc/lib lib/.libs/libopenvswitch.a -lssl -lcrypto -ldpdk -ldl -lpthread -lrt -lm -lnuma\n'
2017-12-13 10:21:13,998 [DEBUG] yardstick.ssh.kvm.LF-1d3ec479 ssh.py:294 stdout: u"depbase=`echo utilities/ovs-testcontroller.o | sed 's|[^/]*$|.deps/&|;s|\\.o$||'`;\\\ngcc -std=gnu99 -DHAVE_CONFIG_H -I.    -I ./include -I ./include -I ./lib -I ./lib    -Wstrict-prototypes -Wall -Wextra -Wno-sign-compare -Wpointer-arith -Wswitch-enum -Wunused-parameter -Wbad-function-cast -Wcast-align -Wmissing-prototypes -Wmissing-field-initializers -fno-strict-aliasing -mssse3 -I../../dpdk/dpdk/x86_64-native-linuxapp-gcc/include -D_FILE_OFFSET_BITS=64  -g -O2 -Wno-cast-align -MT utilities/ovs-testcontroller.o -MD -MP -MF $depbase.Tpo -c -o utilities/ovs-testcontroller.o utilities/ovs-testcontroller.c &&\\\nmv -f $depbase.Tpo $depbase.Po\n"
2017-12-13 10:21:14,163 [DEBUG] yardstick.ssh.kvm.LF-1d3ec479 ssh.py:294 stdout: u'/bin/sh ./libtool  --tag=CC   --mode=link gcc -std=gnu99 -Wstrict-prototypes -Wall -Wextra -Wno-sign-compare -Wpointer-arith -Wswitch-enum -Wunused-parameter -Wbad-function-cast -Wcast-align -Wmissing-prototypes -Wmissing-field-initializers -fno-strict-aliasing -mssse3 -I../../dpdk/dpdk/x86_64-native-linuxapp-gcc/include -D_FILE_OFFSET_BITS=64  -g -O2 -Wno-cast-align  -L../../dpdk/dpdk/x86_64-native-linuxapp-gcc/lib   -o utilities/ovs-testcontroller utilities/ovs-testcontroller.o lib/libopenvswitch.la -lssl -lcrypto   -ldpdk -ldl -lnuma -lpthread -lrt -lm  -lnuma\n'
2017-12-13 10:21:14,237 [DEBUG] yardstick.ssh.kvm.LF-1d3ec479 ssh.py:294 stdout: u'libtool: link: gcc -std=gnu99 -Wstrict-prototypes -Wall -Wextra -Wno-sign-compare -Wpointer-arith -Wswitch-enum -Wunused-parameter -Wbad-function-cast -Wcast-align -Wmissing-prototypes -Wmissing-field-initializers -fno-strict-aliasing -mssse3 -I../../dpdk/dpdk/x86_64-native-linuxapp-gcc/include -D_FILE_OFFSET_BITS=64 -g -O2 -Wno-cast-align -o utilities/ovs-testcontroller utilities/ovs-testcontroller.o  -L../../dpdk/dpdk/x86_64-native-linuxapp-gcc/lib lib/.libs/libopenvswitch.a -lssl -lcrypto -ldpdk -ldl -lpthread -lrt -lm -lnuma\n'
2017-12-13 10:21:14,471 [DEBUG] yardstick.ssh.kvm.LF-1d3ec479 ssh.py:294 stdout: u"depbase=`echo utilities/ovs-dpctl.o | sed 's|[^/]*$|.deps/&|;s|\\.o$||'`;\\\ngcc -std=gnu99 -DHAVE_CONFIG_H -I.    -I ./include -I ./include -I ./lib -I ./lib    -Wstrict-prototypes -Wall -Wextra -Wno-sign-compare -Wpointer-arith -Wswitch-enum -Wunused-parameter -Wbad-function-cast -Wcast-align -Wmissing-prototypes -Wmissing-field-initializers -fno-strict-aliasing -mssse3 -I../../dpdk/dpdk/x86_64-native-linuxapp-gcc/include -D_FILE_OFFSET_BITS=64  -g -O2 -Wno-cast-align -MT utilities/ovs-dpctl.o -MD -MP -MF $depbase.Tpo -c -o utilities/ovs-dpctl.o utilities/ovs-dpctl.c &&\\\nmv -f $depbase.Tpo $depbase.Po\n"
2017-12-13 10:21:14,582 [DEBUG] yardstick.ssh.kvm.LF-1d3ec479 ssh.py:294 stdout: u'/bin/sh ./libtool  --tag=CC   --mode=link gcc -std=gnu99 -Wstrict-prototypes -Wall -Wextra -Wno-sign-compare -Wpointer-arith -Wswitch-enum -Wunused-parameter -Wbad-function-cast -Wcast-align -Wmissing-prototypes -Wmissing-field-initializers -fno-strict-aliasing -mssse3 -I../../dpdk/dpdk/x86_64-native-linuxapp-gcc/include -D_FILE_OFFSET_BITS=64  -g -O2 -Wno-cast-align  -L../../dpdk/dpdk/x86_64-native-linuxapp-gcc/lib   -o utilities/ovs-dpctl utilities/ovs-dpctl.o lib/libopenvswitch.la -ldpdk -ldl -lnuma -lpthread -lrt -lm  -lnuma\n'
2017-12-13 10:21:14,655 [DEBUG] yardstick.ssh.kvm.LF-1d3ec479 ssh.py:294 stdout: u'libtool: link: gcc -std=gnu99 -Wstrict-prototypes -Wall -Wextra -Wno-sign-compare -Wpointer-arith -Wswitch-enum -Wunused-parameter -Wbad-function-cast -Wcast-align -Wmissing-prototypes -Wmissing-field-initializers -fno-strict-aliasing -mssse3 -I../../dpdk/dpdk/x86_64-native-linuxapp-gcc/include -D_FILE_OFFSET_BITS=64 -g -O2 -Wno-cast-align -o utilities/ovs-dpctl utilities/ovs-dpctl.o  -L../../dpdk/dpdk/x86_64-native-linuxapp-gcc/lib lib/.libs/libopenvswitch.a -lssl -lcrypto -ldpdk -ldl -lpthread -lrt -lm -lnuma\n'
2017-12-13 10:21:14,878 [DEBUG] yardstick.ssh.kvm.LF-1d3ec479 ssh.py:294 stdout: u"depbase=`echo utilities/ovs-ofctl.o | sed 's|[^/]*$|.deps/&|;s|\\.o$||'`;\\\ngcc -std=gnu99 -DHAVE_CONFIG_H -I.    -I ./include -I ./include -I ./lib -I ./lib    -Wstrict-prototypes -Wall -Wextra -Wno-sign-compare -Wpointer-arith -Wswitch-enum -Wunused-parameter -Wbad-function-cast -Wcast-align -Wmissing-prototypes -Wmissing-field-initializers -fno-strict-aliasing -mssse3 -I../../dpdk/dpdk/x86_64-native-linuxapp-gcc/include -D_FILE_OFFSET_BITS=64  -g -O2 -Wno-cast-align -MT utilities/ovs-ofctl.o -MD -MP -MF $depbase.Tpo -c -o utilities/ovs-ofctl.o utilities/ovs-ofctl.c &&\\\nmv -f $depbase.Tpo $depbase.Po\n"
2017-12-13 10:21:16,128 [DEBUG] yardstick.ssh.kvm.LF-1d3ec479 ssh.py:294 stdout: u'/bin/sh ./libtool  --tag=CC   --mode=link gcc -std=gnu99 -Wstrict-prototypes -Wall -Wextra -Wno-sign-compare -Wpointer-arith -Wswitch-enum -Wunused-parameter -Wbad-function-cast -Wcast-align -Wmissing-prototypes -Wmissing-field-initializers -fno-strict-aliasing -mssse3 -I../../dpdk/dpdk/x86_64-native-linuxapp-gcc/include -D_FILE_OFFSET_BITS=64  -g -O2 -Wno-cast-align  -L../../dpdk/dpdk/x86_64-native-linuxapp-gcc/lib   -o utilities/ovs-ofctl utilities/ovs-ofctl.o ofproto/libofproto.la lib/libopenvswitch.la -ldpdk -ldl -lnuma -lpthread -lrt -lm  -lnuma\n'
2017-12-13 10:21:16,219 [DEBUG] yardstick.ssh.kvm.LF-1d3ec479 ssh.py:294 stdout: u'libtool: link: gcc -std=gnu99 -Wstrict-prototypes -Wall -Wextra -Wno-sign-compare -Wpointer-arith -Wswitch-enum -Wunused-parameter -Wbad-function-cast -Wcast-align -Wmissing-prototypes -Wmissing-field-initializers -fno-strict-aliasing -mssse3 -I../../dpdk/dpdk/x86_64-native-linuxapp-gcc/include -D_FILE_OFFSET_BITS=64 -g -O2 -Wno-cast-align -o utilities/ovs-ofctl utilities/ovs-ofctl.o  -L../../dpdk/dpdk/x86_64-native-linuxapp-gcc/lib ofproto/.libs/libofproto.a /home/jenkins/vswitchperf/src/ovs/ovs/lib/.libs/libsflow.a lib/.libs/libopenvswitch.a -lssl -lcrypto -ldpdk -ldl -lpthread -lrt -lm -lnuma\n'
2017-12-13 10:21:16,455 [DEBUG] yardstick.ssh.kvm.LF-1d3ec479 ssh.py:294 stdout: u"depbase=`echo utilities/ovs-vsctl.o | sed 's|[^/]*$|.deps/&|;s|\\.o$||'`;\\\ngcc -std=gnu99 -DHAVE_CONFIG_H -I.    -I ./include -I ./include -I ./lib -I ./lib    -Wstrict-prototypes -Wall -Wextra -Wno-sign-compare -Wpointer-arith -Wswitch-enum -Wunused-parameter -Wbad-function-cast -Wcast-align -Wmissing-prototypes -Wmissing-field-initializers -fno-strict-aliasing -mssse3 -I../../dpdk/dpdk/x86_64-native-linuxapp-gcc/include -D_FILE_OFFSET_BITS=64  -g -O2 -Wno-cast-align -MT utilities/ovs-vsctl.o -MD -MP -MF $depbase.Tpo -c -o utilities/ovs-vsctl.o utilities/ovs-vsctl.c &&\\\nmv -f $depbase.Tpo $depbase.Po\n"
2017-12-13 10:21:17,191 [DEBUG] yardstick.ssh.kvm.LF-1d3ec479 ssh.py:294 stdout: u'/bin/sh ./libtool  --tag=CC   --mode=link gcc -std=gnu99 -Wstrict-prototypes -Wall -Wextra -Wno-sign-compare -Wpointer-arith -Wswitch-enum -Wunused-parameter -Wbad-function-cast -Wcast-align -Wmissing-prototypes -Wmissing-field-initializers -fno-strict-aliasing -mssse3 -I../../dpdk/dpdk/x86_64-native-linuxapp-gcc/include -D_FILE_OFFSET_BITS=64  -g -O2 -Wno-cast-align  -L../../dpdk/dpdk/x86_64-native-linuxapp-gcc/lib   -o utilities/ovs-vsctl utilities/ovs-vsctl.o lib/libopenvswitch.la -ldpdk -ldl -lnuma -lpthread -lrt -lm  -lnuma\n'
2017-12-13 10:21:17,265 [DEBUG] yardstick.ssh.kvm.LF-1d3ec479 ssh.py:294 stdout: u'libtool: link: gcc -std=gnu99 -Wstrict-prototypes -Wall -Wextra -Wno-sign-compare -Wpointer-arith -Wswitch-enum -Wunused-parameter -Wbad-function-cast -Wcast-align -Wmissing-prototypes -Wmissing-field-initializers -fno-strict-aliasing -mssse3 -I../../dpdk/dpdk/x86_64-native-linuxapp-gcc/include -D_FILE_OFFSET_BITS=64 -g -O2 -Wno-cast-align -o utilities/ovs-vsctl utilities/ovs-vsctl.o  -L../../dpdk/dpdk/x86_64-native-linuxapp-gcc/lib lib/.libs/libopenvswitch.a -lssl -lcrypto -ldpdk -ldl -lpthread -lrt -lm -lnuma\n'
2017-12-13 10:21:17,529 [DEBUG] yardstick.ssh.kvm.LF-1d3ec479 ssh.py:294 stdout: u"depbase=`echo ovsdb/ovsdb-tool.o | sed 's|[^/]*$|.deps/&|;s|\\.o$||'`;\\\ngcc -std=gnu99 -DHAVE_CONFIG_H -I.    -I ./include -I ./include -I ./lib -I ./lib    -Wstrict-prototypes -Wall -Wextra -Wno-sign-compare -Wpointer-arith -Wswitch-enum -Wunused-parameter -Wbad-function-cast -Wcast-align -Wmissing-prototypes -Wmissing-field-initializers -fno-strict-aliasing -mssse3 -I../../dpdk/dpdk/x86_64-native-linuxapp-gcc/include -D_FILE_OFFSET_BITS=64  -g -O2 -Wno-cast-align -MT ovsdb/ovsdb-tool.o -MD -MP -MF $depbase.Tpo -c -o ovsdb/ovsdb-tool.o ovsdb/ovsdb-tool.c &&\\\nmv -f $depbase.Tpo $depbase.Po\n"
2017-12-13 10:21:17,741 [DEBUG] yardstick.ssh.kvm.LF-1d3ec479 ssh.py:294 stdout: u'/bin/sh ./libtool  --tag=CC   --mode=link gcc -std=gnu99 -Wstrict-prototypes -Wall -Wextra -Wno-sign-compare -Wpointer-arith -Wswitch-enum -Wunused-parameter -Wbad-function-cast -Wcast-align -Wmissing-prototypes -Wmissing-field-initializers -fno-strict-aliasing -mssse3 -I../../dpdk/dpdk/x86_64-native-linuxapp-gcc/include -D_FILE_OFFSET_BITS=64  -g -O2 -Wno-cast-align  -L../../dpdk/dpdk/x86_64-native-linuxapp-gcc/lib   -o ovsdb/ovsdb-tool ovsdb/ovsdb-tool.o ovsdb/libovsdb.la lib/libopenvswitch.la -ldpdk -ldl -lnuma -lpthread -lrt -lm  -lnuma\n'
2017-12-13 10:21:17,825 [DEBUG] yardstick.ssh.kvm.LF-1d3ec479 ssh.py:294 stdout: u'libtool: link: gcc -std=gnu99 -Wstrict-prototypes -Wall -Wextra -Wno-sign-compare -Wpointer-arith -Wswitch-enum -Wunused-parameter -Wbad-function-cast -Wcast-align -Wmissing-prototypes -Wmissing-field-initializers -fno-strict-aliasing -mssse3 -I../../dpdk/dpdk/x86_64-native-linuxapp-gcc/include -D_FILE_OFFSET_BITS=64 -g -O2 -Wno-cast-align -o ovsdb/ovsdb-tool ovsdb/ovsdb-tool.o  -L../../dpdk/dpdk/x86_64-native-linuxapp-gcc/lib ovsdb/.libs/libovsdb.a lib/.libs/libopenvswitch.a -lssl -lcrypto -ldpdk -ldl -lpthread -lrt -lm -lnuma\n'
2017-12-13 10:21:18,066 [DEBUG] yardstick.ssh.kvm.LF-1d3ec479 ssh.py:294 stdout: u"depbase=`echo ovsdb/ovsdb-client.o | sed 's|[^/]*$|.deps/&|;s|\\.o$||'`;\\\ngcc -std=gnu99 -DHAVE_CONFIG_H -I.    -I ./include -I ./include -I ./lib -I ./lib    -Wstrict-prototypes -Wall -Wextra -Wno-sign-compare -Wpointer-arith -Wswitch-enum -Wunused-parameter -Wbad-function-cast -Wcast-align -Wmissing-prototypes -Wmissing-field-initializers -fno-strict-aliasing -mssse3 -I../../dpdk/dpdk/x86_64-native-linuxapp-gcc/include -D_FILE_OFFSET_BITS=64  -g -O2 -Wno-cast-align -MT ovsdb/ovsdb-client.o -MD -MP -MF $depbase.Tpo -c -o ovsdb/ovsdb-client.o ovsdb/ovsdb-client.c &&\\\nmv -f $depbase.Tpo $depbase.Po\n"
2017-12-13 10:21:18,594 [DEBUG] yardstick.ssh.kvm.LF-1d3ec479 ssh.py:294 stdout: u'/bin/sh ./libtool  --tag=CC   --mode=link gcc -std=gnu99 -Wstrict-prototypes -Wall -Wextra -Wno-sign-compare -Wpointer-arith -Wswitch-enum -Wunused-parameter -Wbad-function-cast -Wcast-align -Wmissing-prototypes -Wmissing-field-initializers -fno-strict-aliasing -mssse3 -I../../dpdk/dpdk/x86_64-native-linuxapp-gcc/include -D_FILE_OFFSET_BITS=64  -g -O2 -Wno-cast-align  -L../../dpdk/dpdk/x86_64-native-linuxapp-gcc/lib   -o ovsdb/ovsdb-client ovsdb/ovsdb-client.o ovsdb/libovsdb.la lib/libopenvswitch.la -ldpdk -ldl -lnuma -lpthread -lrt -lm  -lnuma\n'
2017-12-13 10:21:18,678 [DEBUG] yardstick.ssh.kvm.LF-1d3ec479 ssh.py:294 stdout: u'libtool: link: gcc -std=gnu99 -Wstrict-prototypes -Wall -Wextra -Wno-sign-compare -Wpointer-arith -Wswitch-enum -Wunused-parameter -Wbad-function-cast -Wcast-align -Wmissing-prototypes -Wmissing-field-initializers -fno-strict-aliasing -mssse3 -I../../dpdk/dpdk/x86_64-native-linuxapp-gcc/include -D_FILE_OFFSET_BITS=64 -g -O2 -Wno-cast-align -o ovsdb/ovsdb-client ovsdb/ovsdb-client.o  -L../../dpdk/dpdk/x86_64-native-linuxapp-gcc/lib ovsdb/.libs/libovsdb.a lib/.libs/libopenvswitch.a -lssl -lcrypto -ldpdk -ldl -lpthread -lrt -lm -lnuma\n'
2017-12-13 10:21:18,916 [DEBUG] yardstick.ssh.kvm.LF-1d3ec479 ssh.py:294 stdout: u"depbase=`echo vtep/vtep-ctl.o | sed 's|[^/]*$|.deps/&|;s|\\.o$||'`;\\\ngcc -std=gnu99 -DHAVE_CONFIG_H -I.    -I ./include -I ./include -I ./lib -I ./lib    -Wstrict-prototypes -Wall -Wextra -Wno-sign-compare -Wpointer-arith -Wswitch-enum -Wunused-parameter -Wbad-function-cast -Wcast-align -Wmissing-prototypes -Wmissing-field-initializers -fno-strict-aliasing -mssse3 -I../../dpdk/dpdk/x86_64-native-linuxapp-gcc/include -D_FILE_OFFSET_BITS=64  -g -O2 -Wno-cast-align -MT vtep/vtep-ctl.o -MD -MP -MF $depbase.Tpo -c -o vtep/vtep-ctl.o vtep/vtep-ctl.c &&\\\nmv -f $depbase.Tpo $depbase.Po\n"
2017-12-13 10:21:19,580 [DEBUG] yardstick.ssh.kvm.LF-1d3ec479 ssh.py:294 stdout: u'/bin/sh ./libtool  --tag=CC   --mode=link gcc -std=gnu99 -Wstrict-prototypes -Wall -Wextra -Wno-sign-compare -Wpointer-arith -Wswitch-enum -Wunused-parameter -Wbad-function-cast -Wcast-align -Wmissing-prototypes -Wmissing-field-initializers -fno-strict-aliasing -mssse3 -I../../dpdk/dpdk/x86_64-native-linuxapp-gcc/include -D_FILE_OFFSET_BITS=64  -g -O2 -Wno-cast-align  -L../../dpdk/dpdk/x86_64-native-linuxapp-gcc/lib   -o vtep/vtep-ctl vtep/vtep-ctl.o vtep/libvtep.la lib/libopenvswitch.la -ldpdk -ldl -lnuma -lpthread -lrt -lm  -lnuma\n'
2017-12-13 10:21:19,664 [DEBUG] yardstick.ssh.kvm.LF-1d3ec479 ssh.py:294 stdout: u'libtool: link: gcc -std=gnu99 -Wstrict-prototypes -Wall -Wextra -Wno-sign-compare -Wpointer-arith -Wswitch-enum -Wunused-parameter -Wbad-function-cast -Wcast-align -Wmissing-prototypes -Wmissing-field-initializers -fno-strict-aliasing -mssse3 -I../../dpdk/dpdk/x86_64-native-linuxapp-gcc/include -D_FILE_OFFSET_BITS=64 -g -O2 -Wno-cast-align -o vtep/vtep-ctl vtep/vtep-ctl.o  -L../../dpdk/dpdk/x86_64-native-linuxapp-gcc/lib vtep/.libs/libvtep.a lib/.libs/libopenvswitch.a -lssl -lcrypto -ldpdk -ldl -lpthread -lrt -lm -lnuma\n'
2017-12-13 10:21:19,918 [DEBUG] yardstick.ssh.kvm.LF-1d3ec479 ssh.py:294 stdout: u"depbase=`echo ovn/controller/binding.o | sed 's|[^/]*$|.deps/&|;s|\\.o$||'`;\\\ngcc -std=gnu99 -DHAVE_CONFIG_H -I.    -I ./include -I ./include -I ./lib -I ./lib    -Wstrict-prototypes -Wall -Wextra -Wno-sign-compare -Wpointer-arith -Wswitch-enum -Wunused-parameter -Wbad-function-cast -Wcast-align -Wmissing-prototypes -Wmissing-field-initializers -fno-strict-aliasing -mssse3 -I../../dpdk/dpdk/x86_64-native-linuxapp-gcc/include -D_FILE_OFFSET_BITS=64  -g -O2 -Wno-cast-align -MT ovn/controller/binding.o -MD -MP -MF $depbase.Tpo -c -o ovn/controller/binding.o ovn/controller/binding.c &&\\\nmv -f $depbase.Tpo $depbase.Po\n"
2017-12-13 10:21:20,070 [DEBUG] yardstick.ssh.kvm.LF-1d3ec479 ssh.py:294 stdout: u"depbase=`echo ovn/controller/chassis.o | sed 's|[^/]*$|.deps/&|;s|\\.o$||'`;\\\ngcc -std=gnu99 -DHAVE_CONFIG_H -I.    -I ./include -I ./include -I ./lib -I ./lib    -Wstrict-prototypes -Wall -Wextra -Wno-sign-compare -Wpointer-arith -Wswitch-enum -Wunused-parameter -Wbad-function-cast -Wcast-align -Wmissing-prototypes -Wmissing-field-initializers -fno-strict-aliasing -mssse3 -I../../dpdk/dpdk/x86_64-native-linuxapp-gcc/include -D_FILE_OFFSET_BITS=64  -g -O2 -Wno-cast-align -MT ovn/controller/chassis.o -MD -MP -MF $depbase.Tpo -c -o ovn/controller/chassis.o ovn/controller/chassis.c &&\\\nmv -f $depbase.Tpo $depbase.Po\n"
2017-12-13 10:21:20,221 [DEBUG] yardstick.ssh.kvm.LF-1d3ec479 ssh.py:294 stdout: u"depbase=`echo ovn/controller/encaps.o | sed 's|[^/]*$|.deps/&|;s|\\.o$||'`;\\\ngcc -std=gnu99 -DHAVE_CONFIG_H -I.    -I ./include -I ./include -I ./lib -I ./lib    -Wstrict-prototypes -Wall -Wextra -Wno-sign-compare -Wpointer-arith -Wswitch-enum -Wunused-parameter -Wbad-function-cast -Wcast-align -Wmissing-prototypes -Wmissing-field-initializers -fno-strict-aliasing -mssse3 -I../../dpdk/dpdk/x86_64-native-linuxapp-gcc/include -D_FILE_OFFSET_BITS=64  -g -O2 -Wno-cast-align -MT ovn/controller/encaps.o -MD -MP -MF $depbase.Tpo -c -o ovn/controller/encaps.o ovn/controller/encaps.c &&\\\nmv -f $depbase.Tpo $depbase.Po\n"
2017-12-13 10:21:20,356 [DEBUG] yardstick.ssh.kvm.LF-1d3ec479 ssh.py:294 stdout: u"depbase=`echo ovn/controller/lflow.o | sed 's|[^/]*$|.deps/&|;s|\\.o$||'`;\\\ngcc -std=gnu99 -DHAVE_CONFIG_H -I.    -I ./include -I ./include -I ./lib -I ./lib    -Wstrict-prototypes -Wall -Wextra -Wno-sign-compare -Wpointer-arith -Wswitch-enum -Wunused-parameter -Wbad-function-cast -Wcast-align -Wmissing-prototypes -Wmissing-field-initializers -fno-strict-aliasing -mssse3 -I../../dpdk/dpdk/x86_64-native-linuxapp-gcc/include -D_FILE_OFFSET_BITS=64  -g -O2 -Wno-cast-align -MT ovn/controller/lflow.o -MD -MP -MF $depbase.Tpo -c -o ovn/controller/lflow.o ovn/controller/lflow.c &&\\\nmv -f $depbase.Tpo $depbase.Po\n"
2017-12-13 10:21:20,595 [DEBUG] yardstick.ssh.kvm.LF-1d3ec479 ssh.py:294 stdout: u"depbase=`echo ovn/controller/lport.o | sed 's|[^/]*$|.deps/&|;s|\\.o$||'`;\\\ngcc -std=gnu99 -DHAVE_CONFIG_H -I.    -I ./include -I ./include -I ./lib -I ./lib    -Wstrict-prototypes -Wall -Wextra -Wno-sign-compare -Wpointer-arith -Wswitch-enum -Wunused-parameter -Wbad-function-cast -Wcast-align -Wmissing-prototypes -Wmissing-field-initializers -fno-strict-aliasing -mssse3 -I../../dpdk/dpdk/x86_64-native-linuxapp-gcc/include -D_FILE_OFFSET_BITS=64  -g -O2 -Wno-cast-align -MT ovn/controller/lport.o -MD -MP -MF $depbase.Tpo -c -o ovn/controller/lport.o ovn/controller/lport.c &&\\\nmv -f $depbase.Tpo $depbase.Po\n"
2017-12-13 10:21:20,757 [DEBUG] yardstick.ssh.kvm.LF-1d3ec479 ssh.py:294 stdout: u"depbase=`echo ovn/controller/ofctrl.o | sed 's|[^/]*$|.deps/&|;s|\\.o$||'`;\\\ngcc -std=gnu99 -DHAVE_CONFIG_H -I.    -I ./include -I ./include -I ./lib -I ./lib    -Wstrict-prototypes -Wall -Wextra -Wno-sign-compare -Wpointer-arith -Wswitch-enum -Wunused-parameter -Wbad-function-cast -Wcast-align -Wmissing-prototypes -Wmissing-field-initializers -fno-strict-aliasing -mssse3 -I../../dpdk/dpdk/x86_64-native-linuxapp-gcc/include -D_FILE_OFFSET_BITS=64  -g -O2 -Wno-cast-align -MT ovn/controller/ofctrl.o -MD -MP -MF $depbase.Tpo -c -o ovn/controller/ofctrl.o ovn/controller/ofctrl.c &&\\\nmv -f $depbase.Tpo $depbase.Po\n"
2017-12-13 10:21:21,229 [DEBUG] yardstick.ssh.kvm.LF-1d3ec479 ssh.py:294 stdout: u"depbase=`echo ovn/controller/pinctrl.o | sed 's|[^/]*$|.deps/&|;s|\\.o$||'`;\\\ngcc -std=gnu99 -DHAVE_CONFIG_H -I.    -I ./include -I ./include -I ./lib -I ./lib    -Wstrict-prototypes -Wall -Wextra -Wno-sign-compare -Wpointer-arith -Wswitch-enum -Wunused-parameter -Wbad-function-cast -Wcast-align -Wmissing-prototypes -Wmissing-field-initializers -fno-strict-aliasing -mssse3 -I../../dpdk/dpdk/x86_64-native-linuxapp-gcc/include -D_FILE_OFFSET_BITS=64  -g -O2 -Wno-cast-align -MT ovn/controller/pinctrl.o -MD -MP -MF $depbase.Tpo -c -o ovn/controller/pinctrl.o ovn/controller/pinctrl.c &&\\\nmv -f $depbase.Tpo $depbase.Po\n"
2017-12-13 10:21:21,867 [DEBUG] yardstick.ssh.kvm.LF-1d3ec479 ssh.py:294 stdout: u"depbase=`echo ovn/controller/patch.o | sed 's|[^/]*$|.deps/&|;s|\\.o$||'`;\\\ngcc -std=gnu99 -DHAVE_CONFIG_H -I.    -I ./include -I ./include -I ./lib -I ./lib    -Wstrict-prototypes -Wall -Wextra -Wno-sign-compare -Wpointer-arith -Wswitch-enum -Wunused-parameter -Wbad-function-cast -Wcast-align -Wmissing-prototypes -Wmissing-field-initializers -fno-strict-aliasing -mssse3 -I../../dpdk/dpdk/x86_64-native-linuxapp-gcc/include -D_FILE_OFFSET_BITS=64  -g -O2 -Wno-cast-align -MT ovn/controller/patch.o -MD -MP -MF $depbase.Tpo -c -o ovn/controller/patch.o ovn/controller/patch.c &&\\\nmv -f $depbase.Tpo $depbase.Po\n"
2017-12-13 10:21:22,084 [DEBUG] yardstick.ssh.kvm.LF-1d3ec479 ssh.py:294 stdout: u"depbase=`echo ovn/controller/ovn-controller.o | sed 's|[^/]*$|.deps/&|;s|\\.o$||'`;\\\ngcc -std=gnu99 -DHAVE_CONFIG_H -I.    -I ./include -I ./include -I ./lib -I ./lib    -Wstrict-prototypes -Wall -Wextra -Wno-sign-compare -Wpointer-arith -Wswitch-enum -Wunused-parameter -Wbad-function-cast -Wcast-align -Wmissing-prototypes -Wmissing-field-initializers -fno-strict-aliasing -mssse3 -I../../dpdk/dpdk/x86_64-native-linuxapp-gcc/include -D_FILE_OFFSET_BITS=64  -g -O2 -Wno-cast-align -MT ovn/controller/ovn-controller.o -MD -MP -MF $depbase.Tpo -c -o ovn/controller/ovn-controller.o ovn/controller/ovn-controller.c &&\\\nmv -f $depbase.Tpo $depbase.Po\n"
2017-12-13 10:21:22,499 [DEBUG] yardstick.ssh.kvm.LF-1d3ec479 ssh.py:294 stdout: u"depbase=`echo ovn/controller/physical.o | sed 's|[^/]*$|.deps/&|;s|\\.o$||'`;\\\ngcc -std=gnu99 -DHAVE_CONFIG_H -I.    -I ./include -I ./include -I ./lib -I ./lib    -Wstrict-prototypes -Wall -Wextra -Wno-sign-compare -Wpointer-arith -Wswitch-enum -Wunused-parameter -Wbad-function-cast -Wcast-align -Wmissing-prototypes -Wmissing-field-initializers -fno-strict-aliasing -mssse3 -I../../dpdk/dpdk/x86_64-native-linuxapp-gcc/include -D_FILE_OFFSET_BITS=64  -g -O2 -Wno-cast-align -MT ovn/controller/physical.o -MD -MP -MF $depbase.Tpo -c -o ovn/controller/physical.o ovn/controller/physical.c &&\\\nmv -f $depbase.Tpo $depbase.Po\n"
2017-12-13 10:21:22,924 [DEBUG] yardstick.ssh.kvm.LF-1d3ec479 ssh.py:294 stdout: u'/bin/sh ./libtool  --tag=CC   --mode=link gcc -std=gnu99 -Wstrict-prototypes -Wall -Wextra -Wno-sign-compare -Wpointer-arith -Wswitch-enum -Wunused-parameter -Wbad-function-cast -Wcast-align -Wmissing-prototypes -Wmissing-field-initializers -fno-strict-aliasing -mssse3 -I../../dpdk/dpdk/x86_64-native-linuxapp-gcc/include -D_FILE_OFFSET_BITS=64  -g -O2 -Wno-cast-align  -L../../dpdk/dpdk/x86_64-native-linuxapp-gcc/lib   -o ovn/controller/ovn-controller ovn/controller/binding.o ovn/controller/chassis.o ovn/controller/encaps.o ovn/controller/lflow.o ovn/controller/lport.o ovn/controller/ofctrl.o ovn/controller/pinctrl.o ovn/controller/patch.o ovn/controller/ovn-controller.o ovn/controller/physical.o ovn/lib/libovn.la lib/libopenvswitch.la -ldpdk -ldl -lnuma -lpthread -lrt -lm  -lnuma\n'
2017-12-13 10:21:23,010 [DEBUG] yardstick.ssh.kvm.LF-1d3ec479 ssh.py:294 stdout: u'libtool: link: gcc -std=gnu99 -Wstrict-prototypes -Wall -Wextra -Wno-sign-compare -Wpointer-arith -Wswitch-enum -Wunused-parameter -Wbad-function-cast -Wcast-align -Wmissing-prototypes -Wmissing-field-initializers -fno-strict-aliasing -mssse3 -I../../dpdk/dpdk/x86_64-native-linuxapp-gcc/include -D_FILE_OFFSET_BITS=64 -g -O2 -Wno-cast-align -o ovn/controller/ovn-controller ovn/controller/binding.o ovn/controller/chassis.o ovn/controller/encaps.o ovn/controller/lflow.o ovn/controller/lport.o ovn/controller/ofctrl.o ovn/controller/pinctrl.o ovn/controller/patch.o ovn/controller/ovn-controller.o ovn/controller/physical.o  -L../../dpdk/dpdk/x86_64-native-linuxapp-gcc/lib ovn/lib/.libs/libovn.a lib/.libs/libopenvswitch.a -lssl -lcrypto -ldpdk -ldl -lpthread -lrt -lm -lnuma\n'
2017-12-13 10:21:23,312 [DEBUG] yardstick.ssh.kvm.LF-1d3ec479 ssh.py:294 stdout: u"depbase=`echo ovn/controller-vtep/binding.o | sed 's|[^/]*$|.deps/&|;s|\\.o$||'`;\\\ngcc -std=gnu99 -DHAVE_CONFIG_H -I.    -I ./include -I ./include -I ./lib -I ./lib    -Wstrict-prototypes -Wall -Wextra -Wno-sign-compare -Wpointer-arith -Wswitch-enum -Wunused-parameter -Wbad-function-cast -Wcast-align -Wmissing-prototypes -Wmissing-field-initializers -fno-strict-aliasing -mssse3 -I../../dpdk/dpdk/x86_64-native-linuxapp-gcc/include -D_FILE_OFFSET_BITS=64  -g -O2 -Wno-cast-align -MT ovn/controller-vtep/binding.o -MD -MP -MF $depbase.Tpo -c -o ovn/controller-vtep/binding.o ovn/controller-vtep/binding.c &&\\\nmv -f $depbase.Tpo $depbase.Po\n"
2017-12-13 10:21:23,448 [DEBUG] yardstick.ssh.kvm.LF-1d3ec479 ssh.py:294 stdout: u"depbase=`echo ovn/controller-vtep/gateway.o | sed 's|[^/]*$|.deps/&|;s|\\.o$||'`;\\\ngcc -std=gnu99 -DHAVE_CONFIG_H -I.    -I ./include -I ./include -I ./lib -I ./lib    -Wstrict-prototypes -Wall -Wextra -Wno-sign-compare -Wpointer-arith -Wswitch-enum -Wunused-parameter -Wbad-function-cast -Wcast-align -Wmissing-prototypes -Wmissing-field-initializers -fno-strict-aliasing -mssse3 -I../../dpdk/dpdk/x86_64-native-linuxapp-gcc/include -D_FILE_OFFSET_BITS=64  -g -O2 -Wno-cast-align -MT ovn/controller-vtep/gateway.o -MD -MP -MF $depbase.Tpo -c -o ovn/controller-vtep/gateway.o ovn/controller-vtep/gateway.c &&\\\nmv -f $depbase.Tpo $depbase.Po\n"
2017-12-13 10:21:23,581 [DEBUG] yardstick.ssh.kvm.LF-1d3ec479 ssh.py:294 stdout: u"depbase=`echo ovn/controller-vtep/ovn-controller-vtep.o | sed 's|[^/]*$|.deps/&|;s|\\.o$||'`;\\\ngcc -std=gnu99 -DHAVE_CONFIG_H -I.    -I ./include -I ./include -I ./lib -I ./lib    -Wstrict-prototypes -Wall -Wextra -Wno-sign-compare -Wpointer-arith -Wswitch-enum -Wunused-parameter -Wbad-function-cast -Wcast-align -Wmissing-prototypes -Wmissing-field-initializers -fno-strict-aliasing -mssse3 -I../../dpdk/dpdk/x86_64-native-linuxapp-gcc/include -D_FILE_OFFSET_BITS=64  -g -O2 -Wno-cast-align -MT ovn/controller-vtep/ovn-controller-vtep.o -MD -MP -MF $depbase.Tpo -c -o ovn/controller-vtep/ovn-controller-vtep.o ovn/controller-vtep/ovn-controller-vtep.c &&\\\nmv -f $depbase.Tpo $depbase.Po\n"
2017-12-13 10:21:23,702 [DEBUG] yardstick.ssh.kvm.LF-1d3ec479 ssh.py:294 stdout: u"depbase=`echo ovn/controller-vtep/vtep.o | sed 's|[^/]*$|.deps/&|;s|\\.o$||'`;\\\ngcc -std=gnu99 -DHAVE_CONFIG_H -I.    -I ./include -I ./include -I ./lib -I ./lib    -Wstrict-prototypes -Wall -Wextra -Wno-sign-compare -Wpointer-arith -Wswitch-enum -Wunused-parameter -Wbad-function-cast -Wcast-align -Wmissing-prototypes -Wmissing-field-initializers -fno-strict-aliasing -mssse3 -I../../dpdk/dpdk/x86_64-native-linuxapp-gcc/include -D_FILE_OFFSET_BITS=64  -g -O2 -Wno-cast-align -MT ovn/controller-vtep/vtep.o -MD -MP -MF $depbase.Tpo -c -o ovn/controller-vtep/vtep.o ovn/controller-vtep/vtep.c &&\\\nmv -f $depbase.Tpo $depbase.Po\n"
2017-12-13 10:21:23,990 [DEBUG] yardstick.ssh.kvm.LF-1d3ec479 ssh.py:294 stdout: u'/bin/sh ./libtool  --tag=CC   --mode=link gcc -std=gnu99 -Wstrict-prototypes -Wall -Wextra -Wno-sign-compare -Wpointer-arith -Wswitch-enum -Wunused-parameter -Wbad-function-cast -Wcast-align -Wmissing-prototypes -Wmissing-field-initializers -fno-strict-aliasing -mssse3 -I../../dpdk/dpdk/x86_64-native-linuxapp-gcc/include -D_FILE_OFFSET_BITS=64  -g -O2 -Wno-cast-align  -L../../dpdk/dpdk/x86_64-native-linuxapp-gcc/lib   -o ovn/controller-vtep/ovn-controller-vtep ovn/controller-vtep/binding.o ovn/controller-vtep/gateway.o ovn/controller-vtep/ovn-controller-vtep.o ovn/controller-vtep/vtep.o ovn/lib/libovn.la lib/libopenvswitch.la vtep/libvtep.la -ldpdk -ldl -lnuma -lpthread -lrt -lm  -lnuma\n'
2017-12-13 10:21:24,086 [DEBUG] yardstick.ssh.kvm.LF-1d3ec479 ssh.py:294 stdout: u'libtool: link: gcc -std=gnu99 -Wstrict-prototypes -Wall -Wextra -Wno-sign-compare -Wpointer-arith -Wswitch-enum -Wunused-parameter -Wbad-function-cast -Wcast-align -Wmissing-prototypes -Wmissing-field-initializers -fno-strict-aliasing -mssse3 -I../../dpdk/dpdk/x86_64-native-linuxapp-gcc/include -D_FILE_OFFSET_BITS=64 -g -O2 -Wno-cast-align -o ovn/controller-vtep/ovn-controller-vtep ovn/controller-vtep/binding.o ovn/controller-vtep/gateway.o ovn/controller-vtep/ovn-controller-vtep.o ovn/controller-vtep/vtep.o  -L../../dpdk/dpdk/x86_64-native-linuxapp-gcc/lib ovn/lib/.libs/libovn.a lib/.libs/libopenvswitch.a -lssl -lcrypto vtep/.libs/libvtep.a -ldpdk -ldl -lpthread -lrt -lm -lnuma\n'
2017-12-13 10:21:24,349 [DEBUG] yardstick.ssh.kvm.LF-1d3ec479 ssh.py:294 stdout: u"depbase=`echo ovn/northd/ovn-northd.o | sed 's|[^/]*$|.deps/&|;s|\\.o$||'`;\\\ngcc -std=gnu99 -DHAVE_CONFIG_H -I.    -I ./include -I ./include -I ./lib -I ./lib    -Wstrict-prototypes -Wall -Wextra -Wno-sign-compare -Wpointer-arith -Wswitch-enum -Wunused-parameter -Wbad-function-cast -Wcast-align -Wmissing-prototypes -Wmissing-field-initializers -fno-strict-aliasing -mssse3 -I../../dpdk/dpdk/x86_64-native-linuxapp-gcc/include -D_FILE_OFFSET_BITS=64  -g -O2 -Wno-cast-align -MT ovn/northd/ovn-northd.o -MD -MP -MF $depbase.Tpo -c -o ovn/northd/ovn-northd.o ovn/northd/ovn-northd.c &&\\\nmv -f $depbase.Tpo $depbase.Po\n"
2017-12-13 10:21:26,309 [DEBUG] yardstick.ssh.kvm.LF-1d3ec479 ssh.py:294 stdout: u'/bin/sh ./libtool  --tag=CC   --mode=link gcc -std=gnu99 -Wstrict-prototypes -Wall -Wextra -Wno-sign-compare -Wpointer-arith -Wswitch-enum -Wunused-parameter -Wbad-function-cast -Wcast-align -Wmissing-prototypes -Wmissing-field-initializers -fno-strict-aliasing -mssse3 -I../../dpdk/dpdk/x86_64-native-linuxapp-gcc/include -D_FILE_OFFSET_BITS=64  -g -O2 -Wno-cast-align  -L../../dpdk/dpdk/x86_64-native-linuxapp-gcc/lib   -o ovn/northd/ovn-northd ovn/northd/ovn-northd.o ovn/lib/libovn.la ovsdb/libovsdb.la lib/libopenvswitch.la -ldpdk -ldl -lnuma -lpthread -lrt -lm  -lnuma\n'
2017-12-13 10:21:26,404 [DEBUG] yardstick.ssh.kvm.LF-1d3ec479 ssh.py:294 stdout: u'libtool: link: gcc -std=gnu99 -Wstrict-prototypes -Wall -Wextra -Wno-sign-compare -Wpointer-arith -Wswitch-enum -Wunused-parameter -Wbad-function-cast -Wcast-align -Wmissing-prototypes -Wmissing-field-initializers -fno-strict-aliasing -mssse3 -I../../dpdk/dpdk/x86_64-native-linuxapp-gcc/include -D_FILE_OFFSET_BITS=64 -g -O2 -Wno-cast-align -o ovn/northd/ovn-northd ovn/northd/ovn-northd.o  -L../../dpdk/dpdk/x86_64-native-linuxapp-gcc/lib ovn/lib/.libs/libovn.a ovsdb/.libs/libovsdb.a lib/.libs/libopenvswitch.a -lssl -lcrypto -ldpdk -ldl -lpthread -lrt -lm -lnuma\n'
2017-12-13 10:21:26,662 [DEBUG] yardstick.ssh.kvm.LF-1d3ec479 ssh.py:294 stdout: u"depbase=`echo ovn/utilities/ovn-nbctl.o | sed 's|[^/]*$|.deps/&|;s|\\.o$||'`;\\\ngcc -std=gnu99 -DHAVE_CONFIG_H -I.    -I ./include -I ./include -I ./lib -I ./lib    -Wstrict-prototypes -Wall -Wextra -Wno-sign-compare -Wpointer-arith -Wswitch-enum -Wunused-parameter -Wbad-function-cast -Wcast-align -Wmissing-prototypes -Wmissing-field-initializers -fno-strict-aliasing -mssse3 -I../../dpdk/dpdk/x86_64-native-linuxapp-gcc/include -D_FILE_OFFSET_BITS=64  -g -O2 -Wno-cast-align -MT ovn/utilities/ovn-nbctl.o -MD -MP -MF $depbase.Tpo -c -o ovn/utilities/ovn-nbctl.o ovn/utilities/ovn-nbctl.c &&\\\nmv -f $depbase.Tpo $depbase.Po\n"
2017-12-13 10:21:27,396 [DEBUG] yardstick.ssh.kvm.LF-1d3ec479 ssh.py:294 stdout: u'/bin/sh ./libtool  --tag=CC   --mode=link gcc -std=gnu99 -Wstrict-prototypes -Wall -Wextra -Wno-sign-compare -Wpointer-arith -Wswitch-enum -Wunused-parameter -Wbad-function-cast -Wcast-align -Wmissing-prototypes -Wmissing-field-initializers -fno-strict-aliasing -mssse3 -I../../dpdk/dpdk/x86_64-native-linuxapp-gcc/include -D_FILE_OFFSET_BITS=64  -g -O2 -Wno-cast-align  -L../../dpdk/dpdk/x86_64-native-linuxapp-gcc/lib   -o ovn/utilities/ovn-nbctl ovn/utilities/ovn-nbctl.o ovn/lib/libovn.la ovsdb/libovsdb.la lib/libopenvswitch.la -ldpdk -ldl -lnuma -lpthread -lrt -lm  -lnuma\n'
2017-12-13 10:21:27,490 [DEBUG] yardstick.ssh.kvm.LF-1d3ec479 ssh.py:294 stdout: u'libtool: link: gcc -std=gnu99 -Wstrict-prototypes -Wall -Wextra -Wno-sign-compare -Wpointer-arith -Wswitch-enum -Wunused-parameter -Wbad-function-cast -Wcast-align -Wmissing-prototypes -Wmissing-field-initializers -fno-strict-aliasing -mssse3 -I../../dpdk/dpdk/x86_64-native-linuxapp-gcc/include -D_FILE_OFFSET_BITS=64 -g -O2 -Wno-cast-align -o ovn/utilities/ovn-nbctl ovn/utilities/ovn-nbctl.o  -L../../dpdk/dpdk/x86_64-native-linuxapp-gcc/lib ovn/lib/.libs/libovn.a ovsdb/.libs/libovsdb.a lib/.libs/libopenvswitch.a -lssl -lcrypto -ldpdk -ldl -lpthread -lrt -lm -lnuma\n'
2017-12-13 10:21:27,739 [DEBUG] yardstick.ssh.kvm.LF-1d3ec479 ssh.py:294 stdout: u"depbase=`echo ovn/utilities/ovn-sbctl.o | sed 's|[^/]*$|.deps/&|;s|\\.o$||'`;\\\ngcc -std=gnu99 -DHAVE_CONFIG_H -I.    -I ./include -I ./include -I ./lib -I ./lib    -Wstrict-prototypes -Wall -Wextra -Wno-sign-compare -Wpointer-arith -Wswitch-enum -Wunused-parameter -Wbad-function-cast -Wcast-align -Wmissing-prototypes -Wmissing-field-initializers -fno-strict-aliasing -mssse3 -I../../dpdk/dpdk/x86_64-native-linuxapp-gcc/include -D_FILE_OFFSET_BITS=64  -g -O2 -Wno-cast-align -MT ovn/utilities/ovn-sbctl.o -MD -MP -MF $depbase.Tpo -c -o ovn/utilities/ovn-sbctl.o ovn/utilities/ovn-sbctl.c &&\\\nmv -f $depbase.Tpo $depbase.Po\n"
2017-12-13 10:21:28,046 [DEBUG] yardstick.ssh.kvm.LF-1d3ec479 ssh.py:294 stdout: u'/bin/sh ./libtool  --tag=CC   --mode=link gcc -std=gnu99 -Wstrict-prototypes -Wall -Wextra -Wno-sign-compare -Wpointer-arith -Wswitch-enum -Wunused-parameter -Wbad-function-cast -Wcast-align -Wmissing-prototypes -Wmissing-field-initializers -fno-strict-aliasing -mssse3 -I../../dpdk/dpdk/x86_64-native-linuxapp-gcc/include -D_FILE_OFFSET_BITS=64  -g -O2 -Wno-cast-align  -L../../dpdk/dpdk/x86_64-native-linuxapp-gcc/lib   -o ovn/utilities/ovn-sbctl ovn/utilities/ovn-sbctl.o ovn/lib/libovn.la ovsdb/libovsdb.la lib/libopenvswitch.la -ldpdk -ldl -lnuma -lpthread -lrt -lm  -lnuma\n'
2017-12-13 10:21:28,140 [DEBUG] yardstick.ssh.kvm.LF-1d3ec479 ssh.py:294 stdout: u'libtool: link: gcc -std=gnu99 -Wstrict-prototypes -Wall -Wextra -Wno-sign-compare -Wpointer-arith -Wswitch-enum -Wunused-parameter -Wbad-function-cast -Wcast-align -Wmissing-prototypes -Wmissing-field-initializers -fno-strict-aliasing -mssse3 -I../../dpdk/dpdk/x86_64-native-linuxapp-gcc/include -D_FILE_OFFSET_BITS=64 -g -O2 -Wno-cast-align -o ovn/utilities/ovn-sbctl ovn/utilities/ovn-sbctl.o  -L../../dpdk/dpdk/x86_64-native-linuxapp-gcc/lib ovn/lib/.libs/libovn.a ovsdb/.libs/libovsdb.a lib/.libs/libopenvswitch.a -lssl -lcrypto -ldpdk -ldl -lpthread -lrt -lm -lnuma\n'
2017-12-13 10:21:28,385 [DEBUG] yardstick.ssh.kvm.LF-1d3ec479 ssh.py:294 stdout: u"depbase=`echo ovn/utilities/ovn-trace.o | sed 's|[^/]*$|.deps/&|;s|\\.o$||'`;\\\ngcc -std=gnu99 -DHAVE_CONFIG_H -I.    -I ./include -I ./include -I ./lib -I ./lib    -Wstrict-prototypes -Wall -Wextra -Wno-sign-compare -Wpointer-arith -Wswitch-enum -Wunused-parameter -Wbad-function-cast -Wcast-align -Wmissing-prototypes -Wmissing-field-initializers -fno-strict-aliasing -mssse3 -I../../dpdk/dpdk/x86_64-native-linuxapp-gcc/include -D_FILE_OFFSET_BITS=64  -g -O2 -Wno-cast-align -MT ovn/utilities/ovn-trace.o -MD -MP -MF $depbase.Tpo -c -o ovn/utilities/ovn-trace.o ovn/utilities/ovn-trace.c &&\\\nmv -f $depbase.Tpo $depbase.Po\n"
2017-12-13 10:21:28,940 [DEBUG] yardstick.ssh.kvm.LF-1d3ec479 ssh.py:294 stdout: u'/bin/sh ./libtool  --tag=CC   --mode=link gcc -std=gnu99 -Wstrict-prototypes -Wall -Wextra -Wno-sign-compare -Wpointer-arith -Wswitch-enum -Wunused-parameter -Wbad-function-cast -Wcast-align -Wmissing-prototypes -Wmissing-field-initializers -fno-strict-aliasing -mssse3 -I../../dpdk/dpdk/x86_64-native-linuxapp-gcc/include -D_FILE_OFFSET_BITS=64  -g -O2 -Wno-cast-align  -L../../dpdk/dpdk/x86_64-native-linuxapp-gcc/lib   -o ovn/utilities/ovn-trace ovn/utilities/ovn-trace.o ovn/lib/libovn.la ovsdb/libovsdb.la lib/libopenvswitch.la -ldpdk -ldl -lnuma -lpthread -lrt -lm  -lnuma\n'
2017-12-13 10:21:29,035 [DEBUG] yardstick.ssh.kvm.LF-1d3ec479 ssh.py:294 stdout: u'libtool: link: gcc -std=gnu99 -Wstrict-prototypes -Wall -Wextra -Wno-sign-compare -Wpointer-arith -Wswitch-enum -Wunused-parameter -Wbad-function-cast -Wcast-align -Wmissing-prototypes -Wmissing-field-initializers -fno-strict-aliasing -mssse3 -I../../dpdk/dpdk/x86_64-native-linuxapp-gcc/include -D_FILE_OFFSET_BITS=64 -g -O2 -Wno-cast-align -o ovn/utilities/ovn-trace ovn/utilities/ovn-trace.o  -L../../dpdk/dpdk/x86_64-native-linuxapp-gcc/lib ovn/lib/.libs/libovn.a ovsdb/.libs/libovsdb.a lib/.libs/libopenvswitch.a -lssl -lcrypto -ldpdk -ldl -lpthread -lrt -lm -lnuma\n'
2017-12-13 10:21:29,290 [DEBUG] yardstick.ssh.kvm.LF-1d3ec479 ssh.py:294 stdout: u"depbase=`echo utilities/nlmon.o | sed 's|[^/]*$|.deps/&|;s|\\.o$||'`;\\\ngcc -std=gnu99 -DHAVE_CONFIG_H -I.    -I ./include -I ./include -I ./lib -I ./lib    -Wstrict-prototypes -Wall -Wextra -Wno-sign-compare -Wpointer-arith -Wswitch-enum -Wunused-parameter -Wbad-function-cast -Wcast-align -Wmissing-prototypes -Wmissing-field-initializers -fno-strict-aliasing -mssse3 -I../../dpdk/dpdk/x86_64-native-linuxapp-gcc/include -D_FILE_OFFSET_BITS=64  -g -O2 -Wno-cast-align -MT utilities/nlmon.o -MD -MP -MF $depbase.Tpo -c -o utilities/nlmon.o utilities/nlmon.c &&\\\nmv -f $depbase.Tpo $depbase.Po\n"
2017-12-13 10:21:29,369 [DEBUG] yardstick.ssh.kvm.LF-1d3ec479 ssh.py:294 stdout: u'/bin/sh ./libtool  --tag=CC   --mode=link gcc -std=gnu99 -Wstrict-prototypes -Wall -Wextra -Wno-sign-compare -Wpointer-arith -Wswitch-enum -Wunused-parameter -Wbad-function-cast -Wcast-align -Wmissing-prototypes -Wmissing-field-initializers -fno-strict-aliasing -mssse3 -I../../dpdk/dpdk/x86_64-native-linuxapp-gcc/include -D_FILE_OFFSET_BITS=64  -g -O2 -Wno-cast-align  -L../../dpdk/dpdk/x86_64-native-linuxapp-gcc/lib   -o utilities/nlmon utilities/nlmon.o lib/libopenvswitch.la -ldpdk -ldl -lnuma -lpthread -lrt -lm  -lnuma\n'
2017-12-13 10:21:29,444 [DEBUG] yardstick.ssh.kvm.LF-1d3ec479 ssh.py:294 stdout: u'libtool: link: gcc -std=gnu99 -Wstrict-prototypes -Wall -Wextra -Wno-sign-compare -Wpointer-arith -Wswitch-enum -Wunused-parameter -Wbad-function-cast -Wcast-align -Wmissing-prototypes -Wmissing-field-initializers -fno-strict-aliasing -mssse3 -I../../dpdk/dpdk/x86_64-native-linuxapp-gcc/include -D_FILE_OFFSET_BITS=64 -g -O2 -Wno-cast-align -o utilities/nlmon utilities/nlmon.o  -L../../dpdk/dpdk/x86_64-native-linuxapp-gcc/lib lib/.libs/libopenvswitch.a -lssl -lcrypto -ldpdk -ldl -lpthread -lrt -lm -lnuma\n'
2017-12-13 10:21:29,666 [DEBUG] yardstick.ssh.kvm.LF-1d3ec479 ssh.py:294 stdout: u"depbase=`echo tests/test-ovsdb.o | sed 's|[^/]*$|.deps/&|;s|\\.o$||'`;\\\ngcc -std=gnu99 -DHAVE_CONFIG_H -I.    -I ./include -I ./include -I ./lib -I ./lib    -Wstrict-prototypes -Wall -Wextra -Wno-sign-compare -Wpointer-arith -Wswitch-enum -Wunused-parameter -Wbad-function-cast -Wcast-align -Wmissing-prototypes -Wmissing-field-initializers -fno-strict-aliasing -mssse3 -I../../dpdk/dpdk/x86_64-native-linuxapp-gcc/include -D_FILE_OFFSET_BITS=64  -g -O2 -Wno-cast-align -MT tests/test-ovsdb.o -MD -MP -MF $depbase.Tpo -c -o tests/test-ovsdb.o tests/test-ovsdb.c &&\\\nmv -f $depbase.Tpo $depbase.Po\n"
2017-12-13 10:21:30,618 [DEBUG] yardstick.ssh.kvm.LF-1d3ec479 ssh.py:294 stdout: u"depbase=`echo tests/idltest.o | sed 's|[^/]*$|.deps/&|;s|\\.o$||'`;\\\ngcc -std=gnu99 -DHAVE_CONFIG_H -I.    -I ./include -I ./include -I ./lib -I ./lib    -Wstrict-prototypes -Wall -Wextra -Wno-sign-compare -Wpointer-arith -Wswitch-enum -Wunused-parameter -Wbad-function-cast -Wcast-align -Wmissing-prototypes -Wmissing-field-initializers -fno-strict-aliasing -mssse3 -I../../dpdk/dpdk/x86_64-native-linuxapp-gcc/include -D_FILE_OFFSET_BITS=64  -g -O2 -Wno-cast-align -MT tests/idltest.o -MD -MP -MF $depbase.Tpo -c -o tests/idltest.o tests/idltest.c &&\\\nmv -f $depbase.Tpo $depbase.Po\n"
2017-12-13 10:21:31,618 [DEBUG] yardstick.ssh.kvm.LF-1d3ec479 ssh.py:294 stdout: u'/bin/sh ./libtool  --tag=CC   --mode=link gcc -std=gnu99 -Wstrict-prototypes -Wall -Wextra -Wno-sign-compare -Wpointer-arith -Wswitch-enum -Wunused-parameter -Wbad-function-cast -Wcast-align -Wmissing-prototypes -Wmissing-field-initializers -fno-strict-aliasing -mssse3 -I../../dpdk/dpdk/x86_64-native-linuxapp-gcc/include -D_FILE_OFFSET_BITS=64  -g -O2 -Wno-cast-align  -L../../dpdk/dpdk/x86_64-native-linuxapp-gcc/lib   -o tests/test-ovsdb tests/test-ovsdb.o tests/idltest.o ovsdb/libovsdb.la lib/libopenvswitch.la -ldpdk -ldl -lnuma -lpthread -lrt -lm  -lnuma\n'
2017-12-13 10:21:31,702 [DEBUG] yardstick.ssh.kvm.LF-1d3ec479 ssh.py:294 stdout: u'libtool: link: gcc -std=gnu99 -Wstrict-prototypes -Wall -Wextra -Wno-sign-compare -Wpointer-arith -Wswitch-enum -Wunused-parameter -Wbad-function-cast -Wcast-align -Wmissing-prototypes -Wmissing-field-initializers -fno-strict-aliasing -mssse3 -I../../dpdk/dpdk/x86_64-native-linuxapp-gcc/include -D_FILE_OFFSET_BITS=64 -g -O2 -Wno-cast-align -o tests/test-ovsdb tests/test-ovsdb.o tests/idltest.o  -L../../dpdk/dpdk/x86_64-native-linuxapp-gcc/lib ovsdb/.libs/libovsdb.a lib/.libs/libopenvswitch.a -lssl -lcrypto -ldpdk -ldl -lpthread -lrt -lm -lnuma\n'
2017-12-13 10:21:31,955 [DEBUG] yardstick.ssh.kvm.LF-1d3ec479 ssh.py:294 stdout: u"depbase=`echo tests/test-lib.o | sed 's|[^/]*$|.deps/&|;s|\\.o$||'`;\\\ngcc -std=gnu99 -DHAVE_CONFIG_H -I.    -I ./include -I ./include -I ./lib -I ./lib    -Wstrict-prototypes -Wall -Wextra -Wno-sign-compare -Wpointer-arith -Wswitch-enum -Wunused-parameter -Wbad-function-cast -Wcast-align -Wmissing-prototypes -Wmissing-field-initializers -fno-strict-aliasing -mssse3 -I../../dpdk/dpdk/x86_64-native-linuxapp-gcc/include -D_FILE_OFFSET_BITS=64  -g -O2 -Wno-cast-align -MT tests/test-lib.o -MD -MP -MF $depbase.Tpo -c -o tests/test-lib.o tests/test-lib.c &&\\\nmv -f $depbase.Tpo $depbase.Po\n"
2017-12-13 10:21:32,009 [DEBUG] yardstick.ssh.kvm.LF-1d3ec479 ssh.py:294 stdout: u'/bin/sh ./libtool  --tag=CC   --mode=link gcc -std=gnu99 -Wstrict-prototypes -Wall -Wextra -Wno-sign-compare -Wpointer-arith -Wswitch-enum -Wunused-parameter -Wbad-function-cast -Wcast-align -Wmissing-prototypes -Wmissing-field-initializers -fno-strict-aliasing -mssse3 -I../../dpdk/dpdk/x86_64-native-linuxapp-gcc/include -D_FILE_OFFSET_BITS=64  -g -O2 -Wno-cast-align  -L../../dpdk/dpdk/x86_64-native-linuxapp-gcc/lib   -o tests/test-lib tests/test-lib.o lib/libopenvswitch.la -ldpdk -ldl -lnuma -lpthread -lrt -lm  -lnuma\n'
2017-12-13 10:21:32,082 [DEBUG] yardstick.ssh.kvm.LF-1d3ec479 ssh.py:294 stdout: u'libtool: link: gcc -std=gnu99 -Wstrict-prototypes -Wall -Wextra -Wno-sign-compare -Wpointer-arith -Wswitch-enum -Wunused-parameter -Wbad-function-cast -Wcast-align -Wmissing-prototypes -Wmissing-field-initializers -fno-strict-aliasing -mssse3 -I../../dpdk/dpdk/x86_64-native-linuxapp-gcc/include -D_FILE_OFFSET_BITS=64 -g -O2 -Wno-cast-align -o tests/test-lib tests/test-lib.o  -L../../dpdk/dpdk/x86_64-native-linuxapp-gcc/lib lib/.libs/libopenvswitch.a -lssl -lcrypto -ldpdk -ldl -lpthread -lrt -lm -lnuma\n'
2017-12-13 10:21:32,304 [DEBUG] yardstick.ssh.kvm.LF-1d3ec479 ssh.py:294 stdout: u"depbase=`echo tests/dpdk/ring_client.o | sed 's|[^/]*$|.deps/&|;s|\\.o$||'`;\\\ngcc -std=gnu99 -DHAVE_CONFIG_H -I.    -I ./include -I ./include -I ./lib -I ./lib    -Wstrict-prototypes -Wall -Wextra -Wno-sign-compare -Wpointer-arith -Wswitch-enum -Wunused-parameter -Wbad-function-cast -Wcast-align -Wmissing-prototypes -Wmissing-field-initializers -fno-strict-aliasing -mssse3 -I../../dpdk/dpdk/x86_64-native-linuxapp-gcc/include -D_FILE_OFFSET_BITS=64  -g -O2 -Wno-cast-align -MT tests/dpdk/ring_client.o -MD -MP -MF $depbase.Tpo -c -o tests/dpdk/ring_client.o tests/dpdk/ring_client.c &&\\\nmv -f $depbase.Tpo $depbase.Po\n"
2017-12-13 10:21:32,507 [DEBUG] yardstick.ssh.kvm.LF-1d3ec479 ssh.py:294 stdout: u'/bin/sh ./libtool  --tag=CC   --mode=link gcc -std=gnu99 -Wstrict-prototypes -Wall -Wextra -Wno-sign-compare -Wpointer-arith -Wswitch-enum -Wunused-parameter -Wbad-function-cast -Wcast-align -Wmissing-prototypes -Wmissing-field-initializers -fno-strict-aliasing -mssse3 -I../../dpdk/dpdk/x86_64-native-linuxapp-gcc/include -D_FILE_OFFSET_BITS=64  -g -O2 -Wno-cast-align  -L../../dpdk/dpdk/x86_64-native-linuxapp-gcc/lib   -o tests/test-dpdkr tests/dpdk/ring_client.o lib/libopenvswitch.la -ldpdk -ldl -lnuma -lpthread -lrt -lm  -lnuma -ldpdk -ldl -lnuma -lpthread -lrt -lm  -lnuma\n'
2017-12-13 10:21:32,584 [DEBUG] yardstick.ssh.kvm.LF-1d3ec479 ssh.py:294 stdout: u'libtool: link: gcc -std=gnu99 -Wstrict-prototypes -Wall -Wextra -Wno-sign-compare -Wpointer-arith -Wswitch-enum -Wunused-parameter -Wbad-function-cast -Wcast-align -Wmissing-prototypes -Wmissing-field-initializers -fno-strict-aliasing -mssse3 -I../../dpdk/dpdk/x86_64-native-linuxapp-gcc/include -D_FILE_OFFSET_BITS=64 -g -O2 -Wno-cast-align -o tests/test-dpdkr tests/dpdk/ring_client.o  -L../../dpdk/dpdk/x86_64-native-linuxapp-gcc/lib lib/.libs/libopenvswitch.a -lssl -lcrypto -ldpdk -ldl -lpthread -lrt -lm -lnuma\n'
2017-12-13 10:21:32,807 [DEBUG] yardstick.ssh.kvm.LF-1d3ec479 ssh.py:294 stdout: u"depbase=`echo tests/ovstest.o | sed 's|[^/]*$|.deps/&|;s|\\.o$||'`;\\\ngcc -std=gnu99 -DHAVE_CONFIG_H -I.    -I ./include -I ./include -I ./lib -I ./lib    -Wstrict-prototypes -Wall -Wextra -Wno-sign-compare -Wpointer-arith -Wswitch-enum -Wunused-parameter -Wbad-function-cast -Wcast-align -Wmissing-prototypes -Wmissing-field-initializers -fno-strict-aliasing -mssse3 -I../../dpdk/dpdk/x86_64-native-linuxapp-gcc/include -D_FILE_OFFSET_BITS=64  -g -O2 -Wno-cast-align -MT tests/ovstest.o -MD -MP -MF $depbase.Tpo -c -o tests/ovstest.o tests/ovstest.c &&\\\nmv -f $depbase.Tpo $depbase.Po\n"
2017-12-13 10:21:32,891 [DEBUG] yardstick.ssh.kvm.LF-1d3ec479 ssh.py:294 stdout: u"depbase=`echo tests/test-aes128.o | sed 's|[^/]*$|.deps/&|;s|\\.o$||'`;\\\ngcc -std=gnu99 -DHAVE_CONFIG_H -I.    -I ./include -I ./include -I ./lib -I ./lib    -Wstrict-prototypes -Wall -Wextra -Wno-sign-compare -Wpointer-arith -Wswitch-enum -Wunused-parameter -Wbad-function-cast -Wcast-align -Wmissing-prototypes -Wmissing-field-initializers -fno-strict-aliasing -mssse3 -I../../dpdk/dpdk/x86_64-native-linuxapp-gcc/include -D_FILE_OFFSET_BITS=64  -g -O2 -Wno-cast-align -MT tests/test-aes128.o -MD -MP -MF $depbase.Tpo -c -o tests/test-aes128.o tests/test-aes128.c &&\\\nmv -f $depbase.Tpo $depbase.Po\n"
2017-12-13 10:21:32,947 [DEBUG] yardstick.ssh.kvm.LF-1d3ec479 ssh.py:294 stdout: u"depbase=`echo tests/test-atomic.o | sed 's|[^/]*$|.deps/&|;s|\\.o$||'`;\\\ngcc -std=gnu99 -DHAVE_CONFIG_H -I.    -I ./include -I ./include -I ./lib -I ./lib    -Wstrict-prototypes -Wall -Wextra -Wno-sign-compare -Wpointer-arith -Wswitch-enum -Wunused-parameter -Wbad-function-cast -Wcast-align -Wmissing-prototypes -Wmissing-field-initializers -fno-strict-aliasing -mssse3 -I../../dpdk/dpdk/x86_64-native-linuxapp-gcc/include -D_FILE_OFFSET_BITS=64  -g -O2 -Wno-cast-align -MT tests/test-atomic.o -MD -MP -MF $depbase.Tpo -c -o tests/test-atomic.o tests/test-atomic.c &&\\\nmv -f $depbase.Tpo $depbase.Po\n"
2017-12-13 10:21:33,937 [DEBUG] yardstick.ssh.kvm.LF-1d3ec479 ssh.py:294 stdout: u"depbase=`echo tests/test-bundle.o | sed 's|[^/]*$|.deps/&|;s|\\.o$||'`;\\\ngcc -std=gnu99 -DHAVE_CONFIG_H -I.    -I ./include -I ./include -I ./lib -I ./lib    -Wstrict-prototypes -Wall -Wextra -Wno-sign-compare -Wpointer-arith -Wswitch-enum -Wunused-parameter -Wbad-function-cast -Wcast-align -Wmissing-prototypes -Wmissing-field-initializers -fno-strict-aliasing -mssse3 -I../../dpdk/dpdk/x86_64-native-linuxapp-gcc/include -D_FILE_OFFSET_BITS=64  -g -O2 -Wno-cast-align -MT tests/test-bundle.o -MD -MP -MF $depbase.Tpo -c -o tests/test-bundle.o tests/test-bundle.c &&\\\nmv -f $depbase.Tpo $depbase.Po\n"
2017-12-13 10:21:34,133 [DEBUG] yardstick.ssh.kvm.LF-1d3ec479 ssh.py:294 stdout: u"depbase=`echo tests/test-classifier.o | sed 's|[^/]*$|.deps/&|;s|\\.o$||'`;\\\ngcc -std=gnu99 -DHAVE_CONFIG_H -I.    -I ./include -I ./include -I ./lib -I ./lib    -Wstrict-prototypes -Wall -Wextra -Wno-sign-compare -Wpointer-arith -Wswitch-enum -Wunused-parameter -Wbad-function-cast -Wcast-align -Wmissing-prototypes -Wmissing-field-initializers -fno-strict-aliasing -mssse3 -I../../dpdk/dpdk/x86_64-native-linuxapp-gcc/include -D_FILE_OFFSET_BITS=64  -g -O2 -Wno-cast-align -MT tests/test-classifier.o -MD -MP -MF $depbase.Tpo -c -o tests/test-classifier.o tests/test-classifier.c &&\\\nmv -f $depbase.Tpo $depbase.Po\n"
2017-12-13 10:21:34,956 [DEBUG] yardstick.ssh.kvm.LF-1d3ec479 ssh.py:294 stdout: u"depbase=`echo tests/test-ccmap.o | sed 's|[^/]*$|.deps/&|;s|\\.o$||'`;\\\ngcc -std=gnu99 -DHAVE_CONFIG_H -I.    -I ./include -I ./include -I ./lib -I ./lib    -Wstrict-prototypes -Wall -Wextra -Wno-sign-compare -Wpointer-arith -Wswitch-enum -Wunused-parameter -Wbad-function-cast -Wcast-align -Wmissing-prototypes -Wmissing-field-initializers -fno-strict-aliasing -mssse3 -I../../dpdk/dpdk/x86_64-native-linuxapp-gcc/include -D_FILE_OFFSET_BITS=64  -g -O2 -Wno-cast-align -MT tests/test-ccmap.o -MD -MP -MF $depbase.Tpo -c -o tests/test-ccmap.o tests/test-ccmap.c &&\\\nmv -f $depbase.Tpo $depbase.Po\n"
2017-12-13 10:21:35,104 [DEBUG] yardstick.ssh.kvm.LF-1d3ec479 ssh.py:294 stdout: u"depbase=`echo tests/test-cmap.o | sed 's|[^/]*$|.deps/&|;s|\\.o$||'`;\\\ngcc -std=gnu99 -DHAVE_CONFIG_H -I.    -I ./include -I ./include -I ./lib -I ./lib    -Wstrict-prototypes -Wall -Wextra -Wno-sign-compare -Wpointer-arith -Wswitch-enum -Wunused-parameter -Wbad-function-cast -Wcast-align -Wmissing-prototypes -Wmissing-field-initializers -fno-strict-aliasing -mssse3 -I../../dpdk/dpdk/x86_64-native-linuxapp-gcc/include -D_FILE_OFFSET_BITS=64  -g -O2 -Wno-cast-align -MT tests/test-cmap.o -MD -MP -MF $depbase.Tpo -c -o tests/test-cmap.o tests/test-cmap.c &&\\\nmv -f $depbase.Tpo $depbase.Po\n"
2017-12-13 10:21:35,428 [DEBUG] yardstick.ssh.kvm.LF-1d3ec479 ssh.py:294 stdout: u"depbase=`echo tests/test-conntrack.o | sed 's|[^/]*$|.deps/&|;s|\\.o$||'`;\\\ngcc -std=gnu99 -DHAVE_CONFIG_H -I.    -I ./include -I ./include -I ./lib -I ./lib    -Wstrict-prototypes -Wall -Wextra -Wno-sign-compare -Wpointer-arith -Wswitch-enum -Wunused-parameter -Wbad-function-cast -Wcast-align -Wmissing-prototypes -Wmissing-field-initializers -fno-strict-aliasing -mssse3 -I../../dpdk/dpdk/x86_64-native-linuxapp-gcc/include -D_FILE_OFFSET_BITS=64  -g -O2 -Wno-cast-align -MT tests/test-conntrack.o -MD -MP -MF $depbase.Tpo -c -o tests/test-conntrack.o tests/test-conntrack.c &&\\\nmv -f $depbase.Tpo $depbase.Po\n"
2017-12-13 10:21:35,623 [DEBUG] yardstick.ssh.kvm.LF-1d3ec479 ssh.py:294 stdout: u"depbase=`echo tests/test-csum.o | sed 's|[^/]*$|.deps/&|;s|\\.o$||'`;\\\ngcc -std=gnu99 -DHAVE_CONFIG_H -I.    -I ./include -I ./include -I ./lib -I ./lib    -Wstrict-prototypes -Wall -Wextra -Wno-sign-compare -Wpointer-arith -Wswitch-enum -Wunused-parameter -Wbad-function-cast -Wcast-align -Wmissing-prototypes -Wmissing-field-initializers -fno-strict-aliasing -mssse3 -I../../dpdk/dpdk/x86_64-native-linuxapp-gcc/include -D_FILE_OFFSET_BITS=64  -g -O2 -Wno-cast-align -MT tests/test-csum.o -MD -MP -MF $depbase.Tpo -c -o tests/test-csum.o tests/test-csum.c &&\\\nmv -f $depbase.Tpo $depbase.Po\n"
2017-12-13 10:21:35,764 [DEBUG] yardstick.ssh.kvm.LF-1d3ec479 ssh.py:294 stdout: u"depbase=`echo tests/test-flows.o | sed 's|[^/]*$|.deps/&|;s|\\.o$||'`;\\\ngcc -std=gnu99 -DHAVE_CONFIG_H -I.    -I ./include -I ./include -I ./lib -I ./lib    -Wstrict-prototypes -Wall -Wextra -Wno-sign-compare -Wpointer-arith -Wswitch-enum -Wunused-parameter -Wbad-function-cast -Wcast-align -Wmissing-prototypes -Wmissing-field-initializers -fno-strict-aliasing -mssse3 -I../../dpdk/dpdk/x86_64-native-linuxapp-gcc/include -D_FILE_OFFSET_BITS=64  -g -O2 -Wno-cast-align -MT tests/test-flows.o -MD -MP -MF $depbase.Tpo -c -o tests/test-flows.o tests/test-flows.c &&\\\nmv -f $depbase.Tpo $depbase.Po\n"
2017-12-13 10:21:35,922 [DEBUG] yardstick.ssh.kvm.LF-1d3ec479 ssh.py:294 stdout: u"depbase=`echo tests/test-hash.o | sed 's|[^/]*$|.deps/&|;s|\\.o$||'`;\\\ngcc -std=gnu99 -DHAVE_CONFIG_H -I.    -I ./include -I ./include -I ./lib -I ./lib    -Wstrict-prototypes -Wall -Wextra -Wno-sign-compare -Wpointer-arith -Wswitch-enum -Wunused-parameter -Wbad-function-cast -Wcast-align -Wmissing-prototypes -Wmissing-field-initializers -fno-strict-aliasing -mssse3 -I../../dpdk/dpdk/x86_64-native-linuxapp-gcc/include -D_FILE_OFFSET_BITS=64  -g -O2 -Wno-cast-align -MT tests/test-hash.o -MD -MP -MF $depbase.Tpo -c -o tests/test-hash.o tests/test-hash.c &&\\\nmv -f $depbase.Tpo $depbase.Po\n"
2017-12-13 10:21:36,050 [DEBUG] yardstick.ssh.kvm.LF-1d3ec479 ssh.py:294 stdout: u"depbase=`echo tests/test-heap.o | sed 's|[^/]*$|.deps/&|;s|\\.o$||'`;\\\ngcc -std=gnu99 -DHAVE_CONFIG_H -I.    -I ./include -I ./include -I ./lib -I ./lib    -Wstrict-prototypes -Wall -Wextra -Wno-sign-compare -Wpointer-arith -Wswitch-enum -Wunused-parameter -Wbad-function-cast -Wcast-align -Wmissing-prototypes -Wmissing-field-initializers -fno-strict-aliasing -mssse3 -I../../dpdk/dpdk/x86_64-native-linuxapp-gcc/include -D_FILE_OFFSET_BITS=64  -g -O2 -Wno-cast-align -MT tests/test-heap.o -MD -MP -MF $depbase.Tpo -c -o tests/test-heap.o tests/test-heap.c &&\\\nmv -f $depbase.Tpo $depbase.Po\n"
2017-12-13 10:21:36,240 [DEBUG] yardstick.ssh.kvm.LF-1d3ec479 ssh.py:294 stdout: u"depbase=`echo tests/test-hindex.o | sed 's|[^/]*$|.deps/&|;s|\\.o$||'`;\\\ngcc -std=gnu99 -DHAVE_CONFIG_H -I.    -I ./include -I ./include -I ./lib -I ./lib    -Wstrict-prototypes -Wall -Wextra -Wno-sign-compare -Wpointer-arith -Wswitch-enum -Wunused-parameter -Wbad-function-cast -Wcast-align -Wmissing-prototypes -Wmissing-field-initializers -fno-strict-aliasing -mssse3 -I../../dpdk/dpdk/x86_64-native-linuxapp-gcc/include -D_FILE_OFFSET_BITS=64  -g -O2 -Wno-cast-align -MT tests/test-hindex.o -MD -MP -MF $depbase.Tpo -c -o tests/test-hindex.o tests/test-hindex.c &&\\\nmv -f $depbase.Tpo $depbase.Po\n"
2017-12-13 10:21:36,382 [DEBUG] yardstick.ssh.kvm.LF-1d3ec479 ssh.py:294 stdout: u"depbase=`echo tests/test-hmap.o | sed 's|[^/]*$|.deps/&|;s|\\.o$||'`;\\\ngcc -std=gnu99 -DHAVE_CONFIG_H -I.    -I ./include -I ./include -I ./lib -I ./lib    -Wstrict-prototypes -Wall -Wextra -Wno-sign-compare -Wpointer-arith -Wswitch-enum -Wunused-parameter -Wbad-function-cast -Wcast-align -Wmissing-prototypes -Wmissing-field-initializers -fno-strict-aliasing -mssse3 -I../../dpdk/dpdk/x86_64-native-linuxapp-gcc/include -D_FILE_OFFSET_BITS=64  -g -O2 -Wno-cast-align -MT tests/test-hmap.o -MD -MP -MF $depbase.Tpo -c -o tests/test-hmap.o tests/test-hmap.c &&\\\nmv -f $depbase.Tpo $depbase.Po\n"
2017-12-13 10:21:36,577 [DEBUG] yardstick.ssh.kvm.LF-1d3ec479 ssh.py:294 stdout: u"depbase=`echo tests/test-json.o | sed 's|[^/]*$|.deps/&|;s|\\.o$||'`;\\\ngcc -std=gnu99 -DHAVE_CONFIG_H -I.    -I ./include -I ./include -I ./lib -I ./lib    -Wstrict-prototypes -Wall -Wextra -Wno-sign-compare -Wpointer-arith -Wswitch-enum -Wunused-parameter -Wbad-function-cast -Wcast-align -Wmissing-prototypes -Wmissing-field-initializers -fno-strict-aliasing -mssse3 -I../../dpdk/dpdk/x86_64-native-linuxapp-gcc/include -D_FILE_OFFSET_BITS=64  -g -O2 -Wno-cast-align -MT tests/test-json.o -MD -MP -MF $depbase.Tpo -c -o tests/test-json.o tests/test-json.c &&\\\nmv -f $depbase.Tpo $depbase.Po\n"
2017-12-13 10:21:36,652 [DEBUG] yardstick.ssh.kvm.LF-1d3ec479 ssh.py:294 stdout: u"depbase=`echo tests/test-jsonrpc.o | sed 's|[^/]*$|.deps/&|;s|\\.o$||'`;\\\ngcc -std=gnu99 -DHAVE_CONFIG_H -I.    -I ./include -I ./include -I ./lib -I ./lib    -Wstrict-prototypes -Wall -Wextra -Wno-sign-compare -Wpointer-arith -Wswitch-enum -Wunused-parameter -Wbad-function-cast -Wcast-align -Wmissing-prototypes -Wmissing-field-initializers -fno-strict-aliasing -mssse3 -I../../dpdk/dpdk/x86_64-native-linuxapp-gcc/include -D_FILE_OFFSET_BITS=64  -g -O2 -Wno-cast-align -MT tests/test-jsonrpc.o -MD -MP -MF $depbase.Tpo -c -o tests/test-jsonrpc.o tests/test-jsonrpc.c &&\\\nmv -f $depbase.Tpo $depbase.Po\n"
2017-12-13 10:21:36,773 [DEBUG] yardstick.ssh.kvm.LF-1d3ec479 ssh.py:294 stdout: u"depbase=`echo tests/test-list.o | sed 's|[^/]*$|.deps/&|;s|\\.o$||'`;\\\ngcc -std=gnu99 -DHAVE_CONFIG_H -I.    -I ./include -I ./include -I ./lib -I ./lib    -Wstrict-prototypes -Wall -Wextra -Wno-sign-compare -Wpointer-arith -Wswitch-enum -Wunused-parameter -Wbad-function-cast -Wcast-align -Wmissing-prototypes -Wmissing-field-initializers -fno-strict-aliasing -mssse3 -I../../dpdk/dpdk/x86_64-native-linuxapp-gcc/include -D_FILE_OFFSET_BITS=64  -g -O2 -Wno-cast-align -MT tests/test-list.o -MD -MP -MF $depbase.Tpo -c -o tests/test-list.o tests/test-list.c &&\\\nmv -f $depbase.Tpo $depbase.Po\n"
2017-12-13 10:21:36,901 [DEBUG] yardstick.ssh.kvm.LF-1d3ec479 ssh.py:294 stdout: u"depbase=`echo tests/test-lockfile.o | sed 's|[^/]*$|.deps/&|;s|\\.o$||'`;\\\ngcc -std=gnu99 -DHAVE_CONFIG_H -I.    -I ./include -I ./include -I ./lib -I ./lib    -Wstrict-prototypes -Wall -Wextra -Wno-sign-compare -Wpointer-arith -Wswitch-enum -Wunused-parameter -Wbad-function-cast -Wcast-align -Wmissing-prototypes -Wmissing-field-initializers -fno-strict-aliasing -mssse3 -I../../dpdk/dpdk/x86_64-native-linuxapp-gcc/include -D_FILE_OFFSET_BITS=64  -g -O2 -Wno-cast-align -MT tests/test-lockfile.o -MD -MP -MF $depbase.Tpo -c -o tests/test-lockfile.o tests/test-lockfile.c &&\\\nmv -f $depbase.Tpo $depbase.Po\n"
2017-12-13 10:21:37,052 [DEBUG] yardstick.ssh.kvm.LF-1d3ec479 ssh.py:294 stdout: u"depbase=`echo tests/test-multipath.o | sed 's|[^/]*$|.deps/&|;s|\\.o$||'`;\\\ngcc -std=gnu99 -DHAVE_CONFIG_H -I.    -I ./include -I ./include -I ./lib -I ./lib    -Wstrict-prototypes -Wall -Wextra -Wno-sign-compare -Wpointer-arith -Wswitch-enum -Wunused-parameter -Wbad-function-cast -Wcast-align -Wmissing-prototypes -Wmissing-field-initializers -fno-strict-aliasing -mssse3 -I../../dpdk/dpdk/x86_64-native-linuxapp-gcc/include -D_FILE_OFFSET_BITS=64  -g -O2 -Wno-cast-align -MT tests/test-multipath.o -MD -MP -MF $depbase.Tpo -c -o tests/test-multipath.o tests/test-multipath.c &&\\\nmv -f $depbase.Tpo $depbase.Po\n"
2017-12-13 10:21:37,187 [DEBUG] yardstick.ssh.kvm.LF-1d3ec479 ssh.py:294 stdout: u"depbase=`echo tests/test-netflow.o | sed 's|[^/]*$|.deps/&|;s|\\.o$||'`;\\\ngcc -std=gnu99 -DHAVE_CONFIG_H -I.    -I ./include -I ./include -I ./lib -I ./lib    -Wstrict-prototypes -Wall -Wextra -Wno-sign-compare -Wpointer-arith -Wswitch-enum -Wunused-parameter -Wbad-function-cast -Wcast-align -Wmissing-prototypes -Wmissing-field-initializers -fno-strict-aliasing -mssse3 -I../../dpdk/dpdk/x86_64-native-linuxapp-gcc/include -D_FILE_OFFSET_BITS=64  -g -O2 -Wno-cast-align -MT tests/test-netflow.o -MD -MP -MF $depbase.Tpo -c -o tests/test-netflow.o tests/test-netflow.c &&\\\nmv -f $depbase.Tpo $depbase.Po\n"
2017-12-13 10:21:37,338 [DEBUG] yardstick.ssh.kvm.LF-1d3ec479 ssh.py:294 stdout: u"depbase=`echo tests/test-odp.o | sed 's|[^/]*$|.deps/&|;s|\\.o$||'`;\\\ngcc -std=gnu99 -DHAVE_CONFIG_H -I.    -I ./include -I ./include -I ./lib -I ./lib    -Wstrict-prototypes -Wall -Wextra -Wno-sign-compare -Wpointer-arith -Wswitch-enum -Wunused-parameter -Wbad-function-cast -Wcast-align -Wmissing-prototypes -Wmissing-field-initializers -fno-strict-aliasing -mssse3 -I../../dpdk/dpdk/x86_64-native-linuxapp-gcc/include -D_FILE_OFFSET_BITS=64  -g -O2 -Wno-cast-align -MT tests/test-odp.o -MD -MP -MF $depbase.Tpo -c -o tests/test-odp.o tests/test-odp.c &&\\\nmv -f $depbase.Tpo $depbase.Po\n"
2017-12-13 10:21:37,461 [DEBUG] yardstick.ssh.kvm.LF-1d3ec479 ssh.py:294 stdout: u"depbase=`echo tests/test-ofpbuf.o | sed 's|[^/]*$|.deps/&|;s|\\.o$||'`;\\\ngcc -std=gnu99 -DHAVE_CONFIG_H -I.    -I ./include -I ./include -I ./lib -I ./lib    -Wstrict-prototypes -Wall -Wextra -Wno-sign-compare -Wpointer-arith -Wswitch-enum -Wunused-parameter -Wbad-function-cast -Wcast-align -Wmissing-prototypes -Wmissing-field-initializers -fno-strict-aliasing -mssse3 -I../../dpdk/dpdk/x86_64-native-linuxapp-gcc/include -D_FILE_OFFSET_BITS=64  -g -O2 -Wno-cast-align -MT tests/test-ofpbuf.o -MD -MP -MF $depbase.Tpo -c -o tests/test-ofpbuf.o tests/test-ofpbuf.c &&\\\nmv -f $depbase.Tpo $depbase.Po\n"
2017-12-13 10:21:37,518 [DEBUG] yardstick.ssh.kvm.LF-1d3ec479 ssh.py:294 stdout: u"depbase=`echo tests/test-ovn.o | sed 's|[^/]*$|.deps/&|;s|\\.o$||'`;\\\ngcc -std=gnu99 -DHAVE_CONFIG_H -I.    -I ./include -I ./include -I ./lib -I ./lib    -Wstrict-prototypes -Wall -Wextra -Wno-sign-compare -Wpointer-arith -Wswitch-enum -Wunused-parameter -Wbad-function-cast -Wcast-align -Wmissing-prototypes -Wmissing-field-initializers -fno-strict-aliasing -mssse3 -I../../dpdk/dpdk/x86_64-native-linuxapp-gcc/include -D_FILE_OFFSET_BITS=64  -g -O2 -Wno-cast-align -MT tests/test-ovn.o -MD -MP -MF $depbase.Tpo -c -o tests/test-ovn.o tests/test-ovn.c &&\\\nmv -f $depbase.Tpo $depbase.Po\n"
2017-12-13 10:21:38,031 [DEBUG] yardstick.ssh.kvm.LF-1d3ec479 ssh.py:294 stdout: u"depbase=`echo tests/test-packets.o | sed 's|[^/]*$|.deps/&|;s|\\.o$||'`;\\\ngcc -std=gnu99 -DHAVE_CONFIG_H -I.    -I ./include -I ./include -I ./lib -I ./lib    -Wstrict-prototypes -Wall -Wextra -Wno-sign-compare -Wpointer-arith -Wswitch-enum -Wunused-parameter -Wbad-function-cast -Wcast-align -Wmissing-prototypes -Wmissing-field-initializers -fno-strict-aliasing -mssse3 -I../../dpdk/dpdk/x86_64-native-linuxapp-gcc/include -D_FILE_OFFSET_BITS=64  -g -O2 -Wno-cast-align -MT tests/test-packets.o -MD -MP -MF $depbase.Tpo -c -o tests/test-packets.o tests/test-packets.c &&\\\nmv -f $depbase.Tpo $depbase.Po\n"
2017-12-13 10:21:38,162 [DEBUG] yardstick.ssh.kvm.LF-1d3ec479 ssh.py:294 stdout: u"depbase=`echo tests/test-random.o | sed 's|[^/]*$|.deps/&|;s|\\.o$||'`;\\\ngcc -std=gnu99 -DHAVE_CONFIG_H -I.    -I ./include -I ./include -I ./lib -I ./lib    -Wstrict-prototypes -Wall -Wextra -Wno-sign-compare -Wpointer-arith -Wswitch-enum -Wunused-parameter -Wbad-function-cast -Wcast-align -Wmissing-prototypes -Wmissing-field-initializers -fno-strict-aliasing -mssse3 -I../../dpdk/dpdk/x86_64-native-linuxapp-gcc/include -D_FILE_OFFSET_BITS=64  -g -O2 -Wno-cast-align -MT tests/test-random.o -MD -MP -MF $depbase.Tpo -c -o tests/test-random.o tests/test-random.c &&\\\nmv -f $depbase.Tpo $depbase.Po\n"
2017-12-13 10:21:38,213 [DEBUG] yardstick.ssh.kvm.LF-1d3ec479 ssh.py:294 stdout: u"depbase=`echo tests/test-rcu.o | sed 's|[^/]*$|.deps/&|;s|\\.o$||'`;\\\ngcc -std=gnu99 -DHAVE_CONFIG_H -I.    -I ./include -I ./include -I ./lib -I ./lib    -Wstrict-prototypes -Wall -Wextra -Wno-sign-compare -Wpointer-arith -Wswitch-enum -Wunused-parameter -Wbad-function-cast -Wcast-align -Wmissing-prototypes -Wmissing-field-initializers -fno-strict-aliasing -mssse3 -I../../dpdk/dpdk/x86_64-native-linuxapp-gcc/include -D_FILE_OFFSET_BITS=64  -g -O2 -Wno-cast-align -MT tests/test-rcu.o -MD -MP -MF $depbase.Tpo -c -o tests/test-rcu.o tests/test-rcu.c &&\\\nmv -f $depbase.Tpo $depbase.Po\n"
2017-12-13 10:21:38,270 [DEBUG] yardstick.ssh.kvm.LF-1d3ec479 ssh.py:294 stdout: u"depbase=`echo tests/test-reconnect.o | sed 's|[^/]*$|.deps/&|;s|\\.o$||'`;\\\ngcc -std=gnu99 -DHAVE_CONFIG_H -I.    -I ./include -I ./include -I ./lib -I ./lib    -Wstrict-prototypes -Wall -Wextra -Wno-sign-compare -Wpointer-arith -Wswitch-enum -Wunused-parameter -Wbad-function-cast -Wcast-align -Wmissing-prototypes -Wmissing-field-initializers -fno-strict-aliasing -mssse3 -I../../dpdk/dpdk/x86_64-native-linuxapp-gcc/include -D_FILE_OFFSET_BITS=64  -g -O2 -Wno-cast-align -MT tests/test-reconnect.o -MD -MP -MF $depbase.Tpo -c -o tests/test-reconnect.o tests/test-reconnect.c &&\\\nmv -f $depbase.Tpo $depbase.Po\n"
2017-12-13 10:21:38,385 [DEBUG] yardstick.ssh.kvm.LF-1d3ec479 ssh.py:294 stdout: u"depbase=`echo tests/test-rstp.o | sed 's|[^/]*$|.deps/&|;s|\\.o$||'`;\\\ngcc -std=gnu99 -DHAVE_CONFIG_H -I.    -I ./include -I ./include -I ./lib -I ./lib    -Wstrict-prototypes -Wall -Wextra -Wno-sign-compare -Wpointer-arith -Wswitch-enum -Wunused-parameter -Wbad-function-cast -Wcast-align -Wmissing-prototypes -Wmissing-field-initializers -fno-strict-aliasing -mssse3 -I../../dpdk/dpdk/x86_64-native-linuxapp-gcc/include -D_FILE_OFFSET_BITS=64  -g -O2 -Wno-cast-align -MT tests/test-rstp.o -MD -MP -MF $depbase.Tpo -c -o tests/test-rstp.o tests/test-rstp.c &&\\\nmv -f $depbase.Tpo $depbase.Po\n"
2017-12-13 10:21:38,716 [DEBUG] yardstick.ssh.kvm.LF-1d3ec479 ssh.py:294 stdout: u"depbase=`echo tests/test-sflow.o | sed 's|[^/]*$|.deps/&|;s|\\.o$||'`;\\\ngcc -std=gnu99 -DHAVE_CONFIG_H -I.    -I ./include -I ./include -I ./lib -I ./lib    -Wstrict-prototypes -Wall -Wextra -Wno-sign-compare -Wpointer-arith -Wswitch-enum -Wunused-parameter -Wbad-function-cast -Wcast-align -Wmissing-prototypes -Wmissing-field-initializers -fno-strict-aliasing -mssse3 -I../../dpdk/dpdk/x86_64-native-linuxapp-gcc/include -D_FILE_OFFSET_BITS=64  -g -O2 -Wno-cast-align -MT tests/test-sflow.o -MD -MP -MF $depbase.Tpo -c -o tests/test-sflow.o tests/test-sflow.c &&\\\nmv -f $depbase.Tpo $depbase.Po\n"
2017-12-13 10:21:39,016 [DEBUG] yardstick.ssh.kvm.LF-1d3ec479 ssh.py:294 stdout: u"depbase=`echo tests/test-sha1.o | sed 's|[^/]*$|.deps/&|;s|\\.o$||'`;\\\ngcc -std=gnu99 -DHAVE_CONFIG_H -I.    -I ./include -I ./include -I ./lib -I ./lib    -Wstrict-prototypes -Wall -Wextra -Wno-sign-compare -Wpointer-arith -Wswitch-enum -Wunused-parameter -Wbad-function-cast -Wcast-align -Wmissing-prototypes -Wmissing-field-initializers -fno-strict-aliasing -mssse3 -I../../dpdk/dpdk/x86_64-native-linuxapp-gcc/include -D_FILE_OFFSET_BITS=64  -g -O2 -Wno-cast-align -MT tests/test-sha1.o -MD -MP -MF $depbase.Tpo -c -o tests/test-sha1.o tests/test-sha1.c &&\\\nmv -f $depbase.Tpo $depbase.Po\n"
2017-12-13 10:21:39,080 [DEBUG] yardstick.ssh.kvm.LF-1d3ec479 ssh.py:294 stdout: u"depbase=`echo tests/test-stp.o | sed 's|[^/]*$|.deps/&|;s|\\.o$||'`;\\\ngcc -std=gnu99 -DHAVE_CONFIG_H -I.    -I ./include -I ./include -I ./lib -I ./lib    -Wstrict-prototypes -Wall -Wextra -Wno-sign-compare -Wpointer-arith -Wswitch-enum -Wunused-parameter -Wbad-function-cast -Wcast-align -Wmissing-prototypes -Wmissing-field-initializers -fno-strict-aliasing -mssse3 -I../../dpdk/dpdk/x86_64-native-linuxapp-gcc/include -D_FILE_OFFSET_BITS=64  -g -O2 -Wno-cast-align -MT tests/test-stp.o -MD -MP -MF $depbase.Tpo -c -o tests/test-stp.o tests/test-stp.c &&\\\nmv -f $depbase.Tpo $depbase.Po\n"
2017-12-13 10:21:39,378 [DEBUG] yardstick.ssh.kvm.LF-1d3ec479 ssh.py:294 stdout: u"depbase=`echo tests/test-unixctl.o | sed 's|[^/]*$|.deps/&|;s|\\.o$||'`;\\\ngcc -std=gnu99 -DHAVE_CONFIG_H -I.    -I ./include -I ./include -I ./lib -I ./lib    -Wstrict-prototypes -Wall -Wextra -Wno-sign-compare -Wpointer-arith -Wswitch-enum -Wunused-parameter -Wbad-function-cast -Wcast-align -Wmissing-prototypes -Wmissing-field-initializers -fno-strict-aliasing -mssse3 -I../../dpdk/dpdk/x86_64-native-linuxapp-gcc/include -D_FILE_OFFSET_BITS=64  -g -O2 -Wno-cast-align -MT tests/test-unixctl.o -MD -MP -MF $depbase.Tpo -c -o tests/test-unixctl.o tests/test-unixctl.c &&\\\nmv -f $depbase.Tpo $depbase.Po\n"
2017-12-13 10:21:39,462 [DEBUG] yardstick.ssh.kvm.LF-1d3ec479 ssh.py:294 stdout: u"depbase=`echo tests/test-util.o | sed 's|[^/]*$|.deps/&|;s|\\.o$||'`;\\\ngcc -std=gnu99 -DHAVE_CONFIG_H -I.    -I ./include -I ./include -I ./lib -I ./lib    -Wstrict-prototypes -Wall -Wextra -Wno-sign-compare -Wpointer-arith -Wswitch-enum -Wunused-parameter -Wbad-function-cast -Wcast-align -Wmissing-prototypes -Wmissing-field-initializers -fno-strict-aliasing -mssse3 -I../../dpdk/dpdk/x86_64-native-linuxapp-gcc/include -D_FILE_OFFSET_BITS=64  -g -O2 -Wno-cast-align -MT tests/test-util.o -MD -MP -MF $depbase.Tpo -c -o tests/test-util.o tests/test-util.c &&\\\nmv -f $depbase.Tpo $depbase.Po\n"
2017-12-13 10:21:40,097 [DEBUG] yardstick.ssh.kvm.LF-1d3ec479 ssh.py:294 stdout: u"depbase=`echo tests/test-uuid.o | sed 's|[^/]*$|.deps/&|;s|\\.o$||'`;\\\ngcc -std=gnu99 -DHAVE_CONFIG_H -I.    -I ./include -I ./include -I ./lib -I ./lib    -Wstrict-prototypes -Wall -Wextra -Wno-sign-compare -Wpointer-arith -Wswitch-enum -Wunused-parameter -Wbad-function-cast -Wcast-align -Wmissing-prototypes -Wmissing-field-initializers -fno-strict-aliasing -mssse3 -I../../dpdk/dpdk/x86_64-native-linuxapp-gcc/include -D_FILE_OFFSET_BITS=64  -g -O2 -Wno-cast-align -MT tests/test-uuid.o -MD -MP -MF $depbase.Tpo -c -o tests/test-uuid.o tests/test-uuid.c &&\\\nmv -f $depbase.Tpo $depbase.Po\n"
2017-12-13 10:21:40,146 [DEBUG] yardstick.ssh.kvm.LF-1d3ec479 ssh.py:294 stdout: u"depbase=`echo tests/test-bitmap.o | sed 's|[^/]*$|.deps/&|;s|\\.o$||'`;\\\ngcc -std=gnu99 -DHAVE_CONFIG_H -I.    -I ./include -I ./include -I ./lib -I ./lib    -Wstrict-prototypes -Wall -Wextra -Wno-sign-compare -Wpointer-arith -Wswitch-enum -Wunused-parameter -Wbad-function-cast -Wcast-align -Wmissing-prototypes -Wmissing-field-initializers -fno-strict-aliasing -mssse3 -I../../dpdk/dpdk/x86_64-native-linuxapp-gcc/include -D_FILE_OFFSET_BITS=64  -g -O2 -Wno-cast-align -MT tests/test-bitmap.o -MD -MP -MF $depbase.Tpo -c -o tests/test-bitmap.o tests/test-bitmap.c &&\\\nmv -f $depbase.Tpo $depbase.Po\n"
2017-12-13 10:21:40,288 [DEBUG] yardstick.ssh.kvm.LF-1d3ec479 ssh.py:294 stdout: u"depbase=`echo tests/test-vconn.o | sed 's|[^/]*$|.deps/&|;s|\\.o$||'`;\\\ngcc -std=gnu99 -DHAVE_CONFIG_H -I.    -I ./include -I ./include -I ./lib -I ./lib    -Wstrict-prototypes -Wall -Wextra -Wno-sign-compare -Wpointer-arith -Wswitch-enum -Wunused-parameter -Wbad-function-cast -Wcast-align -Wmissing-prototypes -Wmissing-field-initializers -fno-strict-aliasing -mssse3 -I../../dpdk/dpdk/x86_64-native-linuxapp-gcc/include -D_FILE_OFFSET_BITS=64  -g -O2 -Wno-cast-align -MT tests/test-vconn.o -MD -MP -MF $depbase.Tpo -c -o tests/test-vconn.o tests/test-vconn.c &&\\\nmv -f $depbase.Tpo $depbase.Po\n"
2017-12-13 10:21:40,483 [DEBUG] yardstick.ssh.kvm.LF-1d3ec479 ssh.py:294 stdout: u"depbase=`echo tests/test-aa.o | sed 's|[^/]*$|.deps/&|;s|\\.o$||'`;\\\ngcc -std=gnu99 -DHAVE_CONFIG_H -I.    -I ./include -I ./include -I ./lib -I ./lib    -Wstrict-prototypes -Wall -Wextra -Wno-sign-compare -Wpointer-arith -Wswitch-enum -Wunused-parameter -Wbad-function-cast -Wcast-align -Wmissing-prototypes -Wmissing-field-initializers -fno-strict-aliasing -mssse3 -I../../dpdk/dpdk/x86_64-native-linuxapp-gcc/include -D_FILE_OFFSET_BITS=64  -g -O2 -Wno-cast-align -MT tests/test-aa.o -MD -MP -MF $depbase.Tpo -c -o tests/test-aa.o tests/test-aa.c &&\\\nmv -f $depbase.Tpo $depbase.Po\n"
2017-12-13 10:21:40,658 [DEBUG] yardstick.ssh.kvm.LF-1d3ec479 ssh.py:294 stdout: u"depbase=`echo tests/test-unix-socket.o | sed 's|[^/]*$|.deps/&|;s|\\.o$||'`;\\\ngcc -std=gnu99 -DHAVE_CONFIG_H -I.    -I ./include -I ./include -I ./lib -I ./lib    -Wstrict-prototypes -Wall -Wextra -Wno-sign-compare -Wpointer-arith -Wswitch-enum -Wunused-parameter -Wbad-function-cast -Wcast-align -Wmissing-prototypes -Wmissing-field-initializers -fno-strict-aliasing -mssse3 -I../../dpdk/dpdk/x86_64-native-linuxapp-gcc/include -D_FILE_OFFSET_BITS=64  -g -O2 -Wno-cast-align -MT tests/test-unix-socket.o -MD -MP -MF $depbase.Tpo -c -o tests/test-unix-socket.o tests/test-unix-socket.c &&\\\nmv -f $depbase.Tpo $depbase.Po\n"
2017-12-13 10:21:40,715 [DEBUG] yardstick.ssh.kvm.LF-1d3ec479 ssh.py:294 stdout: u"depbase=`echo tests/test-netlink-conntrack.o | sed 's|[^/]*$|.deps/&|;s|\\.o$||'`;\\\ngcc -std=gnu99 -DHAVE_CONFIG_H -I.    -I ./include -I ./include -I ./lib -I ./lib    -Wstrict-prototypes -Wall -Wextra -Wno-sign-compare -Wpointer-arith -Wswitch-enum -Wunused-parameter -Wbad-function-cast -Wcast-align -Wmissing-prototypes -Wmissing-field-initializers -fno-strict-aliasing -mssse3 -I../../dpdk/dpdk/x86_64-native-linuxapp-gcc/include -D_FILE_OFFSET_BITS=64  -g -O2 -Wno-cast-align -MT tests/test-netlink-conntrack.o -MD -MP -MF $depbase.Tpo -c -o tests/test-netlink-conntrack.o tests/test-netlink-conntrack.c &&\\\nmv -f $depbase.Tpo $depbase.Po\n"
2017-12-13 10:21:40,809 [DEBUG] yardstick.ssh.kvm.LF-1d3ec479 ssh.py:294 stdout: u'/bin/sh ./libtool  --tag=CC   --mode=link gcc -std=gnu99 -Wstrict-prototypes -Wall -Wextra -Wno-sign-compare -Wpointer-arith -Wswitch-enum -Wunused-parameter -Wbad-function-cast -Wcast-align -Wmissing-prototypes -Wmissing-field-initializers -fno-strict-aliasing -mssse3 -I../../dpdk/dpdk/x86_64-native-linuxapp-gcc/include -D_FILE_OFFSET_BITS=64  -g -O2 -Wno-cast-align  -L../../dpdk/dpdk/x86_64-native-linuxapp-gcc/lib   -o tests/ovstest tests/ovstest.o tests/test-aes128.o tests/test-atomic.o tests/test-bundle.o tests/test-byte-order.o tests/test-classifier.o tests/test-ccmap.o tests/test-cmap.o tests/test-conntrack.o tests/test-csum.o tests/test-flows.o tests/test-hash.o tests/test-heap.o tests/test-hindex.o tests/test-hmap.o tests/test-json.o tests/test-jsonrpc.o tests/test-list.o tests/test-lockfile.o tests/test-multipath.o tests/test-netflow.o tests/test-odp.o tests/test-ofpbuf.o tests/test-ovn.o tests/test-packets.o tests/test-random.o tests/test-rcu.o tests/test-reconnect.o tests/test-rstp.o tests/test-sflow.o tests/test-sha1.o tests/test-stp.o tests/test-unixctl.o tests/test-util.o tests/test-uuid.o tests/test-bitmap.o tests/test-vconn.o tests/test-aa.o tests/test-unix-socket.o tests/test-netlink-conntrack.o lib/libopenvswitch.la ovn/lib/libovn.la -ldpdk -ldl -lnuma -lpthread -lrt -lm  -lnuma\n'
2017-12-13 10:21:40,900 [DEBUG] yardstick.ssh.kvm.LF-1d3ec479 ssh.py:294 stdout: u'libtool: link: gcc -std=gnu99 -Wstrict-prototypes -Wall -Wextra -Wno-sign-compare -Wpointer-arith -Wswitch-enum -Wunused-parameter -Wbad-function-cast -Wcast-align -Wmissing-prototypes -Wmissing-field-initializers -fno-strict-aliasing -mssse3 -I../../dpdk/dpdk/x86_64-native-linuxapp-gcc/include -D_FILE_OFFSET_BITS=64 -g -O2 -Wno-cast-align -o tests/ovstest tests/ovstest.o tests/test-aes128.o tests/test-atomic.o tests/test-bundle.o tests/test-byte-order.o tests/test-classifier.o tests/test-ccmap.o tests/test-cmap.o tests/test-conntrack.o tests/test-csum.o tests/test-flows.o tests/test-hash.o tests/test-heap.o tests/test-hindex.o tests/test-hmap.o tests/test-json.o tests/test-jsonrpc.o tests/test-list.o tests/test-lockfile.o tests/test-multipath.o tests/test-netflow.o tests/test-odp.o tests/test-ofpbuf.o tests/test-ovn.o tests/test-packets.o tests/test-random.o tests/test-rcu.o tests/test-reconnect.o tests/test-rstp.o tests/test-sflow.o tests/test-sha1.o tests/test-stp.o tests/test-unixctl.o tests/test-util.o tests/test-uuid.o tests/test-bitmap.o tests/test-vconn.o tests/test-aa.o tests/test-unix-socket.o tests/test-netlink-conntrack.o  -L../../dpdk/dpdk/x86_64-native-linuxapp-gcc/lib lib/.libs/libopenvswitch.a -lssl -lcrypto ovn/lib/.libs/libovn.a -ldpdk -ldl -lpthread -lrt -lm -lnuma\n'
2017-12-13 10:21:41,199 [DEBUG] yardstick.ssh.kvm.LF-1d3ec479 ssh.py:294 stdout: u"depbase=`echo tests/test-strtok_r.o | sed 's|[^/]*$|.deps/&|;s|\\.o$||'`;\\\ngcc -std=gnu99 -DHAVE_CONFIG_H -I.    -I ./include -I ./include -I ./lib -I ./lib    -Wstrict-prototypes -Wall -Wextra -Wno-sign-compare -Wpointer-arith -Wswitch-enum -Wunused-parameter -Wbad-function-cast -Wcast-align -Wmissing-prototypes -Wmissing-field-initializers -fno-strict-aliasing -mssse3 -I../../dpdk/dpdk/x86_64-native-linuxapp-gcc/include -D_FILE_OFFSET_BITS=64  -g -O2 -Wno-cast-align -MT tests/test-strtok_r.o -MD -MP -MF $depbase.Tpo -c -o tests/test-strtok_r.o tests/test-strtok_r.c &&\\\nmv -f $depbase.Tpo $depbase.Po\n"
2017-12-13 10:21:41,243 [DEBUG] yardstick.ssh.kvm.LF-1d3ec479 ssh.py:294 stdout: u'/bin/sh ./libtool  --tag=CC   --mode=link gcc -std=gnu99 -Wstrict-prototypes -Wall -Wextra -Wno-sign-compare -Wpointer-arith -Wswitch-enum -Wunused-parameter -Wbad-function-cast -Wcast-align -Wmissing-prototypes -Wmissing-field-initializers -fno-strict-aliasing -mssse3 -I../../dpdk/dpdk/x86_64-native-linuxapp-gcc/include -D_FILE_OFFSET_BITS=64  -g -O2 -Wno-cast-align  -L../../dpdk/dpdk/x86_64-native-linuxapp-gcc/lib   -o tests/test-strtok_r tests/test-strtok_r.o  -ldpdk -ldl -lnuma -lpthread -lrt -lm  -lnuma\n'
2017-12-13 10:21:41,305 [DEBUG] yardstick.ssh.kvm.LF-1d3ec479 ssh.py:294 stdout: u'libtool: link: gcc -std=gnu99 -Wstrict-prototypes -Wall -Wextra -Wno-sign-compare -Wpointer-arith -Wswitch-enum -Wunused-parameter -Wbad-function-cast -Wcast-align -Wmissing-prototypes -Wmissing-field-initializers -fno-strict-aliasing -mssse3 -I../../dpdk/dpdk/x86_64-native-linuxapp-gcc/include -D_FILE_OFFSET_BITS=64 -g -O2 -Wno-cast-align -o tests/test-strtok_r tests/test-strtok_r.o  -L../../dpdk/dpdk/x86_64-native-linuxapp-gcc/lib -ldpdk -ldl -lpthread -lrt -lm -lnuma\n'
2017-12-13 10:21:41,331 [DEBUG] yardstick.ssh.kvm.LF-1d3ec479 ssh.py:294 stdout: u"depbase=`echo tests/test-type-props.o | sed 's|[^/]*$|.deps/&|;s|\\.o$||'`;\\\ngcc -std=gnu99 -DHAVE_CONFIG_H -I.    -I ./include -I ./include -I ./lib -I ./lib    -Wstrict-prototypes -Wall -Wextra -Wno-sign-compare -Wpointer-arith -Wswitch-enum -Wunused-parameter -Wbad-function-cast -Wcast-align -Wmissing-prototypes -Wmissing-field-initializers -fno-strict-aliasing -mssse3 -I../../dpdk/dpdk/x86_64-native-linuxapp-gcc/include -D_FILE_OFFSET_BITS=64  -g -O2 -Wno-cast-align -MT tests/test-type-props.o -MD -MP -MF $depbase.Tpo -c -o tests/test-type-props.o tests/test-type-props.c &&\\\nmv -f $depbase.Tpo $depbase.Po\n"
2017-12-13 10:21:41,427 [DEBUG] yardstick.ssh.kvm.LF-1d3ec479 ssh.py:294 stdout: u'/bin/sh ./libtool  --tag=CC   --mode=link gcc -std=gnu99 -Wstrict-prototypes -Wall -Wextra -Wno-sign-compare -Wpointer-arith -Wswitch-enum -Wunused-parameter -Wbad-function-cast -Wcast-align -Wmissing-prototypes -Wmissing-field-initializers -fno-strict-aliasing -mssse3 -I../../dpdk/dpdk/x86_64-native-linuxapp-gcc/include -D_FILE_OFFSET_BITS=64  -g -O2 -Wno-cast-align  -L../../dpdk/dpdk/x86_64-native-linuxapp-gcc/lib   -o tests/test-type-props tests/test-type-props.o  -ldpdk -ldl -lnuma -lpthread -lrt -lm  -lnuma\n'
2017-12-13 10:21:41,488 [DEBUG] yardstick.ssh.kvm.LF-1d3ec479 ssh.py:294 stdout: u'libtool: link: gcc -std=gnu99 -Wstrict-prototypes -Wall -Wextra -Wno-sign-compare -Wpointer-arith -Wswitch-enum -Wunused-parameter -Wbad-function-cast -Wcast-align -Wmissing-prototypes -Wmissing-field-initializers -fno-strict-aliasing -mssse3 -I../../dpdk/dpdk/x86_64-native-linuxapp-gcc/include -D_FILE_OFFSET_BITS=64 -g -O2 -Wno-cast-align -o tests/test-type-props tests/test-type-props.o  -L../../dpdk/dpdk/x86_64-native-linuxapp-gcc/lib -ldpdk -ldl -lpthread -lrt -lm -lnuma\n'
2017-12-13 10:21:41,514 [DEBUG] yardstick.ssh.kvm.LF-1d3ec479 ssh.py:294 stdout: u"depbase=`echo utilities/ovs-vlan-bug-workaround.o | sed 's|[^/]*$|.deps/&|;s|\\.o$||'`;\\\ngcc -std=gnu99 -DHAVE_CONFIG_H -I.    -I ./include -I ./include -I ./lib -I ./lib    -Wstrict-prototypes -Wall -Wextra -Wno-sign-compare -Wpointer-arith -Wswitch-enum -Wunused-parameter -Wbad-function-cast -Wcast-align -Wmissing-prototypes -Wmissing-field-initializers -fno-strict-aliasing -mssse3 -I../../dpdk/dpdk/x86_64-native-linuxapp-gcc/include -D_FILE_OFFSET_BITS=64  -g -O2 -Wno-cast-align -MT utilities/ovs-vlan-bug-workaround.o -MD -MP -MF $depbase.Tpo -c -o utilities/ovs-vlan-bug-workaround.o utilities/ovs-vlan-bug-workaround.c &&\\\nmv -f $depbase.Tpo $depbase.Po\n"
2017-12-13 10:21:41,586 [DEBUG] yardstick.ssh.kvm.LF-1d3ec479 ssh.py:294 stdout: u'/bin/sh ./libtool  --tag=CC   --mode=link gcc -std=gnu99 -Wstrict-prototypes -Wall -Wextra -Wno-sign-compare -Wpointer-arith -Wswitch-enum -Wunused-parameter -Wbad-function-cast -Wcast-align -Wmissing-prototypes -Wmissing-field-initializers -fno-strict-aliasing -mssse3 -I../../dpdk/dpdk/x86_64-native-linuxapp-gcc/include -D_FILE_OFFSET_BITS=64  -g -O2 -Wno-cast-align  -L../../dpdk/dpdk/x86_64-native-linuxapp-gcc/lib   -o utilities/ovs-vlan-bug-workaround utilities/ovs-vlan-bug-workaround.o lib/libopenvswitch.la -ldpdk -ldl -lnuma -lpthread -lrt -lm  -lnuma\n'
2017-12-13 10:21:41,659 [DEBUG] yardstick.ssh.kvm.LF-1d3ec479 ssh.py:294 stdout: u'libtool: link: gcc -std=gnu99 -Wstrict-prototypes -Wall -Wextra -Wno-sign-compare -Wpointer-arith -Wswitch-enum -Wunused-parameter -Wbad-function-cast -Wcast-align -Wmissing-prototypes -Wmissing-field-initializers -fno-strict-aliasing -mssse3 -I../../dpdk/dpdk/x86_64-native-linuxapp-gcc/include -D_FILE_OFFSET_BITS=64 -g -O2 -Wno-cast-align -o utilities/ovs-vlan-bug-workaround utilities/ovs-vlan-bug-workaround.o  -L../../dpdk/dpdk/x86_64-native-linuxapp-gcc/lib lib/.libs/libopenvswitch.a -lssl -lcrypto -ldpdk -ldl -lpthread -lrt -lm -lnuma\n'
2017-12-13 10:21:41,882 [DEBUG] yardstick.ssh.kvm.LF-1d3ec479 ssh.py:294 stdout: u"depbase=`echo vswitchd/bridge.o | sed 's|[^/]*$|.deps/&|;s|\\.o$||'`;\\\ngcc -std=gnu99 -DHAVE_CONFIG_H -I.    -I ./include -I ./include -I ./lib -I ./lib    -Wstrict-prototypes -Wall -Wextra -Wno-sign-compare -Wpointer-arith -Wswitch-enum -Wunused-parameter -Wbad-function-cast -Wcast-align -Wmissing-prototypes -Wmissing-field-initializers -fno-strict-aliasing -mssse3 -I../../dpdk/dpdk/x86_64-native-linuxapp-gcc/include -D_FILE_OFFSET_BITS=64  -g -O2 -Wno-cast-align -MT vswitchd/bridge.o -MD -MP -MF $depbase.Tpo -c -o vswitchd/bridge.o vswitchd/bridge.c &&\\\nmv -f $depbase.Tpo $depbase.Po\n"
2017-12-13 10:21:43,719 [DEBUG] yardstick.ssh.kvm.LF-1d3ec479 ssh.py:294 stdout: u"depbase=`echo vswitchd/ovs-vswitchd.o | sed 's|[^/]*$|.deps/&|;s|\\.o$||'`;\\\ngcc -std=gnu99 -DHAVE_CONFIG_H -I.    -I ./include -I ./include -I ./lib -I ./lib    -Wstrict-prototypes -Wall -Wextra -Wno-sign-compare -Wpointer-arith -Wswitch-enum -Wunused-parameter -Wbad-function-cast -Wcast-align -Wmissing-prototypes -Wmissing-field-initializers -fno-strict-aliasing -mssse3 -I../../dpdk/dpdk/x86_64-native-linuxapp-gcc/include -D_FILE_OFFSET_BITS=64  -g -O2 -Wno-cast-align -MT vswitchd/ovs-vswitchd.o -MD -MP -MF $depbase.Tpo -c -o vswitchd/ovs-vswitchd.o vswitchd/ovs-vswitchd.c &&\\\nmv -f $depbase.Tpo $depbase.Po\n"
2017-12-13 10:21:43,919 [DEBUG] yardstick.ssh.kvm.LF-1d3ec479 ssh.py:294 stdout: u"depbase=`echo vswitchd/system-stats.o | sed 's|[^/]*$|.deps/&|;s|\\.o$||'`;\\\ngcc -std=gnu99 -DHAVE_CONFIG_H -I.    -I ./include -I ./include -I ./lib -I ./lib    -Wstrict-prototypes -Wall -Wextra -Wno-sign-compare -Wpointer-arith -Wswitch-enum -Wunused-parameter -Wbad-function-cast -Wcast-align -Wmissing-prototypes -Wmissing-field-initializers -fno-strict-aliasing -mssse3 -I../../dpdk/dpdk/x86_64-native-linuxapp-gcc/include -D_FILE_OFFSET_BITS=64  -g -O2 -Wno-cast-align -MT vswitchd/system-stats.o -MD -MP -MF $depbase.Tpo -c -o vswitchd/system-stats.o vswitchd/system-stats.c &&\\\nmv -f $depbase.Tpo $depbase.Po\n"
2017-12-13 10:21:44,087 [DEBUG] yardstick.ssh.kvm.LF-1d3ec479 ssh.py:294 stdout: u"depbase=`echo vswitchd/xenserver.o | sed 's|[^/]*$|.deps/&|;s|\\.o$||'`;\\\ngcc -std=gnu99 -DHAVE_CONFIG_H -I.    -I ./include -I ./include -I ./lib -I ./lib    -Wstrict-prototypes -Wall -Wextra -Wno-sign-compare -Wpointer-arith -Wswitch-enum -Wunused-parameter -Wbad-function-cast -Wcast-align -Wmissing-prototypes -Wmissing-field-initializers -fno-strict-aliasing -mssse3 -I../../dpdk/dpdk/x86_64-native-linuxapp-gcc/include -D_FILE_OFFSET_BITS=64  -g -O2 -Wno-cast-align -MT vswitchd/xenserver.o -MD -MP -MF $depbase.Tpo -c -o vswitchd/xenserver.o vswitchd/xenserver.c &&\\\nmv -f $depbase.Tpo $depbase.Po\n"
2017-12-13 10:21:44,153 [DEBUG] yardstick.ssh.kvm.LF-1d3ec479 ssh.py:294 stdout: u'/bin/sh ./libtool  --tag=CC   --mode=link gcc -std=gnu99 -Wstrict-prototypes -Wall -Wextra -Wno-sign-compare -Wpointer-arith -Wswitch-enum -Wunused-parameter -Wbad-function-cast -Wcast-align -Wmissing-prototypes -Wmissing-field-initializers -fno-strict-aliasing -mssse3 -I../../dpdk/dpdk/x86_64-native-linuxapp-gcc/include -D_FILE_OFFSET_BITS=64  -g -O2 -Wno-cast-align  -L../../dpdk/dpdk/x86_64-native-linuxapp-gcc/lib  -Wl,--whole-archive,-ldpdk,--no-whole-archive  -o vswitchd/ovs-vswitchd vswitchd/bridge.o vswitchd/ovs-vswitchd.o vswitchd/system-stats.o vswitchd/xenserver.o ofproto/libofproto.la lib/libsflow.la lib/libopenvswitch.la -ldpdk -ldl -lnuma -lpthread -lrt -lm  -lnuma\n'
2017-12-13 10:21:44,256 [DEBUG] yardstick.ssh.kvm.LF-1d3ec479 ssh.py:294 stdout: u'libtool: link: gcc -std=gnu99 -Wstrict-prototypes -Wall -Wextra -Wno-sign-compare -Wpointer-arith -Wswitch-enum -Wunused-parameter -Wbad-function-cast -Wcast-align -Wmissing-prototypes -Wmissing-field-initializers -fno-strict-aliasing -mssse3 -I../../dpdk/dpdk/x86_64-native-linuxapp-gcc/include -D_FILE_OFFSET_BITS=64 -g -O2 -Wno-cast-align -Wl,--whole-archive -Wl,-ldpdk -Wl,--no-whole-archive -o vswitchd/ovs-vswitchd vswitchd/bridge.o vswitchd/ovs-vswitchd.o vswitchd/system-stats.o vswitchd/xenserver.o  -L../../dpdk/dpdk/x86_64-native-linuxapp-gcc/lib ofproto/.libs/libofproto.a /home/jenkins/vswitchperf/src/ovs/ovs/lib/.libs/libsflow.a lib/.libs/libsflow.a lib/.libs/libopenvswitch.a -lssl -lcrypto -ldpdk -ldl -lpthread -lrt -lm -lnuma\n'
2017-12-13 10:21:44,676 [DEBUG] yardstick.ssh.kvm.LF-1d3ec479 ssh.py:294 stdout: u"depbase=`echo ovsdb/ovsdb-server.o | sed 's|[^/]*$|.deps/&|;s|\\.o$||'`;\\\ngcc -std=gnu99 -DHAVE_CONFIG_H -I.    -I ./include -I ./include -I ./lib -I ./lib    -Wstrict-prototypes -Wall -Wextra -Wno-sign-compare -Wpointer-arith -Wswitch-enum -Wunused-parameter -Wbad-function-cast -Wcast-align -Wmissing-prototypes -Wmissing-field-initializers -fno-strict-aliasing -mssse3 -I../../dpdk/dpdk/x86_64-native-linuxapp-gcc/include -D_FILE_OFFSET_BITS=64  -g -O2 -Wno-cast-align -MT ovsdb/ovsdb-server.o -MD -MP -MF $depbase.Tpo -c -o ovsdb/ovsdb-server.o ovsdb/ovsdb-server.c &&\\\nmv -f $depbase.Tpo $depbase.Po\n"
2017-12-13 10:21:45,287 [DEBUG] yardstick.ssh.kvm.LF-1d3ec479 ssh.py:294 stdout: u'/bin/sh ./libtool  --tag=CC   --mode=link gcc -std=gnu99 -Wstrict-prototypes -Wall -Wextra -Wno-sign-compare -Wpointer-arith -Wswitch-enum -Wunused-parameter -Wbad-function-cast -Wcast-align -Wmissing-prototypes -Wmissing-field-initializers -fno-strict-aliasing -mssse3 -I../../dpdk/dpdk/x86_64-native-linuxapp-gcc/include -D_FILE_OFFSET_BITS=64  -g -O2 -Wno-cast-align  -L../../dpdk/dpdk/x86_64-native-linuxapp-gcc/lib   -o ovsdb/ovsdb-server ovsdb/ovsdb-server.o ovsdb/libovsdb.la lib/libopenvswitch.la -ldpdk -ldl -lnuma -lpthread -lrt -lm  -lnuma\n'
2017-12-13 10:21:45,371 [DEBUG] yardstick.ssh.kvm.LF-1d3ec479 ssh.py:294 stdout: u'libtool: link: gcc -std=gnu99 -Wstrict-prototypes -Wall -Wextra -Wno-sign-compare -Wpointer-arith -Wswitch-enum -Wunused-parameter -Wbad-function-cast -Wcast-align -Wmissing-prototypes -Wmissing-field-initializers -fno-strict-aliasing -mssse3 -I../../dpdk/dpdk/x86_64-native-linuxapp-gcc/include -D_FILE_OFFSET_BITS=64 -g -O2 -Wno-cast-align -o ovsdb/ovsdb-server ovsdb/ovsdb-server.o  -L../../dpdk/dpdk/x86_64-native-linuxapp-gcc/lib ovsdb/.libs/libovsdb.a lib/.libs/libopenvswitch.a -lssl -lcrypto -ldpdk -ldl -lpthread -lrt -lm -lnuma\n'
2017-12-13 10:21:45,636 [DEBUG] yardstick.ssh.kvm.LF-1d3ec479 ssh.py:294 stdout: u'printf \'\\043 Generated automatically -- do not modify!    -*- buffer-read-only: t -*-\\n\' > version.py.tmp && \\\necho \'VERSION = "2.6.90"\' >> version.py.tmp && \\\nif cmp -s version.py.tmp python/ovs/version.py; then touch python/ovs/version.py; rm version.py.tmp; else mv version.py.tmp python/ovs/version.py; fi\n'
2017-12-13 10:21:45,644 [DEBUG] yardstick.ssh.kvm.LF-1d3ec479 ssh.py:294 stdout: u"/usr/bin/perl ./build-aux/soexpand.pl -I. < utilities/ovs-lib.in | \\\n    sed \\\n\t-e 's,[@]PKIDIR[@],/usr/local/var/lib/openvswitch/pki,g' \\\n                -e 's,[@]LOGDIR[@],/usr/local/var/log/openvswitch,g' \\\n                -e 's,[@]DBDIR[@],/usr/local/etc/openvswitch,g' \\\n                -e 's,[@]PERL[@],/usr/bin/perl,g' \\\n                -e 's,[@]PYTHON[@],/usr/bin/python,g' \\\n                -e 's,[@]RUNDIR[@],/usr/local/var/run/openvswitch,g' \\\n                -e 's,[@]VERSION[@],2.6.90,g' \\\n                -e 's,[@]localstatedir[@],/usr/local/var,g' \\\n                -e 's,[@]pkgdatadir[@],/usr/local/share/openvswitch,g' \\\n                -e 's,[@]sysconfdir[@],/usr/local/etc,g' \\\n                -e 's,[@]bindir[@],/usr/local/bin,g' \\\n                -e 's,[@]sbindir[@],/usr/local/sbin,g' \\\n                -e 's,[@]abs_builddir[@],/home/jenkins/vswitchperf/src/ovs/ovs,g' \\\n                -e 's,[@]abs_top_srcdir[@],/home/jenkins/vswitchperf/src/ovs/ovs,g' \\\n            > utilities/ovs-lib.tmp\n"
2017-12-13 10:21:45,671 [DEBUG] yardstick.ssh.kvm.LF-1d3ec479 ssh.py:294 stdout: u'mv utilities/ovs-lib.tmp utilities/ovs-lib\n'
2017-12-13 10:21:45,708 [DEBUG] yardstick.ssh.kvm.LF-1d3ec479 ssh.py:294 stdout: u"(printf '\\043 Generated automatically -- do not modify!    -*- buffer-read-only: t -*-\\n' && sed -e 's,[@]VERSION[@],2.6.90,g') < ./rhel/openvswitch-dkms.spec.in > openvswitch-dkms.spec.tmp || exit 1; if cmp -s openvswitch-dkms.spec.tmp rhel/openvswitch-dkms.spec; then touch rhel/openvswitch-dkms.spec; rm openvswitch-dkms.spec.tmp; else mv openvswitch-dkms.spec.tmp rhel/openvswitch-dkms.spec; fi\n"
2017-12-13 10:21:45,716 [DEBUG] yardstick.ssh.kvm.LF-1d3ec479 ssh.py:294 stdout: u"(printf '\\043 Generated automatically -- do not modify!    -*- buffer-read-only: t -*-\\n' && sed -e 's,[@]VERSION[@],2.6.90,g') < ./rhel/openvswitch-kmod-rhel6.spec.in > openvswitch-kmod-rhel6.spec.tmp || exit 1; if cmp -s openvswitch-kmod-rhel6.spec.tmp rhel/openvswitch-kmod-rhel6.spec; then touch rhel/openvswitch-kmod-rhel6.spec; rm openvswitch-kmod-rhel6.spec.tmp; else mv openvswitch-kmod-rhel6.spec.tmp rhel/openvswitch-kmod-rhel6.spec; fi\n"
2017-12-13 10:21:45,729 [DEBUG] yardstick.ssh.kvm.LF-1d3ec479 ssh.py:294 stdout: u"(printf '\\043 Generated automatically -- do not modify!    -*- buffer-read-only: t -*-\\n' && sed -e 's,[@]VERSION[@],2.6.90,g') < ./rhel/openvswitch-kmod-fedora.spec.in > openvswitch-kmod-fedora.spec.tmp || exit 1; if cmp -s openvswitch-kmod-fedora.spec.tmp rhel/openvswitch-kmod-fedora.spec; then touch rhel/openvswitch-kmod-fedora.spec; rm openvswitch-kmod-fedora.spec.tmp; else mv openvswitch-kmod-fedora.spec.tmp rhel/openvswitch-kmod-fedora.spec; fi\n"
2017-12-13 10:21:45,735 [DEBUG] yardstick.ssh.kvm.LF-1d3ec479 ssh.py:294 stdout: u"(printf '\\043 Generated automatically -- do not modify!    -*- buffer-read-only: t -*-\\n' && sed -e 's,[@]VERSION[@],2.6.90,g') < ./rhel/openvswitch.spec.in > openvswitch.spec.tmp || exit 1; if cmp -s openvswitch.spec.tmp rhel/openvswitch.spec; then touch rhel/openvswitch.spec; rm openvswitch.spec.tmp; else mv openvswitch.spec.tmp rhel/openvswitch.spec; fi\n"
2017-12-13 10:21:45,740 [DEBUG] yardstick.ssh.kvm.LF-1d3ec479 ssh.py:294 stdout: u"(printf '\\043 Generated automatically -- do not modify!    -*- buffer-read-only: t -*-\\n' && sed -e 's,[@]VERSION[@],2.6.90,g') < ./rhel/openvswitch-fedora.spec.in > openvswitch-fedora.spec.tmp || exit 1; if cmp -s openvswitch-fedora.spec.tmp rhel/openvswitch-fedora.spec; then touch rhel/openvswitch-fedora.spec; rm openvswitch-fedora.spec.tmp; else mv openvswitch-fedora.spec.tmp rhel/openvswitch-fedora.spec; fi\n"
2017-12-13 10:21:45,749 [DEBUG] yardstick.ssh.kvm.LF-1d3ec479 ssh.py:294 stdout: u"(printf '\\043 Generated automatically -- do not modify!    -*- buffer-read-only: t -*-\\n' && sed -e 's,[@]VERSION[@],2.6.90,g') \\\n\t< ./xenserver/openvswitch-xen.spec.in > openvswitch-xen.spec.tmp || exit 1; \\\nif cmp -s openvswitch-xen.spec.tmp xenserver/openvswitch-xen.spec; then touch xenserver/openvswitch-xen.spec; rm openvswitch-xen.spec.tmp; else mv openvswitch-xen.spec.tmp xenserver/openvswitch-xen.spec; fi\n"
2017-12-13 10:21:45,946 [DEBUG] yardstick.ssh.kvm.LF-1d3ec479 ssh.py:294 stdout: u"make[5]: Entering directory `/home/jenkins/vswitchperf/src/ovs/ovs/datapath'\n"
2017-12-13 10:21:45,955 [DEBUG] yardstick.ssh.kvm.LF-1d3ec479 ssh.py:294 stdout: u"make[5]: Leaving directory `/home/jenkins/vswitchperf/src/ovs/ovs/datapath'\n"
2017-12-13 10:21:46,702 [DEBUG] yardstick.ssh.kvm.LF-1d3ec479 ssh.py:294 stdout: u"make[4]: Leaving directory `/home/jenkins/vswitchperf/src/ovs/ovs'\n"
2017-12-13 10:21:46,706 [DEBUG] yardstick.ssh.kvm.LF-1d3ec479 ssh.py:294 stdout: u"make[3]: Leaving directory `/home/jenkins/vswitchperf/src/ovs/ovs'\n"
2017-12-13 10:21:46,709 [DEBUG] yardstick.ssh.kvm.LF-1d3ec479 ssh.py:294 stdout: u"make[2]: Leaving directory `/home/jenkins/vswitchperf/src/ovs/ovs'\n"
2017-12-13 10:21:46,711 [DEBUG] yardstick.ssh.kvm.LF-1d3ec479 ssh.py:294 stdout: u'Make done\n'
2017-12-13 10:21:46,712 [DEBUG] yardstick.ssh.kvm.LF-1d3ec479 ssh.py:294 stdout: u'Finished making ovs \n'
2017-12-13 10:21:46,713 [DEBUG] yardstick.ssh.kvm.LF-1d3ec479 ssh.py:294 stdout: u"make[1]: Leaving directory `/home/jenkins/vswitchperf/src/ovs'\n"
2017-12-13 10:21:46,713 [DEBUG] yardstick.ssh.kvm.LF-1d3ec479 ssh.py:294 stdout: u'Enter directory qemu\n'
2017-12-13 10:21:46,725 [DEBUG] yardstick.ssh.kvm.LF-1d3ec479 ssh.py:294 stdout: u"make[1]: Entering directory `/home/jenkins/vswitchperf/src/qemu'\n"
2017-12-13 10:21:47,372 [DEBUG] yardstick.ssh.kvm.LF-1d3ec479 ssh.py:302 stderr: u'HEAD is now at a8c40fa... Update version for v2.5.0 release\n'
2017-12-13 10:21:54,875 [DEBUG] yardstick.ssh.kvm.LF-1d3ec479 ssh.py:294 stdout: u'Install prefix    /usr/local\n'
2017-12-13 10:21:54,876 [DEBUG] yardstick.ssh.kvm.LF-1d3ec479 ssh.py:294 stdout: u'BIOS directory    /usr/local/share/qemu\n'
2017-12-13 10:21:54,877 [DEBUG] yardstick.ssh.kvm.LF-1d3ec479 ssh.py:294 stdout: u'binary directory  /usr/local/bin\nlibrary directory /usr/local/lib\n'
2017-12-13 10:21:54,878 [DEBUG] yardstick.ssh.kvm.LF-1d3ec479 ssh.py:294 stdout: u'module directory  /usr/local/lib/qemu\nlibexec directory /usr/local/libexec\n'
2017-12-13 10:21:54,879 [DEBUG] yardstick.ssh.kvm.LF-1d3ec479 ssh.py:294 stdout: u'include directory /usr/local/include\n'
2017-12-13 10:21:54,879 [DEBUG] yardstick.ssh.kvm.LF-1d3ec479 ssh.py:294 stdout: u'config directory  /usr/local/etc\n'
2017-12-13 10:21:54,880 [DEBUG] yardstick.ssh.kvm.LF-1d3ec479 ssh.py:294 stdout: u'local state directory   /usr/local/var\n'
2017-12-13 10:21:54,881 [DEBUG] yardstick.ssh.kvm.LF-1d3ec479 ssh.py:294 stdout: u'Manual directory  /usr/local/share/man\n'
2017-12-13 10:21:54,882 [DEBUG] yardstick.ssh.kvm.LF-1d3ec479 ssh.py:294 stdout: u'ELF interp prefix /usr/gnemul/qemu-%M\n'
2017-12-13 10:21:54,882 [DEBUG] yardstick.ssh.kvm.LF-1d3ec479 ssh.py:294 stdout: u'Source path       /home/jenkins/vswitchperf/src/qemu/qemu\nC compiler        cc\n'
2017-12-13 10:21:54,883 [DEBUG] yardstick.ssh.kvm.LF-1d3ec479 ssh.py:294 stdout: u'Host C compiler   cc\nC++ compiler      c++\n'
2017-12-13 10:21:54,884 [DEBUG] yardstick.ssh.kvm.LF-1d3ec479 ssh.py:294 stdout: u'Objective-C compiler cc\n'
2017-12-13 10:21:54,885 [DEBUG] yardstick.ssh.kvm.LF-1d3ec479 ssh.py:294 stdout: u'ARFLAGS           rv\nCFLAGS            -O2 -U_FORTIFY_SOURCE -D_FORTIFY_SOURCE=2 -pthread -I/usr/include/glib-2.0 -I/usr/lib64/glib-2.0/include   -g \n'
2017-12-13 10:21:54,886 [DEBUG] yardstick.ssh.kvm.LF-1d3ec479 ssh.py:294 stdout: u'QEMU_CFLAGS       -I/usr/include/pixman-1    -Werror -fPIE -DPIE -m64 -D_GNU_SOURCE -D_FILE_OFFSET_BITS=64 -D_LARGEFILE_SOURCE -Wstrict-prototypes -Wredundant-decls -Wall -Wundef -Wwrite-strings -Wmissing-prototypes -fno-strict-aliasing -fno-common  -Wendif-labels -Wmissing-include-dirs -Wempty-body -Wnested-externs -Wformat-security -Wformat-y2k -Winit-self -Wignored-qualifiers -Wold-style-declaration -Wold-style-definition -Wtype-limits -fstack-protector-strong\n'
2017-12-13 10:21:54,886 [DEBUG] yardstick.ssh.kvm.LF-1d3ec479 ssh.py:294 stdout: u'LDFLAGS           -Wl,--warn-common -Wl,-z,relro -Wl,-z,now -pie -m64 -g \nmake              make\n'
2017-12-13 10:21:54,887 [DEBUG] yardstick.ssh.kvm.LF-1d3ec479 ssh.py:294 stdout: u'install           install\n'
2017-12-13 10:21:54,888 [DEBUG] yardstick.ssh.kvm.LF-1d3ec479 ssh.py:294 stdout: u'python            /usr/bin/python -B\n'
2017-12-13 10:21:54,888 [DEBUG] yardstick.ssh.kvm.LF-1d3ec479 ssh.py:294 stdout: u'smbd              /usr/sbin/smbd\n'
2017-12-13 10:21:54,889 [DEBUG] yardstick.ssh.kvm.LF-1d3ec479 ssh.py:294 stdout: u'module support    no\n'
2017-12-13 10:21:54,889 [DEBUG] yardstick.ssh.kvm.LF-1d3ec479 ssh.py:294 stdout: u'host CPU          x86_64\nhost big endian   no\n'
2017-12-13 10:21:54,890 [DEBUG] yardstick.ssh.kvm.LF-1d3ec479 ssh.py:294 stdout: u'target list       x86_64-softmmu\n'
2017-12-13 10:21:54,891 [DEBUG] yardstick.ssh.kvm.LF-1d3ec479 ssh.py:294 stdout: u'tcg debug enabled no\n'
2017-12-13 10:21:54,891 [DEBUG] yardstick.ssh.kvm.LF-1d3ec479 ssh.py:294 stdout: u'gprof enabled     no\nsparse enabled    no\n'
2017-12-13 10:21:54,892 [DEBUG] yardstick.ssh.kvm.LF-1d3ec479 ssh.py:294 stdout: u'strip binaries    yes\n'
2017-12-13 10:21:54,893 [DEBUG] yardstick.ssh.kvm.LF-1d3ec479 ssh.py:294 stdout: u'profiler          no\nstatic build      no\n'
2017-12-13 10:21:54,893 [DEBUG] yardstick.ssh.kvm.LF-1d3ec479 ssh.py:294 stdout: u'pixman            system\nSDL support       no\n'
2017-12-13 10:21:54,894 [DEBUG] yardstick.ssh.kvm.LF-1d3ec479 ssh.py:294 stdout: u'GTK support       no\n'
2017-12-13 10:21:54,894 [DEBUG] yardstick.ssh.kvm.LF-1d3ec479 ssh.py:294 stdout: u'GTK GL support    no\n'
2017-12-13 10:21:54,895 [DEBUG] yardstick.ssh.kvm.LF-1d3ec479 ssh.py:294 stdout: u'GNUTLS support    no\nGNUTLS hash       no\n'
2017-12-13 10:21:54,896 [DEBUG] yardstick.ssh.kvm.LF-1d3ec479 ssh.py:294 stdout: u'libgcrypt         no\n'
2017-12-13 10:21:54,896 [DEBUG] yardstick.ssh.kvm.LF-1d3ec479 ssh.py:294 stdout: u'nettle            no ()\nlibtasn1          no\n'
2017-12-13 10:21:54,897 [DEBUG] yardstick.ssh.kvm.LF-1d3ec479 ssh.py:294 stdout: u'VTE support       no\n'
2017-12-13 10:21:54,898 [DEBUG] yardstick.ssh.kvm.LF-1d3ec479 ssh.py:294 stdout: u'curses support    no\nvirgl support     no\n'
2017-12-13 10:21:54,898 [DEBUG] yardstick.ssh.kvm.LF-1d3ec479 ssh.py:294 stdout: u'curl support      no\n'
2017-12-13 10:21:54,899 [DEBUG] yardstick.ssh.kvm.LF-1d3ec479 ssh.py:294 stdout: u'mingw32 support   no\nAudio drivers     oss\n'
2017-12-13 10:21:54,900 [DEBUG] yardstick.ssh.kvm.LF-1d3ec479 ssh.py:294 stdout: u'Block whitelist (rw) \nBlock whitelist (ro) \n'
2017-12-13 10:21:54,900 [DEBUG] yardstick.ssh.kvm.LF-1d3ec479 ssh.py:294 stdout: u'VirtFS support    no\n'
2017-12-13 10:21:54,901 [DEBUG] yardstick.ssh.kvm.LF-1d3ec479 ssh.py:294 stdout: u'VNC support       yes\nVNC SASL support  no\nVNC JPEG support  no\n'
2017-12-13 10:21:54,902 [DEBUG] yardstick.ssh.kvm.LF-1d3ec479 ssh.py:294 stdout: u'VNC PNG support   no\nxen support       no\n'
2017-12-13 10:21:54,903 [DEBUG] yardstick.ssh.kvm.LF-1d3ec479 ssh.py:294 stdout: u'brlapi support    no\nbluez  support    no\n'
2017-12-13 10:21:54,903 [DEBUG] yardstick.ssh.kvm.LF-1d3ec479 ssh.py:294 stdout: u'Documentation     no\n'
2017-12-13 10:21:54,904 [DEBUG] yardstick.ssh.kvm.LF-1d3ec479 ssh.py:294 stdout: u'PIE               yes\nvde support       no\n'
2017-12-13 10:21:54,905 [DEBUG] yardstick.ssh.kvm.LF-1d3ec479 ssh.py:294 stdout: u'netmap support    no\nLinux AIO support no\n'
2017-12-13 10:21:54,905 [DEBUG] yardstick.ssh.kvm.LF-1d3ec479 ssh.py:294 stdout: u'ATTR/XATTR support yes\nInstall blobs     yes\n'
2017-12-13 10:21:54,906 [DEBUG] yardstick.ssh.kvm.LF-1d3ec479 ssh.py:294 stdout: u'KVM support       yes\nRDMA support      no\n'
2017-12-13 10:21:54,907 [DEBUG] yardstick.ssh.kvm.LF-1d3ec479 ssh.py:294 stdout: u'TCG interpreter   no\n'
2017-12-13 10:21:54,907 [DEBUG] yardstick.ssh.kvm.LF-1d3ec479 ssh.py:294 stdout: u'fdt support       no\npreadv support    yes\n'
2017-12-13 10:21:54,908 [DEBUG] yardstick.ssh.kvm.LF-1d3ec479 ssh.py:294 stdout: u'fdatasync         yes\n'
2017-12-13 10:21:54,908 [DEBUG] yardstick.ssh.kvm.LF-1d3ec479 ssh.py:294 stdout: u'madvise           yes\n'
2017-12-13 10:21:54,909 [DEBUG] yardstick.ssh.kvm.LF-1d3ec479 ssh.py:294 stdout: u'posix_madvise     yes\n'
2017-12-13 10:21:54,909 [DEBUG] yardstick.ssh.kvm.LF-1d3ec479 ssh.py:294 stdout: u'sigev_thread_id   yes\nuuid support      no\n'
2017-12-13 10:21:54,910 [DEBUG] yardstick.ssh.kvm.LF-1d3ec479 ssh.py:294 stdout: u'libcap-ng support no\n'
2017-12-13 10:21:54,911 [DEBUG] yardstick.ssh.kvm.LF-1d3ec479 ssh.py:294 stdout: u'vhost-net support yes\nvhost-scsi support yes\n'
2017-12-13 10:21:54,911 [DEBUG] yardstick.ssh.kvm.LF-1d3ec479 ssh.py:294 stdout: u'Trace backends    nop\nspice support     no\n'
2017-12-13 10:21:54,912 [DEBUG] yardstick.ssh.kvm.LF-1d3ec479 ssh.py:294 stdout: u'rbd support       no\n'
2017-12-13 10:21:54,912 [DEBUG] yardstick.ssh.kvm.LF-1d3ec479 ssh.py:294 stdout: u'xfsctl support    no\nsmartcard support no\n'
2017-12-13 10:21:54,913 [DEBUG] yardstick.ssh.kvm.LF-1d3ec479 ssh.py:294 stdout: u'libusb            no\n'
2017-12-13 10:21:54,914 [DEBUG] yardstick.ssh.kvm.LF-1d3ec479 ssh.py:294 stdout: u'usb net redir     no\n'
2017-12-13 10:21:54,914 [DEBUG] yardstick.ssh.kvm.LF-1d3ec479 ssh.py:294 stdout: u'OpenGL support    no\n'
2017-12-13 10:21:54,915 [DEBUG] yardstick.ssh.kvm.LF-1d3ec479 ssh.py:294 stdout: u'libiscsi support  no\nlibnfs support    no\n'
2017-12-13 10:21:54,915 [DEBUG] yardstick.ssh.kvm.LF-1d3ec479 ssh.py:294 stdout: u'build guest agent yes\n'
2017-12-13 10:21:54,916 [DEBUG] yardstick.ssh.kvm.LF-1d3ec479 ssh.py:294 stdout: u'QGA VSS support   no\n'
2017-12-13 10:21:54,916 [DEBUG] yardstick.ssh.kvm.LF-1d3ec479 ssh.py:294 stdout: u'QGA w32 disk info no\n'
2017-12-13 10:21:54,917 [DEBUG] yardstick.ssh.kvm.LF-1d3ec479 ssh.py:294 stdout: u'QGA MSI support   no\nseccomp support   no\n'
2017-12-13 10:21:54,917 [DEBUG] yardstick.ssh.kvm.LF-1d3ec479 ssh.py:294 stdout: u'coroutine backend ucontext\n'
2017-12-13 10:21:54,918 [DEBUG] yardstick.ssh.kvm.LF-1d3ec479 ssh.py:294 stdout: u'coroutine pool    yes\nGlusterFS support no\n'
2017-12-13 10:21:54,919 [DEBUG] yardstick.ssh.kvm.LF-1d3ec479 ssh.py:294 stdout: u'Archipelago support no\ngcov              gcov\n'
2017-12-13 10:21:54,919 [DEBUG] yardstick.ssh.kvm.LF-1d3ec479 ssh.py:294 stdout: u'gcov enabled      no\n'
2017-12-13 10:21:54,920 [DEBUG] yardstick.ssh.kvm.LF-1d3ec479 ssh.py:294 stdout: u'TPM support       yes\n'
2017-12-13 10:21:54,920 [DEBUG] yardstick.ssh.kvm.LF-1d3ec479 ssh.py:294 stdout: u'libssh2 support   no\nTPM passthrough   yes\nQOM debugging     yes\n'
2017-12-13 10:21:54,921 [DEBUG] yardstick.ssh.kvm.LF-1d3ec479 ssh.py:294 stdout: u'vhdx              no\nlzo support       no\n'
2017-12-13 10:21:54,922 [DEBUG] yardstick.ssh.kvm.LF-1d3ec479 ssh.py:294 stdout: u'snappy support    no\nbzip2 support     no\n'
2017-12-13 10:21:54,922 [DEBUG] yardstick.ssh.kvm.LF-1d3ec479 ssh.py:294 stdout: u'NUMA host support yes\n'
2017-12-13 10:21:54,923 [DEBUG] yardstick.ssh.kvm.LF-1d3ec479 ssh.py:294 stdout: u'tcmalloc support  no\njemalloc support  no\n'
2017-12-13 10:21:55,014 [DEBUG] yardstick.ssh.kvm.LF-1d3ec479 ssh.py:294 stdout: u'Configure done\n'
2017-12-13 10:22:25,133 [DEBUG] yardstick.ssh.kvm.LF-1d3ec479 ssh.py:302 stderr: u"fatal: unable to access 'https://github.com/qemu/qemu.git/': Could not resolve host: github.com; Name or service not known\n"
2017-12-13 10:22:25,135 [DEBUG] yardstick.ssh.kvm.LF-1d3ec479 ssh.py:302 stderr: u'make[1]: *** [force_make] Error 1'
2017-12-13 10:22:25,136 [DEBUG] yardstick.ssh.kvm.LF-1d3ec479 ssh.py:302 stderr: u'\n'
2017-12-13 10:22:25,137 [DEBUG] yardstick.ssh.kvm.LF-1d3ec479 ssh.py:294 stdout: u"make[1]: Leaving directory `/home/jenkins/vswitchperf/src/qemu'\n"
2017-12-13 10:22:25,138 [DEBUG] yardstick.ssh.kvm.LF-1d3ec479 ssh.py:302 stderr: u'make: *** [qemu] Error 2\n'
2017-12-13 10:22:25,138 [DEBUG] yardstick.ssh.kvm.LF-1d3ec479 ssh.py:294 stdout: u'Make failed\n'
2017-12-13 10:22:25,139 [DEBUG] yardstick.ssh.kvm.LF-1d3ec479 ssh.py:294 stdout: u'Execution of build_base_machine.sh failed\n'
Process Duration-QemuMigrate-19:
Traceback (most recent call last):
  File "/usr/lib/python2.7/multiprocessing/process.py", line 258, in _bootstrap
    self.run()
  File "/usr/lib/python2.7/multiprocessing/process.py", line 114, in run
    self._target(*self._args, **self._kwargs)
  File "/usr/local/lib/python2.7/dist-packages/yardstick-0.1.dev0-py2.7.egg/yardstick/benchmark/runners/duration.py", line 52, in _worker_process
    benchmark.setup()
  File "/usr/local/lib/python2.7/dist-packages/yardstick-0.1.dev0-py2.7.egg/yardstick/benchmark/scenarios/compute/qemu_migrate.py", line 86, in setup
    self._run_host_setup_scripts(host_setup_seqs)
  File "/usr/local/lib/python2.7/dist-packages/yardstick-0.1.dev0-py2.7.egg/yardstick/benchmark/scenarios/compute/qemu_migrate.py", line 73, in _run_host_setup_scripts
    self._run_setup_cmd(self.host, cmd)
  File "/usr/local/lib/python2.7/dist-packages/yardstick-0.1.dev0-py2.7.egg/yardstick/benchmark/scenarios/compute/qemu_migrate.py", line 64, in _run_setup_cmd
    raise RuntimeError(stderr)
RuntimeError: From http://dpdk.org/git/dpdk
 * tag               v16.11     -> FETCH_HEAD
WARNING: "igb_setup_tctl" [/home/jenkins/vswitchperf/src/dpdk/dpdk/x86_64-native-linuxapp-gcc/build/lib/librte_eal/linuxapp/kni/rte_kni.ko] undefined!
WARNING: "igb_driver_name" [/home/jenkins/vswitchperf/src/dpdk/dpdk/x86_64-native-linuxapp-gcc/build/lib/librte_eal/linuxapp/kni/rte_kni.ko] undefined!
WARNING: "igb_setup_tx_resources" [/home/jenkins/vswitchperf/src/dpdk/dpdk/x86_64-native-linuxapp-gcc/build/lib/librte_eal/linuxapp/kni/rte_kni.ko] undefined!
WARNING: "igb_unmap_and_free_tx_resource" [/home/jenkins/vswitchperf/src/dpdk/dpdk/x86_64-native-linuxapp-gcc/build/lib/librte_eal/linuxapp/kni/rte_kni.ko] undefined!
WARNING: "igb_pci_tbl" [/home/jenkins/vswitchperf/src/dpdk/dpdk/x86_64-native-linuxapp-gcc/build/lib/librte_eal/linuxapp/kni/rte_kni.ko] undefined!
WARNING: "igb_configure_tx_ring" [/home/jenkins/vswitchperf/src/dpdk/dpdk/x86_64-native-linuxapp-gcc/build/lib/librte_eal/linuxapp/kni/rte_kni.ko] undefined!
WARNING: "igb_free_rx_resources" [/home/jenkins/vswitchperf/src/dpdk/dpdk/x86_64-native-linuxapp-gcc/build/lib/librte_eal/linuxapp/kni/rte_kni.ko] undefined!
WARNING: "igb_down" [/home/jenkins/vswitchperf/src/dpdk/dpdk/x86_64-native-linuxapp-gcc/build/lib/librte_eal/linuxapp/kni/rte_kni.ko] undefined!
WARNING: "igb_setup_rx_resources" [/home/jenkins/vswitchperf/src/dpdk/dpdk/x86_64-native-linuxapp-gcc/build/lib/librte_eal/linuxapp/kni/rte_kni.ko] undefined!
WARNING: "igb_configure_rx_ring" [/home/jenkins/vswitchperf/src/dpdk/dpdk/x86_64-native-linuxapp-gcc/build/lib/librte_eal/linuxapp/kni/rte_kni.ko] undefined!
WARNING: "igb_driver_version" [/home/jenkins/vswitchperf/src/dpdk/dpdk/x86_64-native-linuxapp-gcc/build/lib/librte_eal/linuxapp/kni/rte_kni.ko] undefined!
WARNING: "igb_reset" [/home/jenkins/vswitchperf/src/dpdk/dpdk/x86_64-native-linuxapp-gcc/build/lib/librte_eal/linuxapp/kni/rte_kni.ko] undefined!
WARNING: "igb_xmit_frame_ring" [/home/jenkins/vswitchperf/src/dpdk/dpdk/x86_64-native-linuxapp-gcc/build/lib/librte_eal/linuxapp/kni/rte_kni.ko] undefined!
WARNING: "igb_kni_remove" [/home/jenkins/vswitchperf/src/dpdk/dpdk/x86_64-native-linuxapp-gcc/build/lib/librte_eal/linuxapp/kni/rte_kni.ko] undefined!
WARNING: "igb_update_stats" [/home/jenkins/vswitchperf/src/dpdk/dpdk/x86_64-native-linuxapp-gcc/build/lib/librte_eal/linuxapp/kni/rte_kni.ko] undefined!
WARNING: "e1000_write_pcie_cap_reg" [/home/jenkins/vswitchperf/src/dpdk/dpdk/x86_64-native-linuxapp-gcc/build/lib/librte_eal/linuxapp/kni/rte_kni.ko] undefined!
WARNING: "igb_setup_rctl" [/home/jenkins/vswitchperf/src/dpdk/dpdk/x86_64-native-linuxapp-gcc/build/lib/librte_eal/linuxapp/kni/rte_kni.ko] undefined!
WARNING: "igb_kni_probe" [/home/jenkins/vswitchperf/src/dpdk/dpdk/x86_64-native-linuxapp-gcc/build/lib/librte_eal/linuxapp/kni/rte_kni.ko] undefined!
WARNING: "igb_free_tx_resources" [/home/jenkins/vswitchperf/src/dpdk/dpdk/x86_64-native-linuxapp-gcc/build/lib/librte_eal/linuxapp/kni/rte_kni.ko] undefined!
WARNING: "e1000_read_pcie_cap_reg" [/home/jenkins/vswitchperf/src/dpdk/dpdk/x86_64-native-linuxapp-gcc/build/lib/librte_eal/linuxapp/kni/rte_kni.ko] undefined!
WARNING: "igb_set_spd_dplx" [/home/jenkins/vswitchperf/src/dpdk/dpdk/x86_64-native-linuxapp-gcc/build/lib/librte_eal/linuxapp/kni/rte_kni.ko] undefined!
WARNING: "igb_up" [/home/jenkins/vswitchperf/src/dpdk/dpdk/x86_64-native-linuxapp-gcc/build/lib/librte_eal/linuxapp/kni/rte_kni.ko] undefined!
WARNING: "igb_power_up_link" [/home/jenkins/vswitchperf/src/dpdk/dpdk/x86_64-native-linuxapp-gcc/build/lib/librte_eal/linuxapp/kni/rte_kni.ko] undefined!
WARNING: "igb_reinit_locked" [/home/jenkins/vswitchperf/src/dpdk/dpdk/x86_64-native-linuxapp-gcc/build/lib/librte_eal/linuxapp/kni/rte_kni.ko] undefined!
WARNING: "igb_has_link" [/home/jenkins/vswitchperf/src/dpdk/dpdk/x86_64-native-linuxapp-gcc/build/lib/librte_eal/linuxapp/kni/rte_kni.ko] undefined!
WARNING: "igb_alloc_rx_buffers" [/home/jenkins/vswitchperf/src/dpdk/dpdk/x86_64-native-linuxapp-gcc/build/lib/librte_eal/linuxapp/kni/rte_kni.ko] undefined!
tar: Current `testpmd' is newer or same age
tar: Current `dpdk-procinfo' is newer or same age
tar: Current `dpdk-pdump' is newer or same age
tar: Current `rte_memory.h' is newer or same age
tar: Current `rte_thash.h' is newer or same age
tar: Current `rte_icmp.h' is newer or same age
tar: Current `rte_ip_frag.h' is newer or same age
tar: Current `rte_crypto.h' is newer or same age
tar: Current `rte_lcore.h' is newer or same age
tar: Current `rte_fbk_hash.h' is newer or same age
tar: Current `rte_compat.h' is newer or same age
tar: Current `rte_memcpy.h' is newer or same age
tar: Current `rte_table_acl.h' is newer or same age
tar: Current `rte_eth_bond.h' is newer or same age
tar: Current `rte_jobstats.h' is newer or same age
tar: Current `generic/rte_memcpy.h' is newer or same age
tar: Current `generic/rte_prefetch.h' is newer or same age
tar: Current `generic/rte_cycles.h' is newer or same age
tar: Current `generic/rte_rwlock.h' is newer or same age
tar: Current `generic/rte_byteorder.h' is newer or same age
tar: Current `generic/rte_cpuflags.h' is newer or same age
tar: Current `generic/rte_spinlock.h' is newer or same age
tar: Current `generic/rte_atomic.h' is newer or same age
tar: Current `rte_hash_crc.h' is newer or same age
tar: Current `rte_per_lcore.h' is newer or same age
tar: Current `rte_vdev.h' is newer or same age
tar: Current `rte_memzone.h' is newer or same age
tar: Current `rte_port_ring.h' is newer or same age
tar: Current `rte_lru.h' is newer or same age
tar: Current `rte_port.h' is newer or same age
tar: Current `rte_eth_ctrl.h' is newer or same age
tar: Current `rte_prefetch.h' is newer or same age
tar: Current `rte_errno.h' is newer or same age
tar: Current `rte_cycles.h' is newer or same age
tar: Current `rte_jhash.h' is newer or same age
tar: Current `rte_eth_bond_8023ad.h' is newer or same age
tar: Current `rte_pci_dev_features.h' is newer or same age
tar: Current `rte_eth_vhost.h' is newer or same age
tar: Current `rte_kvargs.h' is newer or same age
tar: Current `rte_rwlock.h' is newer or same age
tar: Current `rte_port_sched.h' is newer or same age
tar: Current `rte_mbuf_ptype.h' is newer or same age
tar: Current `rte_byteorder.h' is newer or same age
tar: Current `rte_config.h' is newer or same age
tar: Current `rte_tcp.h' is newer or same age
tar: Current `rte_interrupts.h' is newer or same age
tar: Current `rte_table_lpm_ipv6.h' is newer or same age
tar: Current `rte_udp.h' is newer or same age
tar: Current `rte_acl.h' is newer or same age
tar: Current `rte_ethdev.h' is newer or same age
tar: Current `rte_lpm.h' is newer or same age
tar: Current `cmdline_parse_num.h' is newer or same age
tar: Current `rte_lpm_sse.h' is newer or same age
tar: Current `rte_random.h' is newer or same age
tar: Current `rte_port_source_sink.h' is newer or same age
tar: Current `rte_cryptodev_pmd.h' is newer or same age
tar: Current `rte_ring.h' is newer or same age
tar: Current `cmdline_cirbuf.h' is newer or same age
tar: Current `rte_hash.h' is newer or same age
tar: Current `rte_eth_ring.h' is newer or same age
tar: Current `rte_atomic_32.h' is newer or same age
tar: Current `exec-env/rte_interrupts.h' is newer or same age
tar: Current `exec-env/rte_dom0_common.h' is newer or same age
tar: Current `exec-env/rte_kni_common.h' is newer or same age
tar: Current `rte_table.h' is newer or same age
tar: Current `rte_table_stub.h' is newer or same age
tar: Current `rte_ip.h' is newer or same age
tar: Current `rte_version.h' is newer or same age
tar: Current `rte_pdump.h' is newer or same age
tar: Current `rte_timer.h' is newer or same age
tar: Current `rte_port_ras.h' is newer or same age
tar: Current `rte_pci.h' is newer or same age
tar: Current `rte_cpuflags.h' is newer or same age
tar: Current `rte_malloc_heap.h' is newer or same age
tar: Current `rte_power.h' is newer or same age
tar: Current `rte_spinlock.h' is newer or same age
tar: Current `rte_launch.h' is newer or same age
tar: Current `rte_byteorder_32.h' is newer or same age
tar: Current `rte_cryptodev.h' is newer or same age
tar: Current `rte_gre.h' is newer or same age
tar: Current `rte_alarm.h' is newer or same age
tar: Current `rte_lpm6.h' is newer or same age
tar: Current `rte_common.h' is newer or same age
tar: Current `rte_acl_osdep.h' is newer or same age
tar: Current `rte_mbuf.h' is newer or same age
tar: Current `rte_virtio_net.h' is newer or same age
tar: Current `rte_devargs.h' is newer or same age
tar: Current `rte_sched_common.h' is newer or same age
tar: Current `rte_sched.h' is newer or same age
tar: Current `rte_bitmap.h' is newer or same age
tar: Current `rte_byteorder_64.h' is newer or same age
tar: Current `rte_port_frag.h' is newer or same age
tar: Current `rte_eal_memconfig.h' is newer or same age
tar: Current `rte_vect.h' is newer or same age
tar: Current `rte_malloc.h' is newer or same age
tar: Current `rte_branch_prediction.h' is newer or same age
tar: Current `rte_reciprocal.h' is newer or same age
tar: Current `cmdline_parse_portlist.h' is newer or same age
tar: Current `rte_debug.h' is newer or same age
tar: Current `rte_tailq.h' is newer or same age
tar: Current `cmdline_rdline.h' is newer or same age
tar: Current `rte_eth_null.h' is newer or same age
tar: Current `rte_dev.h' is newer or same age
tar: Current `rte_keepalive.h' is newer or same age
tar: Current `cmdline_parse_ipaddr.h' is newer or same age
tar: Current `rte_pmd_ixgbe.h' is newer or same age
tar: Current `rte_approx.h' is newer or same age
tar: Current `rte_meter.h' is newer or same age
tar: Current `rte_rtm.h' is newer or same age
tar: Current `rte_atomic_64.h' is newer or same age
tar: Current `rte_reorder.h' is newer or same age
tar: Current `rte_mempool.h' is newer or same age
tar: Current `cmdline_parse_etheraddr.h' is newer or same age
tar: Current `rte_log.h' is newer or same age
tar: Current `cmdline_socket.h' is newer or same age
tar: Current `rte_red.h' is newer or same age
tar: Current `rte_cfgfile.h' is newer or same age
tar: Current `rte_pipeline.h' is newer or same age
tar: Current `rte_dev_info.h' is newer or same age
tar: Current `cmdline.h' is newer or same age
tar: Current `rte_arp.h' is newer or same age
tar: Current `rte_eal.h' is newer or same age
tar: Current `rte_atomic.h' is newer or same age
tar: Current `cmdline_parse.h' is newer or same age
tar: Current `rte_port_ethdev.h' is newer or same age
tar: Current `cmdline_parse_string.h' is newer or same age
tar: Current `rte_ether.h' is newer or same age
tar: Current `rte_distributor.h' is newer or same age
tar: Current `rte_pci_dev_feature_defs.h' is newer or same age
tar: Current `rte_table_array.h' is newer or same age
tar: Current `rte_string_fns.h' is newer or same age
tar: Current `rte_table_lpm.h' is newer or same age
tar: Current `cmdline_vt100.h' is newer or same age
tar: Current `rte_port_fd.h' is newer or same age
tar: Current `rte_time.h' is newer or same age
tar: Current `rte_hexdump.h' is newer or same age
tar: Current `rte_sctp.h' is newer or same age
tar: Current `rte_table_hash.h' is newer or same age
tar: Current `rte_crypto_sym.h' is newer or same age
tar: Current `rte_net.h' is newer or same age
HEAD is now at ed26e3e... ofp-actions: Always consider inconsistent CT actions as an error.
configure: WARNING: cannot find libcap-ng.
--user option will not be supported on Linux.
(you may use --disable-libcapng to suppress this warning). 
./configure: line 13578: .//python: Is a directory
From https://github.com/openvswitch/ovs
 * branch            ed26e3ea9995ba632e681d5990af5ee9814f650e -> FETCH_HEAD
HEAD is now at a8c40fa... Update version for v2.5.0 release
fatal: unable to access 'https://github.com/qemu/qemu.git/': Could not resolve host: github.com; Name or service not known
make[1]: *** [force_make] Error 1
make: *** [qemu] Error 2

2017-12-13 10:22:25,273 [ERROR] yardstick.benchmark.core.task task.py:276 Scenario NO.1: "QemuMigrate" ERROR!
2017-12-13 10:22:25,274 [ERROR] yardstick.benchmark.core.task task.py:127 Testcase: "migrate-node-context" FAILED!!!
Traceback (most recent call last):
  File "/usr/local/lib/python2.7/dist-packages/yardstick-0.1.dev0-py2.7.egg/yardstick/benchmark/core/task.py", line 123, in start
    data = self._run(scenarios, run_in_parallel, args.output_file)
  File "/usr/local/lib/python2.7/dist-packages/yardstick-0.1.dev0-py2.7.egg/yardstick/benchmark/core/task.py", line 278, in _run
    "{0} runner status {1}".format(runner.__execution_type__, status))
RuntimeError: Duration runner status 1
2017-12-13 10:22:25,275 [INFO] yardstick.benchmark.core.task task.py:143 Task /opt/migrate-node-context.yaml finished in 453 secs
2017-12-13 10:22:25,285 [INFO] yardstick.benchmark.core.task task.py:165 Report can be found in '/tmp/report.html'
2017-12-13 10:22:25,286 [INFO] yardstick.benchmark.core.task task.py:152 Total finished in 453 secs
2017-12-13 10:22:25,286 [INFO] yardstick.benchmark.core.task task.py:156 To generate report, execute command 'yardstick report generate 1d3ec479-9c98-433b-9534-1e13b237645d migrate-node-context'
2017-12-13 10:22:25,286 [INFO] yardstick.benchmark.core.task task.py:157 Task ALL DONE, exiting
2017-12-13 10:22:25,287 [INFO] yardstick.cmd.commands.task task.py:64 Task FAILED
<type 'exceptions.RuntimeError'>
Python 2.7.6: /usr/bin/python
Wed Dec 13 10:22:25 2017

A problem occurred in a Python script.  Here is the sequence of
function calls leading up to the error, in the order they occurred.

 /usr/local/bin/yardstick in <module>()
    8 if __name__ == '__main__':
    9     sys.argv[0] = re.sub(r'(-script\.pyw?|\.exe)?$', '', sys.argv[0])
   10     sys.exit(
   11         load_entry_point('yardstick==0.1.dev0', 'console_scripts', 'yardstick')()
   12     )
load_entry_point = <function load_entry_point>

 /usr/local/lib/python2.7/dist-packages/yardstick-0.1.dev0-py2.7.egg/yardstick/main.py in main()
   47 def main():
   48     """yardstick main"""
   49     YardstickCLI().main(sys.argv[1:])
   50 
   51 if __name__ == '__main__':
global YardstickCLI = <class yardstick.cmd.cli.YardstickCLI>
).main = <unbound method YardstickCLI.main>
global sys = <module 'sys' (built-in)>
sys.argv = ['/usr/local/bin/yardstick', '-d', 'task', 'start', '/opt/migrate-node-context.yaml']

 /usr/local/lib/python2.7/dist-packages/yardstick-0.1.dev0-py2.7.egg/yardstick/cmd/cli.py in main(self=<yardstick.cmd.cli.YardstickCLI instance>, argv=['-d', 'task', 'start', '/opt/migrate-node-context.yaml'])
  160             self._handle_global_opts()
  161 
  162             self._dispatch_func_notask()
  163         finally:
  164             self._clear_config_opts()
self = <yardstick.cmd.cli.YardstickCLI instance>
self._dispatch_func_notask = <bound method YardstickCLI._dispatch_func_notask of <yardstick.cmd.cli.YardstickCLI instance>>

 /usr/local/lib/python2.7/dist-packages/yardstick-0.1.dev0-py2.7.egg/yardstick/cmd/cli.py in _dispatch_func_notask(self=<yardstick.cmd.cli.YardstickCLI instance>)
  138         # dispatch to category parser
  139         func = CONF.category.func
  140         func(CONF.category)
  141 
  142     def _dispatch_func_task(self, task_id):
func = <bound method TaskCommands.do_start of <yardstick.cmd.commands.task.TaskCommands object>>
global CONF = <oslo_config.cfg.ConfigOpts object>
CONF.category undefined

 /usr/local/lib/python2.7/dist-packages/yardstick-0.1.dev0-py2.7.egg/yardstick/cmd/commands/task.py in do_start(self=<yardstick.cmd.commands.task.TaskCommands object>, args=<oslo_config.cfg.SubCommandAttr object>, **kwargs={})
   63         else:
   64             LOG.info('Task FAILED')
   65             raise RuntimeError('Task Failed')
   66 
   67     def _write_error_data(self, error):
builtinRuntimeError = <type 'exceptions.RuntimeError'>
<type 'exceptions.RuntimeError'>: Task Failed
    __class__ = <type 'exceptions.RuntimeError'>
    __delattr__ = <method-wrapper '__delattr__' of exceptions.RuntimeError object>
    __dict__ = {}
    __doc__ = 'Unspecified run-time error.'
    __format__ = <built-in method __format__ of exceptions.RuntimeError object>
    __getattribute__ = <method-wrapper '__getattribute__' of exceptions.RuntimeError object>
    __getitem__ = <method-wrapper '__getitem__' of exceptions.RuntimeError object>
    __getslice__ = <method-wrapper '__getslice__' of exceptions.RuntimeError object>
    __hash__ = <method-wrapper '__hash__' of exceptions.RuntimeError object>
    __init__ = <method-wrapper '__init__' of exceptions.RuntimeError object>
    __new__ = <built-in method __new__ of type object>
    __reduce__ = <built-in method __reduce__ of exceptions.RuntimeError object>
    __reduce_ex__ = <built-in method __reduce_ex__ of exceptions.RuntimeError object>
    __repr__ = <method-wrapper '__repr__' of exceptions.RuntimeError object>
    __setattr__ = <method-wrapper '__setattr__' of exceptions.RuntimeError object>
    __setstate__ = <built-in method __setstate__ of exceptions.RuntimeError object>
    __sizeof__ = <built-in method __sizeof__ of exceptions.RuntimeError object>
    __str__ = <method-wrapper '__str__' of exceptions.RuntimeError object>
    __subclasshook__ = <built-in method __subclasshook__ of type object>
    __unicode__ = <built-in method __unicode__ of exceptions.RuntimeError object>
    args = ('Task Failed',)
    message = 'Task Failed'

The above is a description of an error in a Python program.  Here is
the original traceback:

Traceback (most recent call last):
  File "/usr/local/bin/yardstick", line 11, in <module>
    load_entry_point('yardstick==0.1.dev0', 'console_scripts', 'yardstick')()
  File "/usr/local/lib/python2.7/dist-packages/yardstick-0.1.dev0-py2.7.egg/yardstick/main.py", line 49, in main
    YardstickCLI().main(sys.argv[1:])
  File "/usr/local/lib/python2.7/dist-packages/yardstick-0.1.dev0-py2.7.egg/yardstick/cmd/cli.py", line 162, in main
    self._dispatch_func_notask()
  File "/usr/local/lib/python2.7/dist-packages/yardstick-0.1.dev0-py2.7.egg/yardstick/cmd/cli.py", line 140, in _dispatch_func_notask
    func(CONF.category)
  File "/usr/local/lib/python2.7/dist-packages/yardstick-0.1.dev0-py2.7.egg/yardstick/cmd/commands/task.py", line 65, in do_start
    raise RuntimeError('Task Failed')
RuntimeError: Task Failed


2017-12-13 10:22:25,393 [DEBUG] yardstick.benchmark.runners.base base.py:122 Terminating all runners
None
Yardstick Failed !!!
8a83b6e660b9
8a83b6e660b9
Preparing packages...
kernel-4.4.50_rt62_1712130143nfv-1.x86_64
Preparing packages...
kernel-devel-4.4.50_rt62_1712130143nfv-1.x86_64
Generating grub configuration file ...
Found linux image: /boot/vmlinuz-3.10.0-514.26.2.el7.x86_64
Found initrd image: /boot/initramfs-3.10.0-514.26.2.el7.x86_64.img
Found linux image: /boot/vmlinuz-3.10.0-514.26.1.el7.x86_64
Found initrd image: /boot/initramfs-3.10.0-514.26.1.el7.x86_64.img
Found linux image: /boot/vmlinuz-3.10.0-514.21.2.el7.x86_64
Found initrd image: /boot/initramfs-3.10.0-514.21.2.el7.x86_64.img
Found linux image: /boot/vmlinuz-0-rescue-c1151c20d2a4486c9a31d95f628b52b1
Found initrd image: /boot/initramfs-0-rescue-c1151c20d2a4486c9a31d95f628b52b1.img
done
rpm: no packages given for erase
Connection to 10.10.100.22 closed by remote host.
live migration test case failed
ssh: connect to host 10.10.100.22 port 22: Connection refused
ssh: connect to host 10.10.100.22 port 22: Connection refused
ssh: connect to host 10.10.100.22 port 22: Connection refused
ssh: connect to host 10.10.100.22 port 22: Connection refused
ssh: connect to host 10.10.100.22 port 22: Connection refused
ssh: connect to host 10.10.100.22 port 22: Connection refused
ssh: connect to host 10.10.100.22 port 22: Connection refused
livemigration test case execution FAILED
Build step 'Execute shell' marked build as failure
Email was triggered for: Failure - Any
Sending email for trigger: Failure - Any
Sending email to: tbramwell@linuxfoundation.org agardner@linuxfoundation.org rgrigar@linuxfoundation.org
Finished: FAILURE