FailedConsole Output

Started by upstream project "fuel-os-odl-ovs-noha-virtual-daily-hunter" build number 148
originally caused by:
 Started by timer
Running as SYSTEM
[EnvInject] - Loading node environment variables.
Building remotely on ericsson-virtual2 (fuel-virtual ci-resource opnfv-sysinfo) in workspace /home/jenkins/opnfv/slave_root/workspace/functest-fuel-virtual-daily-hunter
using credential d42411ac011ad6f3dd2e1fa34eaa5d87f910eb2e
Wiping out workspace first.
Cloning the remote Git repository
Cloning repository https://gerrit.opnfv.org/gerrit/functest
 > git init /home/jenkins/opnfv/slave_root/workspace/functest-fuel-virtual-daily-hunter # timeout=10
Fetching upstream changes from https://gerrit.opnfv.org/gerrit/functest
 > git --version # timeout=10
using GIT_SSH to set credentials Jenkins Master SSH
 > git fetch --tags --progress https://gerrit.opnfv.org/gerrit/functest +refs/heads/*:refs/remotes/origin/* # timeout=15
 > git config remote.origin.url https://gerrit.opnfv.org/gerrit/functest # timeout=10
 > git config --add remote.origin.fetch +refs/heads/*:refs/remotes/origin/* # timeout=10
 > git config remote.origin.url https://gerrit.opnfv.org/gerrit/functest # timeout=10
Fetching upstream changes from https://gerrit.opnfv.org/gerrit/functest
using GIT_SSH to set credentials Jenkins Master SSH
 > git fetch --tags --progress https://gerrit.opnfv.org/gerrit/functest +refs/heads/*:refs/remotes/origin/* # timeout=15
 > git rev-parse refs/remotes/origin/stable/hunter^{commit} # timeout=10
 > git rev-parse refs/remotes/origin/origin/stable/hunter^{commit} # timeout=10
Checking out Revision 9a07ca5f3ddb729f70c9dc001262f6b5e011a6b4 (refs/remotes/origin/stable/hunter)
 > git config core.sparsecheckout # timeout=10
 > git checkout -f 9a07ca5f3ddb729f70c9dc001262f6b5e011a6b4 # timeout=15
Commit message: "Merge "Print OpenStack version in connection_check" into stable/hunter"
 > git rev-list --no-walk 9a07ca5f3ddb729f70c9dc001262f6b5e011a6b4 # timeout=10
Run condition [Regular expression match] enabling prebuild for step [Execute shell]
Run condition [Regular expression match] enabling prebuild for step [Execute shell]
No emails were triggered.
New run name is '806 Suite: daily Scenario: os-odl-ovs-noha'
[description-setter] Description set: Built on ericsson-virtual2
[functest-fuel-virtual-daily-hunter] $ /bin/bash /tmp/jenkins2824107650704209399.sh
Cleaning up docker containers/images...
  Removing opnfv/functest:<none> images and their containers...
      Removing image_id: 17258c36f22a and its containers
      Removing image_id: 0fe596752f2a and its containers
      Removing image_id: b99f10f6d608 and its containers
Regular expression run condition: Expression=[os-.*], Label=[os-odl-ovs-noha]
Run condition [Regular expression match] enabling perform for step [Execute shell]
[functest-fuel-virtual-daily-hunter] $ /usr/bin/env bash /tmp/jenkins2634303304638299685.sh
Map mcp ssh_key
<13>Sep 21 07:31:15 fetch_os_creds.info: Fetching rc file...
<13>Sep 21 07:31:15 fetch_os_creds.info: Verifying connectivity to 10.20.0.2...
<13>Sep 21 07:31:15 fetch_os_creds.info: 10.20.0.2 is reachable!
<13>Sep 21 07:31:16 fetch_os_creds.info: ... from controller 172.16.10.36 ...
Warning: Permanently added '172.16.10.36' (ECDSA) to the list of known hosts.
-------- Credentials: --------

export OS_IDENTITY_API_VERSION=3
export OS_PROJECT_DOMAIN_NAME=Default
export OS_USER_DOMAIN_NAME=Default
export OS_PROJECT_NAME=admin
export OS_TENANT_NAME=admin
export OS_USERNAME=admin
export OS_PASSWORD=opnfv_secret
export OS_REGION_NAME=RegionOne
export OS_INTERFACE=internal
export OS_ENDPOINT_TYPE="internal"
export OS_CACERT="/etc/ssl/certs/ca-certificates.crt"
export SDN_CONTROLLER_USER=admin
export SDN_CONTROLLER_RESTCONFPORT=8282
export SDN_CONTROLLER_PASSWORD=admin
export SDN_CONTROLLER_WEBPORT=8282
export SDN_CONTROLLER_IP=10.16.0.107
export VOLUME_DEVICE_NAME=sdc
export OS_AUTH_URL=http://172.16.10.36:35357/v3
Functest: Start Docker and prepare environment
Functest: Download images that will be used by test cases
+ wget_opts='-N --tries=1 --connect-timeout=30'
+ '[' -t 1 ']'
+ wget_opts='-N --tries=1 --connect-timeout=30 --progress=dot:giga'
+ cat
+ wget -N --tries=1 --connect-timeout=30 --progress=dot:giga -i - -P /home/jenkins/opnfv/functest/images
--2019-09-21 07:31:16--  http://download.cirros-cloud.net/0.4.0/cirros-0.4.0-x86_64-disk.img
Resolving download.cirros-cloud.net (download.cirros-cloud.net)... 64.90.42.85, 2607:f298:6:a036::bd6:a72a
Connecting to download.cirros-cloud.net (download.cirros-cloud.net)|64.90.42.85|:80... connected.
HTTP request sent, awaiting response... 304 Not Modified
File ‘/home/jenkins/opnfv/functest/images/cirros-0.4.0-x86_64-disk.img’ not modified on server. Omitting download.

--2019-09-21 07:31:17--  https://cloud-images.ubuntu.com/releases/14.04/release/ubuntu-14.04-server-cloudimg-amd64-disk1.img
Resolving cloud-images.ubuntu.com (cloud-images.ubuntu.com)... 91.189.88.89, 2001:67c:1560:8001::8001
Connecting to cloud-images.ubuntu.com (cloud-images.ubuntu.com)|91.189.88.89|:443... connected.
HTTP request sent, awaiting response... 302 Found
Location: https://cloud-images.ubuntu.com/releases/trusty/release/ubuntu-14.04-server-cloudimg-amd64-disk1.img [following]
--2019-09-21 07:31:17--  https://cloud-images.ubuntu.com/releases/trusty/release/ubuntu-14.04-server-cloudimg-amd64-disk1.img
Reusing existing connection to cloud-images.ubuntu.com:443.
HTTP request sent, awaiting response... 304 Not Modified
File ‘/home/jenkins/opnfv/functest/images/ubuntu-14.04-server-cloudimg-amd64-disk1.img’ not modified on server. Omitting download.

--2019-09-21 07:31:17--  https://cloud-images.ubuntu.com/releases/16.04/release/ubuntu-16.04-server-cloudimg-amd64-disk1.img
Reusing existing connection to cloud-images.ubuntu.com:443.
HTTP request sent, awaiting response... 302 Found
Location: https://cloud-images.ubuntu.com/releases/xenial/release/ubuntu-16.04-server-cloudimg-amd64-disk1.img [following]
--2019-09-21 07:31:17--  https://cloud-images.ubuntu.com/releases/xenial/release/ubuntu-16.04-server-cloudimg-amd64-disk1.img
Reusing existing connection to cloud-images.ubuntu.com:443.
HTTP request sent, awaiting response... 304 Not Modified
File ‘/home/jenkins/opnfv/functest/images/ubuntu-16.04-server-cloudimg-amd64-disk1.img’ not modified on server. Omitting download.

--2019-09-21 07:31:17--  http://download.cirros-cloud.net/0.4.0/cirros-0.4.0-aarch64-disk.img
Connecting to download.cirros-cloud.net (download.cirros-cloud.net)|64.90.42.85|:80... connected.
HTTP request sent, awaiting response... 304 Not Modified
File ‘/home/jenkins/opnfv/functest/images/cirros-0.4.0-aarch64-disk.img’ not modified on server. Omitting download.

--2019-09-21 07:31:17--  https://cloud-images.ubuntu.com/releases/14.04/release/ubuntu-14.04-server-cloudimg-arm64-uefi1.img
Connecting to cloud-images.ubuntu.com (cloud-images.ubuntu.com)|91.189.88.89|:443... connected.
HTTP request sent, awaiting response... 302 Found
Location: https://cloud-images.ubuntu.com/releases/trusty/release/ubuntu-14.04-server-cloudimg-arm64-uefi1.img [following]
--2019-09-21 07:31:18--  https://cloud-images.ubuntu.com/releases/trusty/release/ubuntu-14.04-server-cloudimg-arm64-uefi1.img
Reusing existing connection to cloud-images.ubuntu.com:443.
HTTP request sent, awaiting response... 304 Not Modified
File ‘/home/jenkins/opnfv/functest/images/ubuntu-14.04-server-cloudimg-arm64-uefi1.img’ not modified on server. Omitting download.

--2019-09-21 07:31:18--  http://repository.cloudifysource.org/cloudify/19.01.24/community-release/cloudify-docker-manager-community-19.01.24.tar
Resolving repository.cloudifysource.org (repository.cloudifysource.org)... 52.84.214.55, 52.84.214.18, 52.84.214.202, ...
Connecting to repository.cloudifysource.org (repository.cloudifysource.org)|52.84.214.55|:80... connected.
HTTP request sent, awaiting response... 304 Not Modified
File ‘/home/jenkins/opnfv/functest/images/cloudify-docker-manager-community-19.01.24.tar’ not modified on server. Omitting download.

--2019-09-21 07:31:18--  http://testresults.opnfv.org/functest/vyos-1.1.8-amd64.qcow2
Resolving testresults.opnfv.org (testresults.opnfv.org)... 104.154.71.112
Connecting to testresults.opnfv.org (testresults.opnfv.org)|104.154.71.112|:80... connected.
HTTP request sent, awaiting response... 304 Not Modified
File ‘/home/jenkins/opnfv/functest/images/vyos-1.1.8-amd64.qcow2’ not modified on server. Omitting download.

--2019-09-21 07:31:18--  http://testresults.opnfv.org/functest/shaker-image.qcow2
Reusing existing connection to testresults.opnfv.org:80.
HTTP request sent, awaiting response... 304 Not Modified
File ‘/home/jenkins/opnfv/functest/images/shaker-image.qcow2’ not modified on server. Omitting download.

--2019-09-21 07:31:18--  http://testresults.opnfv.org/functest/shaker-image-arm64.qcow2
Reusing existing connection to testresults.opnfv.org:80.
HTTP request sent, awaiting response... 304 Not Modified
File ‘/home/jenkins/opnfv/functest/images/shaker-image-arm64.qcow2’ not modified on server. Omitting download.

Warning: Permanently added '10.20.0.2' (ECDSA) to the list of known hosts.
tempest_conf.yaml:
---
compute-feature-enabled:
    shelve: false
    vnc_console: false
    spice_console: true
identity-feature-enabled:
    api_v2: false
    api_v2_admin: false
image-feature-enabled:
    api_v2: true
    api_v1: false
volume:
    storage_protocol: iSCSI
volume-feature-enabled:
    backup: false
compute:
    max_microversion: 2.65
Functest: Pulling Functest Docker image opnfv/functest-healthcheck:hunter ...
Running Functest tier 'healthcheck'. CMD: docker run --rm  -e INSTALLER_TYPE=fuel -e INSTALLER_IP=10.20.0.2     -e NODE_NAME=ericsson-virtual2 -e DEPLOY_SCENARIO=os-odl-ovs-noha     -e BUILD_TAG=jenkins-functest-fuel-virtual-daily-hunter-806 -e DEPLOY_TYPE=virt -e CI_LOOP=daily     -e TEST_DB_URL=http://testresults.opnfv.org/test/api/v1/results -e ENERGY_RECORDER_API_URL=http://energy.opnfv.fr/resources     -e DEBUG=true -e POD_ARCH=x86_64 -e BLOCK_MIGRATION=false -e SDN_CONTROLLER_RESTCONFPORT=8080 -e IMAGE_PROPERTIES=hw_disk_bus:scsi,hw_scsi_model:virtio-scsi,hw_mem_page_size:large -e FLAVOR_EXTRA_SPECS=hw:mem_page_size:large -v /home/jenkins/opnfv/functest/images:/home/opnfv/functest/images -v /home/jenkins/opnfv/functest/results/hunter:/home/opnfv/functest/results -v /var/lib/opnfv/mcp.rsa:/root/.ssh/id_rsa       -v /home/jenkins/opnfv-openrc.sh:/home/opnfv/functest/conf/env_file      -v /tmp/tmp.Vfg1KZE9rz:/usr/lib/python2.7/site-packages/functest/opnfv_tests/openstack/tempest/custom_tests/tempest_conf.yaml  opnfv/functest-healthcheck:hunter /bin/bash -c 'run_tests -r -t all'
2019-09-21 05:31:31,555 - xtesting.ci.run_tests - INFO - Deployment description:

+--------------------------------------+----------------------------------------------------------+
|               ENV VAR                |                          VALUE                           |
+--------------------------------------+----------------------------------------------------------+
|              BUILD_TAG               |      jenkins-functest-fuel-virtual-daily-hunter-806      |
|             TEST_DB_URL              |     http://testresults.opnfv.org/test/api/v1/results     |
|     ENERGY_RECORDER_API_PASSWORD     |                                                          |
|               CI_LOOP                |                          daily                           |
|                DEBUG                 |                           true                           |
|            INSTALLER_TYPE            |                           fuel                           |
|       ENERGY_RECORDER_API_URL        |             http://energy.opnfv.fr/resources             |
|           DEPLOY_SCENARIO            |                     os-odl-ovs-noha                      |
|       ENERGY_RECORDER_API_USER       |                                                          |
|              NODE_NAME               |                    ericsson-virtual2                     |
+--------------------------------------+----------------------------------------------------------+

2019-09-21 05:31:31,560 - xtesting.ci.run_tests - INFO - Sourcing env file /var/lib/xtesting/conf/env_file


export OS_IDENTITY_API_VERSION=3
export OS_PROJECT_DOMAIN_NAME=Default
export OS_USER_DOMAIN_NAME=Default
export OS_PROJECT_NAME=admin
export OS_TENANT_NAME=admin
export OS_USERNAME=admin
export OS_PASSWORD=opnfv_secret
export OS_REGION_NAME=RegionOne
export OS_INTERFACE=internal
export OS_ENDPOINT_TYPE="internal"
export OS_CACERT="/etc/ssl/certs/ca-certificates.crt"
export SDN_CONTROLLER_USER=admin
export SDN_CONTROLLER_RESTCONFPORT=8282
export SDN_CONTROLLER_PASSWORD=admin
export SDN_CONTROLLER_WEBPORT=8282
export SDN_CONTROLLER_IP=10.16.0.107
export VOLUME_DEVICE_NAME=sdc
export OS_AUTH_URL=http://172.16.10.36:35357/v3

2019-09-21 05:31:31,561 - xtesting.ci.run_tests - INFO - TESTS TO BE EXECUTED:

+---------------------+---------------+-------------------------------------------------+------------------------------------------+
|        TIERS        |     ORDER     |                   DESCRIPTION                   |                TESTCASES                 |
+---------------------+---------------+-------------------------------------------------+------------------------------------------+
|     healthcheck     |       0       |     First tier to be executed to verify the     |     connection_check tenantnetwork1      |
|                     |               |           basic operations in the VIM.          |     tenantnetwork2 vmready1 vmready2     |
|                     |               |                                                 |      singlevm1 singlevm2 vping_ssh       |
|                     |               |                                                 |      vping_userdata cinder_test odl      |
|                     |               |                                                 |              tempest_smoke               |
+---------------------+---------------+-------------------------------------------------+------------------------------------------+

2019-09-21 05:31:31,592 - xtesting.ci.run_tests - INFO - Loading test case 'connection_check'...
2019-09-21 05:31:31,952 - xtesting.ci.run_tests - INFO - Running test case 'connection_check'...
2019-09-21 05:31:35,188 - xtesting.core.testcase - INFO - The results were successfully pushed to DB
2019-09-21 05:31:35,188 - xtesting.ci.run_tests - INFO - Test result:

+--------------------------+------------------+------------------+----------------+
|        TEST CASE         |     PROJECT      |     DURATION     |     RESULT     |
+--------------------------+------------------+------------------+----------------+
|     connection_check     |     functest     |      00:03       |      PASS      |
+--------------------------+------------------+------------------+----------------+

2019-09-21 05:31:35,219 - xtesting.ci.run_tests - INFO - Loading test case 'tenantnetwork1'...
2019-09-21 05:31:36,070 - xtesting.ci.run_tests - INFO - Running test case 'tenantnetwork1'...
2019-09-21 05:31:41,265 - xtesting.core.testcase - INFO - The results were successfully pushed to DB
2019-09-21 05:31:41,265 - xtesting.ci.run_tests - INFO - Test result:

+------------------------+------------------+------------------+----------------+
|       TEST CASE        |     PROJECT      |     DURATION     |     RESULT     |
+------------------------+------------------+------------------+----------------+
|     tenantnetwork1     |     functest     |      00:05       |      PASS      |
+------------------------+------------------+------------------+----------------+

2019-09-21 05:31:48,111 - xtesting.ci.run_tests - INFO - Loading test case 'tenantnetwork2'...
2019-09-21 05:31:49,916 - xtesting.ci.run_tests - INFO - Running test case 'tenantnetwork2'...
2019-09-21 05:31:55,789 - xtesting.core.testcase - INFO - The results were successfully pushed to DB
2019-09-21 05:31:55,790 - xtesting.ci.run_tests - INFO - Test result:

+------------------------+------------------+------------------+----------------+
|       TEST CASE        |     PROJECT      |     DURATION     |     RESULT     |
+------------------------+------------------+------------------+----------------+
|     tenantnetwork2     |     functest     |      00:06       |      PASS      |
+------------------------+------------------+------------------+----------------+

2019-09-21 05:32:03,764 - xtesting.ci.run_tests - INFO - Loading test case 'vmready1'...
2019-09-21 05:32:04,580 - xtesting.ci.run_tests - INFO - Running test case 'vmready1'...
2019-09-21 05:32:10,675 - xtesting.core.testcase - INFO - The results were successfully pushed to DB
2019-09-21 05:32:10,675 - xtesting.ci.run_tests - INFO - Test result:

+-------------------+------------------+------------------+----------------+
|     TEST CASE     |     PROJECT      |     DURATION     |     RESULT     |
+-------------------+------------------+------------------+----------------+
|      vmready1     |     functest     |      00:06       |      PASS      |
+-------------------+------------------+------------------+----------------+

2019-09-21 05:32:18,581 - xtesting.ci.run_tests - INFO - Loading test case 'vmready2'...
2019-09-21 05:32:20,245 - xtesting.ci.run_tests - INFO - Running test case 'vmready2'...
2019-09-21 05:32:27,337 - xtesting.core.testcase - INFO - The results were successfully pushed to DB
2019-09-21 05:32:27,338 - xtesting.ci.run_tests - INFO - Test result:

+-------------------+------------------+------------------+----------------+
|     TEST CASE     |     PROJECT      |     DURATION     |     RESULT     |
+-------------------+------------------+------------------+----------------+
|      vmready2     |     functest     |      00:07       |      PASS      |
+-------------------+------------------+------------------+----------------+

2019-09-21 05:32:36,289 - xtesting.ci.run_tests - INFO - Loading test case 'singlevm1'...
2019-09-21 05:32:37,057 - xtesting.ci.run_tests - INFO - Running test case 'singlevm1'...
2019-09-21 05:33:14,223 - xtesting.core.testcase - INFO - The results were successfully pushed to DB
2019-09-21 05:33:14,223 - xtesting.ci.run_tests - INFO - Test result:

+-------------------+------------------+------------------+----------------+
|     TEST CASE     |     PROJECT      |     DURATION     |     RESULT     |
+-------------------+------------------+------------------+----------------+
|     singlevm1     |     functest     |      00:37       |      PASS      |
+-------------------+------------------+------------------+----------------+

2019-09-21 05:33:26,167 - xtesting.ci.run_tests - INFO - Loading test case 'singlevm2'...
2019-09-21 05:33:27,746 - xtesting.ci.run_tests - INFO - Running test case 'singlevm2'...
2019-09-21 05:33:59,935 - xtesting.core.testcase - INFO - The results were successfully pushed to DB
2019-09-21 05:33:59,935 - xtesting.ci.run_tests - INFO - Test result:

+-------------------+------------------+------------------+----------------+
|     TEST CASE     |     PROJECT      |     DURATION     |     RESULT     |
+-------------------+------------------+------------------+----------------+
|     singlevm2     |     functest     |      00:32       |      PASS      |
+-------------------+------------------+------------------+----------------+

2019-09-21 05:34:12,251 - xtesting.ci.run_tests - INFO - Loading test case 'vping_ssh'...
2019-09-21 05:34:14,051 - xtesting.ci.run_tests - INFO - Running test case 'vping_ssh'...
2019-09-21 05:35:05,584 - xtesting.core.testcase - INFO - The results were successfully pushed to DB
2019-09-21 05:35:05,584 - xtesting.ci.run_tests - INFO - Test result:

+-------------------+------------------+------------------+----------------+
|     TEST CASE     |     PROJECT      |     DURATION     |     RESULT     |
+-------------------+------------------+------------------+----------------+
|     vping_ssh     |     functest     |      00:51       |      PASS      |
+-------------------+------------------+------------------+----------------+

2019-09-21 05:35:21,503 - xtesting.ci.run_tests - INFO - Loading test case 'vping_userdata'...
2019-09-21 05:35:23,298 - xtesting.ci.run_tests - INFO - Running test case 'vping_userdata'...
2019-09-21 05:36:01,003 - xtesting.core.testcase - INFO - The results were successfully pushed to DB
2019-09-21 05:36:01,004 - xtesting.ci.run_tests - INFO - Test result:

+------------------------+------------------+------------------+----------------+
|       TEST CASE        |     PROJECT      |     DURATION     |     RESULT     |
+------------------------+------------------+------------------+----------------+
|     vping_userdata     |     functest     |      00:37       |      PASS      |
+------------------------+------------------+------------------+----------------+

2019-09-21 05:36:14,937 - xtesting.ci.run_tests - INFO - Loading test case 'cinder_test'...
2019-09-21 05:36:16,703 - xtesting.ci.run_tests - INFO - Running test case 'cinder_test'...
2019-09-21 05:37:50,489 - xtesting.core.testcase - INFO - The results were successfully pushed to DB
2019-09-21 05:37:50,489 - xtesting.ci.run_tests - INFO - Test result:

+---------------------+------------------+------------------+----------------+
|      TEST CASE      |     PROJECT      |     DURATION     |     RESULT     |
+---------------------+------------------+------------------+----------------+
|     cinder_test     |     functest     |      01:34       |      PASS      |
+---------------------+------------------+------------------+----------------+

2019-09-21 05:38:09,184 - xtesting.ci.run_tests - INFO - Loading test case 'odl'...
2019-09-21 05:38:09,417 - xtesting.ci.run_tests - INFO - Running test case 'odl'...
[ WARN ] Deprecation Warning: Use Post Request in the future
2019-09-21 05:38:27,707 - xtesting.core.robotframework - INFO - 
==============================================================================
Basic & Neutron                                                               
==============================================================================
Basic & Neutron.Basic                                                         
==============================================================================
Basic & Neutron.Basic.Restconf Modules :: Test suite to verify Restconf is OK.
==============================================================================
Get Controller Modules :: Get the restconf modules, check 200 stat... | PASS |
------------------------------------------------------------------------------
Basic & Neutron.Basic.Restconf Modules :: Test suite to verify Res... | PASS |
1 critical test, 1 passed, 0 failed
1 test total, 1 passed, 0 failed
==============================================================================
Basic & Neutron.Basic                                                 | PASS |
1 critical test, 1 passed, 0 failed
1 test total, 1 passed, 0 failed
==============================================================================
Basic & Neutron.Neutron :: Test suite for Neutron Plugin                      
==============================================================================
Basic & Neutron.Neutron.Reachability                                          
==============================================================================
Get the complete list of networks :: Get the complete list of netw... | PASS |
------------------------------------------------------------------------------
Get the complete list of subnets :: Get the complete list of subnets  | PASS |
------------------------------------------------------------------------------
Get the complete list of ports :: Get the complete list of ports      | PASS |
------------------------------------------------------------------------------
Basic & Neutron.Neutron.Reachability                                  | PASS |
3 critical tests, 3 passed, 0 failed
3 tests total, 3 passed, 0 failed
==============================================================================
Basic & Neutron.Neutron.Networks :: Checking Network created in OpenStack a...
==============================================================================
Check OpenStack Networks :: Checking OpenStack Neutron for known n... | PASS |
------------------------------------------------------------------------------
Check OpenDaylight Networks :: Checking OpenDaylight Neutron API f... | PASS |
------------------------------------------------------------------------------
Create Network :: Create new network in OpenStack                     | PASS |
------------------------------------------------------------------------------
Check Network :: Check network created in OpenDaylight                | PASS |
------------------------------------------------------------------------------
Basic & Neutron.Neutron.Networks :: Checking Network created in Op... | PASS |
4 critical tests, 4 passed, 0 failed
4 tests total, 4 passed, 0 failed
==============================================================================
Basic & Neutron.Neutron.Subnets :: Checking Subnets created in OpenStack ar...
==============================================================================
Check OpenStack Subnets :: Checking OpenStack Neutron for known su... | PASS |
------------------------------------------------------------------------------
Check OpenDaylight subnets :: Checking OpenDaylight Neutron API fo... | PASS |
------------------------------------------------------------------------------
Create New subnet :: Create new subnet in OpenStack                   | PASS |
------------------------------------------------------------------------------
Check New subnet :: Check new subnet created in OpenDaylight          | PASS |
------------------------------------------------------------------------------
Basic & Neutron.Neutron.Subnets :: Checking Subnets created in Ope... | PASS |
4 critical tests, 4 passed, 0 failed
4 tests total, 4 passed, 0 failed
==============================================================================
Basic & Neutron.Neutron.Ports :: Checking Port created in OpenStack are pus...
==============================================================================
Check OpenStack ports :: Checking OpenStack Neutron for known ports   | PASS |
------------------------------------------------------------------------------
Check OpenDaylight ports :: Checking OpenDaylight Neutron API for ... | PASS |
------------------------------------------------------------------------------
Create New Port :: Create new port in OpenStack                       | PASS |
------------------------------------------------------------------------------
Check New Port :: Check new port created in OpenDaylight              | PASS |
------------------------------------------------------------------------------
Basic & Neutron.Neutron.Ports :: Checking Port created in OpenStac... | PASS |
4 critical tests, 4 passed, 0 failed
4 tests total, 4 passed, 0 failed
==============================================================================
Basic & Neutron.Neutron.Delete Ports :: Checking Port deleted in OpenStack ...
==============================================================================
Delete New Port :: Delete previously created port in OpenStack        | PASS |
------------------------------------------------------------------------------
Check Port Deleted :: Check port deleted in OpenDaylight              | PASS |
------------------------------------------------------------------------------
Basic & Neutron.Neutron.Delete Ports :: Checking Port deleted in O... | PASS |
2 critical tests, 2 passed, 0 failed
2 tests total, 2 passed, 0 failed
==============================================================================
Basic & Neutron.Neutron.Delete Subnets :: Checking Subnets deleted in OpenS...
==============================================================================
Delete New subnet :: Delete previously created subnet in OpenStack    | PASS |
------------------------------------------------------------------------------
Check New subnet deleted :: Check subnet deleted in OpenDaylight      | PASS |
------------------------------------------------------------------------------
Basic & Neutron.Neutron.Delete Subnets :: Checking Subnets deleted... | PASS |
2 critical tests, 2 passed, 0 failed
2 tests total, 2 passed, 0 failed
==============================================================================
Basic & Neutron.Neutron.Delete Networks :: Checking Network deleted in Open...
==============================================================================
Delete Network :: Delete network in OpenStack                         | PASS |
------------------------------------------------------------------------------
Check Network deleted :: Check network deleted in OpenDaylight        | PASS |
------------------------------------------------------------------------------
Basic & Neutron.Neutron.Delete Networks :: Checking Network delete... | PASS |
2 critical tests, 2 passed, 0 failed
2 tests total, 2 passed, 0 failed
==============================================================================
Basic & Neutron.Neutron :: Test suite for Neutron Plugin              | PASS |
21 critical tests, 21 passed, 0 failed
21 tests total, 21 passed, 0 failed
==============================================================================
Basic & Neutron                                                       | PASS |
22 critical tests, 22 passed, 0 failed
22 tests total, 22 passed, 0 failed
==============================================================================
Output:  /home/opnfv/functest/results/odl/output.xml

2019-09-21 05:38:27,729 - xtesting.core.robotframework - INFO - Results were successfully parsed
2019-09-21 05:38:27,849 - xtesting.core.robotframework - INFO - Results were successfully generated
2019-09-21 05:38:28,127 - xtesting.core.testcase - INFO - The results were successfully pushed to DB
2019-09-21 05:38:28,128 - xtesting.ci.run_tests - INFO - Test result:

+-------------------+------------------+------------------+----------------+
|     TEST CASE     |     PROJECT      |     DURATION     |     RESULT     |
+-------------------+------------------+------------------+----------------+
|        odl        |     functest     |      00:18       |      PASS      |
+-------------------+------------------+------------------+----------------+

2019-09-21 05:38:28,155 - xtesting.ci.run_tests - INFO - Loading test case 'tempest_smoke'...
2019-09-21 05:38:31,160 - xtesting.ci.run_tests - INFO - Running test case 'tempest_smoke'...
2019-09-21 05:42:58,628 - xtesting.core.testcase - INFO - The results were successfully pushed to DB
2019-09-21 05:42:58,629 - xtesting.ci.run_tests - INFO - Test result:

+-----------------------+------------------+------------------+----------------+
|       TEST CASE       |     PROJECT      |     DURATION     |     RESULT     |
+-----------------------+------------------+------------------+----------------+
|     tempest_smoke     |     functest     |      04:27       |      PASS      |
+-----------------------+------------------+------------------+----------------+

2019-09-21 05:43:07,354 - xtesting.ci.run_tests - INFO - Xtesting report:

+--------------------------+------------------+---------------------+------------------+----------------+
|        TEST CASE         |     PROJECT      |         TIER        |     DURATION     |     RESULT     |
+--------------------------+------------------+---------------------+------------------+----------------+
|     connection_check     |     functest     |     healthcheck     |      00:03       |      PASS      |
|      tenantnetwork1      |     functest     |     healthcheck     |      00:05       |      PASS      |
|      tenantnetwork2      |     functest     |     healthcheck     |      00:06       |      PASS      |
|         vmready1         |     functest     |     healthcheck     |      00:06       |      PASS      |
|         vmready2         |     functest     |     healthcheck     |      00:07       |      PASS      |
|        singlevm1         |     functest     |     healthcheck     |      00:37       |      PASS      |
|        singlevm2         |     functest     |     healthcheck     |      00:32       |      PASS      |
|        vping_ssh         |     functest     |     healthcheck     |      00:51       |      PASS      |
|      vping_userdata      |     functest     |     healthcheck     |      00:37       |      PASS      |
|       cinder_test        |     functest     |     healthcheck     |      01:34       |      PASS      |
|           odl            |     functest     |     healthcheck     |      00:18       |      PASS      |
|      tempest_smoke       |     functest     |     healthcheck     |      04:27       |      PASS      |
+--------------------------+------------------+---------------------+------------------+----------------+

2019-09-21 05:43:07,362 - xtesting.ci.run_tests - INFO - Execution exit value: Result.EX_OK
Functest: Pulling Functest Docker image opnfv/functest-smoke:hunter ...
Running Functest tier 'smoke'. CMD: docker run --rm  -e INSTALLER_TYPE=fuel -e INSTALLER_IP=10.20.0.2     -e NODE_NAME=ericsson-virtual2 -e DEPLOY_SCENARIO=os-odl-ovs-noha     -e BUILD_TAG=jenkins-functest-fuel-virtual-daily-hunter-806 -e DEPLOY_TYPE=virt -e CI_LOOP=daily     -e TEST_DB_URL=http://testresults.opnfv.org/test/api/v1/results -e ENERGY_RECORDER_API_URL=http://energy.opnfv.fr/resources     -e DEBUG=true -e POD_ARCH=x86_64 -e BLOCK_MIGRATION=false -e SDN_CONTROLLER_RESTCONFPORT=8080 -e IMAGE_PROPERTIES=hw_disk_bus:scsi,hw_scsi_model:virtio-scsi,hw_mem_page_size:large -e FLAVOR_EXTRA_SPECS=hw:mem_page_size:large -v /home/jenkins/opnfv/functest/images:/home/opnfv/functest/images -v /home/jenkins/opnfv/functest/results/hunter:/home/opnfv/functest/results -v /var/lib/opnfv/mcp.rsa:/root/.ssh/id_rsa       -v /home/jenkins/opnfv-openrc.sh:/home/opnfv/functest/conf/env_file      -v /tmp/tmp.Vfg1KZE9rz:/usr/lib/python2.7/site-packages/functest/opnfv_tests/openstack/tempest/custom_tests/tempest_conf.yaml  opnfv/functest-smoke:hunter /bin/bash -c 'run_tests -r -t all'
2019-09-21 05:43:19,694 - xtesting.ci.run_tests - INFO - Deployment description:

+--------------------------------------+----------------------------------------------------------+
|               ENV VAR                |                          VALUE                           |
+--------------------------------------+----------------------------------------------------------+
|              BUILD_TAG               |      jenkins-functest-fuel-virtual-daily-hunter-806      |
|             TEST_DB_URL              |     http://testresults.opnfv.org/test/api/v1/results     |
|     ENERGY_RECORDER_API_PASSWORD     |                                                          |
|               CI_LOOP                |                          daily                           |
|                DEBUG                 |                           true                           |
|            INSTALLER_TYPE            |                           fuel                           |
|       ENERGY_RECORDER_API_URL        |             http://energy.opnfv.fr/resources             |
|           DEPLOY_SCENARIO            |                     os-odl-ovs-noha                      |
|       ENERGY_RECORDER_API_USER       |                                                          |
|              NODE_NAME               |                    ericsson-virtual2                     |
+--------------------------------------+----------------------------------------------------------+

2019-09-21 05:43:19,699 - xtesting.ci.run_tests - INFO - Sourcing env file /var/lib/xtesting/conf/env_file


export OS_IDENTITY_API_VERSION=3
export OS_PROJECT_DOMAIN_NAME=Default
export OS_USER_DOMAIN_NAME=Default
export OS_PROJECT_NAME=admin
export OS_TENANT_NAME=admin
export OS_USERNAME=admin
export OS_PASSWORD=opnfv_secret
export OS_REGION_NAME=RegionOne
export OS_INTERFACE=internal
export OS_ENDPOINT_TYPE="internal"
export OS_CACERT="/etc/ssl/certs/ca-certificates.crt"
export SDN_CONTROLLER_USER=admin
export SDN_CONTROLLER_RESTCONFPORT=8282
export SDN_CONTROLLER_PASSWORD=admin
export SDN_CONTROLLER_WEBPORT=8282
export SDN_CONTROLLER_IP=10.16.0.107
export VOLUME_DEVICE_NAME=sdc
export OS_AUTH_URL=http://172.16.10.36:35357/v3

2019-09-21 05:43:19,700 - xtesting.ci.run_tests - INFO - TESTS TO BE EXECUTED:

+---------------+---------------+------------------------------------------+-------------------------------------------------+
|     TIERS     |     ORDER     |               DESCRIPTION                |                    TESTCASES                    |
+---------------+---------------+------------------------------------------+-------------------------------------------------+
|     smoke     |       1       |     Set of basic Functional tests to     |     neutron-tempest-plugin-api rally_sanity     |
|               |               |      validate the OPNFV scenarios.       |          refstack_defcore tempest_full          |
|               |               |                                          |      tempest_scenario patrole neutron_trunk     |
|               |               |                                          |         networking-bgpvpn networking-sfc        |
|               |               |                                          |                     barbican                    |
+---------------+---------------+------------------------------------------+-------------------------------------------------+

2019-09-21 05:43:19,736 - xtesting.ci.run_tests - INFO - Loading test case 'neutron-tempest-plugin-api'...
2019-09-21 05:43:23,415 - xtesting.ci.run_tests - INFO - Running test case 'neutron-tempest-plugin-api'...
2019-09-21 05:54:28,510 - xtesting.core.testcase - INFO - The results were successfully pushed to DB
2019-09-21 05:54:28,511 - xtesting.ci.run_tests - INFO - Test result:

+------------------------------------+------------------+------------------+----------------+
|             TEST CASE              |     PROJECT      |     DURATION     |     RESULT     |
+------------------------------------+------------------+------------------+----------------+
|     neutron-tempest-plugin-api     |     functest     |      11:04       |      FAIL      |
+------------------------------------+------------------+------------------+----------------+

2019-09-21 05:54:38,193 - xtesting.ci.run_tests - ERROR - The test case 'neutron-tempest-plugin-api' failed.
2019-09-21 05:54:38,227 - xtesting.ci.run_tests - INFO - Loading test case 'rally_sanity'...
2019-09-21 05:54:40,518 - xtesting.ci.run_tests - INFO - Running test case 'rally_sanity'...
2019-09-21 06:12:48,347 - xtesting.core.testcase - INFO - The results were successfully pushed to DB
2019-09-21 06:12:48,347 - xtesting.ci.run_tests - INFO - Test result:

+----------------------+------------------+------------------+----------------+
|      TEST CASE       |     PROJECT      |     DURATION     |     RESULT     |
+----------------------+------------------+------------------+----------------+
|     rally_sanity     |     functest     |      18:07       |      FAIL      |
+----------------------+------------------+------------------+----------------+

2019-09-21 06:12:57,843 - xtesting.ci.run_tests - ERROR - The test case 'rally_sanity' failed.
2019-09-21 06:12:57,876 - xtesting.ci.run_tests - INFO - Loading test case 'refstack_defcore'...
2019-09-21 06:13:01,169 - xtesting.ci.run_tests - INFO - Running test case 'refstack_defcore'...
2019-09-21 06:20:46,427 - xtesting.core.testcase - INFO - The results were successfully pushed to DB
2019-09-21 06:20:46,427 - xtesting.ci.run_tests - INFO - Test result:

+--------------------------+------------------+------------------+----------------+
|        TEST CASE         |     PROJECT      |     DURATION     |     RESULT     |
+--------------------------+------------------+------------------+----------------+
|     refstack_defcore     |     functest     |      07:45       |      PASS      |
+--------------------------+------------------+------------------+----------------+

2019-09-21 06:20:55,842 - xtesting.ci.run_tests - INFO - Loading test case 'tempest_full'...
2019-09-21 06:20:59,162 - xtesting.ci.run_tests - INFO - Running test case 'tempest_full'...
2019-09-21 07:05:13,850 - xtesting.core.testcase - INFO - The results were successfully pushed to DB
2019-09-21 07:05:13,851 - xtesting.ci.run_tests - INFO - Test result:

+----------------------+------------------+------------------+----------------+
|      TEST CASE       |     PROJECT      |     DURATION     |     RESULT     |
+----------------------+------------------+------------------+----------------+
|     tempest_full     |     functest     |      44:14       |      FAIL      |
+----------------------+------------------+------------------+----------------+

2019-09-21 07:05:23,739 - xtesting.ci.run_tests - ERROR - The test case 'tempest_full' failed.
2019-09-21 07:05:23,771 - xtesting.ci.run_tests - INFO - Loading test case 'tempest_scenario'...
2019-09-21 07:05:27,018 - xtesting.ci.run_tests - INFO - Running test case 'tempest_scenario'...
2019-09-21 07:14:55,624 - xtesting.core.testcase - INFO - The results were successfully pushed to DB
2019-09-21 07:14:55,624 - xtesting.ci.run_tests - INFO - Test result:

+--------------------------+------------------+------------------+----------------+
|        TEST CASE         |     PROJECT      |     DURATION     |     RESULT     |
+--------------------------+------------------+------------------+----------------+
|     tempest_scenario     |     functest     |      09:28       |      PASS      |
+--------------------------+------------------+------------------+----------------+

2019-09-21 07:15:05,192 - xtesting.ci.run_tests - INFO - Loading test case 'patrole'...
2019-09-21 07:15:08,526 - xtesting.ci.run_tests - INFO - Running test case 'patrole'...
2019-09-21 07:18:11,608 - xtesting.core.testcase - INFO - The results were successfully pushed to DB
2019-09-21 07:18:11,608 - xtesting.ci.run_tests - INFO - Test result:

+-------------------+------------------+------------------+----------------+
|     TEST CASE     |     PROJECT      |     DURATION     |     RESULT     |
+-------------------+------------------+------------------+----------------+
|      patrole      |     functest     |      03:03       |      PASS      |
+-------------------+------------------+------------------+----------------+

2019-09-21 07:18:20,967 - xtesting.ci.run_tests - INFO - Loading test case 'neutron_trunk'...
2019-09-21 07:18:24,221 - xtesting.ci.run_tests - INFO - Running test case 'neutron_trunk'...
2019-09-21 07:20:55,542 - xtesting.core.testcase - INFO - The results were successfully pushed to DB
2019-09-21 07:20:55,542 - xtesting.ci.run_tests - INFO - Test result:

+-----------------------+------------------+------------------+----------------+
|       TEST CASE       |     PROJECT      |     DURATION     |     RESULT     |
+-----------------------+------------------+------------------+----------------+
|     neutron_trunk     |     functest     |      02:31       |      PASS      |
+-----------------------+------------------+------------------+----------------+

2019-09-21 07:21:04,644 - xtesting.ci.run_tests - INFO - Loading test case 'networking-bgpvpn'...
2019-09-21 07:21:07,823 - functest.opnfv_tests.openstack.tempest.tempest - WARNING - Cannot find Neutron extension: bgpvpn
2019-09-21 07:21:08,325 - xtesting.ci.run_tests - INFO - Skipping test case 'networking-bgpvpn'...
2019-09-21 07:21:08,325 - xtesting.ci.run_tests - INFO - Test result:

+---------------------------+------------------+------------------+----------------+
|         TEST CASE         |     PROJECT      |     DURATION     |     RESULT     |
+---------------------------+------------------+------------------+----------------+
|     networking-bgpvpn     |     functest     |      00:00       |      SKIP      |
+---------------------------+------------------+------------------+----------------+

2019-09-21 07:21:08,360 - xtesting.ci.run_tests - INFO - Loading test case 'networking-sfc'...
2019-09-21 07:21:11,507 - functest.opnfv_tests.openstack.tempest.tempest - WARNING - Cannot find Neutron extension: sfc
2019-09-21 07:21:12,010 - xtesting.ci.run_tests - INFO - Skipping test case 'networking-sfc'...
2019-09-21 07:21:12,010 - xtesting.ci.run_tests - INFO - Test result:

+------------------------+------------------+------------------+----------------+
|       TEST CASE        |     PROJECT      |     DURATION     |     RESULT     |
+------------------------+------------------+------------------+----------------+
|     networking-sfc     |     functest     |      00:00       |      SKIP      |
+------------------------+------------------+------------------+----------------+

2019-09-21 07:21:12,047 - xtesting.ci.run_tests - INFO - Loading test case 'barbican'...
2019-09-21 07:21:15,242 - xtesting.ci.run_tests - INFO - Running test case 'barbican'...
2019-09-21 07:23:50,913 - xtesting.core.testcase - INFO - The results were successfully pushed to DB
2019-09-21 07:23:50,913 - xtesting.ci.run_tests - INFO - Test result:

+-------------------+------------------+------------------+----------------+
|     TEST CASE     |     PROJECT      |     DURATION     |     RESULT     |
+-------------------+------------------+------------------+----------------+
|      barbican     |     functest     |      02:35       |      PASS      |
+-------------------+------------------+------------------+----------------+

2019-09-21 07:23:59,774 - xtesting.ci.run_tests - INFO - Xtesting report:

+------------------------------------+------------------+---------------+------------------+----------------+
|             TEST CASE              |     PROJECT      |      TIER     |     DURATION     |     RESULT     |
+------------------------------------+------------------+---------------+------------------+----------------+
|     neutron-tempest-plugin-api     |     functest     |     smoke     |      11:04       |      FAIL      |
|            rally_sanity            |     functest     |     smoke     |      18:07       |      FAIL      |
|          refstack_defcore          |     functest     |     smoke     |      07:45       |      PASS      |
|            tempest_full            |     functest     |     smoke     |      44:14       |      FAIL      |
|          tempest_scenario          |     functest     |     smoke     |      09:28       |      PASS      |
|              patrole               |     functest     |     smoke     |      03:03       |      PASS      |
|           neutron_trunk            |     functest     |     smoke     |      02:31       |      PASS      |
|         networking-bgpvpn          |     functest     |     smoke     |      00:00       |      SKIP      |
|           networking-sfc           |     functest     |     smoke     |      00:00       |      SKIP      |
|              barbican              |     functest     |     smoke     |      02:35       |      PASS      |
+------------------------------------+------------------+---------------+------------------+----------------+

2019-09-21 07:23:59,781 - xtesting.ci.run_tests - INFO - Execution exit value: Result.EX_ERROR
Functest: Pulling Functest Docker image opnfv/functest-benchmarking:hunter ...
Running Functest tier 'benchmarking'. CMD: docker run --rm  -e INSTALLER_TYPE=fuel -e INSTALLER_IP=10.20.0.2     -e NODE_NAME=ericsson-virtual2 -e DEPLOY_SCENARIO=os-odl-ovs-noha     -e BUILD_TAG=jenkins-functest-fuel-virtual-daily-hunter-806 -e DEPLOY_TYPE=virt -e CI_LOOP=daily     -e TEST_DB_URL=http://testresults.opnfv.org/test/api/v1/results -e ENERGY_RECORDER_API_URL=http://energy.opnfv.fr/resources     -e DEBUG=true -e POD_ARCH=x86_64 -e BLOCK_MIGRATION=false -e SDN_CONTROLLER_RESTCONFPORT=8080 -e IMAGE_PROPERTIES=hw_disk_bus:scsi,hw_scsi_model:virtio-scsi,hw_mem_page_size:large -e FLAVOR_EXTRA_SPECS=hw:mem_page_size:large -v /home/jenkins/opnfv/functest/images:/home/opnfv/functest/images -v /home/jenkins/opnfv/functest/results/hunter:/home/opnfv/functest/results -v /var/lib/opnfv/mcp.rsa:/root/.ssh/id_rsa       -v /home/jenkins/opnfv-openrc.sh:/home/opnfv/functest/conf/env_file      -v /tmp/tmp.Vfg1KZE9rz:/usr/lib/python2.7/site-packages/functest/opnfv_tests/openstack/tempest/custom_tests/tempest_conf.yaml  opnfv/functest-benchmarking:hunter /bin/bash -c 'run_tests -r -t all'
2019-09-21 07:24:06,113 - xtesting.ci.run_tests - INFO - Deployment description:

+--------------------------------------+----------------------------------------------------------+
|               ENV VAR                |                          VALUE                           |
+--------------------------------------+----------------------------------------------------------+
|              BUILD_TAG               |      jenkins-functest-fuel-virtual-daily-hunter-806      |
|             TEST_DB_URL              |     http://testresults.opnfv.org/test/api/v1/results     |
|     ENERGY_RECORDER_API_PASSWORD     |                                                          |
|               CI_LOOP                |                          daily                           |
|                DEBUG                 |                           true                           |
|            INSTALLER_TYPE            |                           fuel                           |
|       ENERGY_RECORDER_API_URL        |             http://energy.opnfv.fr/resources             |
|           DEPLOY_SCENARIO            |                     os-odl-ovs-noha                      |
|       ENERGY_RECORDER_API_USER       |                                                          |
|              NODE_NAME               |                    ericsson-virtual2                     |
+--------------------------------------+----------------------------------------------------------+

2019-09-21 07:24:06,118 - xtesting.ci.run_tests - INFO - Sourcing env file /var/lib/xtesting/conf/env_file


export OS_IDENTITY_API_VERSION=3
export OS_PROJECT_DOMAIN_NAME=Default
export OS_USER_DOMAIN_NAME=Default
export OS_PROJECT_NAME=admin
export OS_TENANT_NAME=admin
export OS_USERNAME=admin
export OS_PASSWORD=opnfv_secret
export OS_REGION_NAME=RegionOne
export OS_INTERFACE=internal
export OS_ENDPOINT_TYPE="internal"
export OS_CACERT="/etc/ssl/certs/ca-certificates.crt"
export SDN_CONTROLLER_USER=admin
export SDN_CONTROLLER_RESTCONFPORT=8282
export SDN_CONTROLLER_PASSWORD=admin
export SDN_CONTROLLER_WEBPORT=8282
export SDN_CONTROLLER_IP=10.16.0.107
export VOLUME_DEVICE_NAME=sdc
export OS_AUTH_URL=http://172.16.10.36:35357/v3

2019-09-21 07:24:06,119 - xtesting.ci.run_tests - INFO - TESTS TO BE EXECUTED:

+----------------------+---------------+-------------------------------------------------+-------------------------------------------+
|        TIERS         |     ORDER     |                   DESCRIPTION                   |                 TESTCASES                 |
+----------------------+---------------+-------------------------------------------------+-------------------------------------------+
|     benchmarking     |       2       |     Run several OpenStack performance tools     |     rally_full rally_jobs vmtp shaker     |
|                      |               |     https://docs.openstack.org/performance-     |                                           |
|                      |               |       docs/latest/methodologies/tools.html      |                                           |
+----------------------+---------------+-------------------------------------------------+-------------------------------------------+

2019-09-21 07:24:06,131 - xtesting.ci.run_tests - INFO - Loading test case 'rally_full'...
2019-09-21 07:24:08,707 - xtesting.ci.run_tests - INFO - Running test case 'rally_full'...
2019-09-21 09:04:30,299 - xtesting.core.testcase - INFO - The results were successfully pushed to DB
2019-09-21 09:04:30,299 - xtesting.ci.run_tests - INFO - Test result:

+--------------------+------------------+------------------+----------------+
|     TEST CASE      |     PROJECT      |     DURATION     |     RESULT     |
+--------------------+------------------+------------------+----------------+
|     rally_full     |     functest     |      100:21      |      FAIL      |
+--------------------+------------------+------------------+----------------+

2019-09-21 09:04:40,605 - xtesting.ci.run_tests - ERROR - The test case 'rally_full' failed.
2019-09-21 09:04:40,617 - xtesting.ci.run_tests - INFO - Loading test case 'rally_jobs'...
2019-09-21 09:04:42,788 - xtesting.ci.run_tests - INFO - Running test case 'rally_jobs'...
2019-09-21 09:50:36,110 - xtesting.core.testcase - INFO - The results were successfully pushed to DB
2019-09-21 09:50:36,111 - xtesting.ci.run_tests - INFO - Test result:

+--------------------+------------------+------------------+----------------+
|     TEST CASE      |     PROJECT      |     DURATION     |     RESULT     |
+--------------------+------------------+------------------+----------------+
|     rally_jobs     |     functest     |      45:53       |      PASS      |
+--------------------+------------------+------------------+----------------+

2019-09-21 09:50:46,313 - xtesting.ci.run_tests - INFO - Loading test case 'vmtp'...
2019-09-21 09:50:48,849 - xtesting.ci.run_tests - INFO - Running test case 'vmtp'...
2019-09-21 10:25:58,791 - functest.opnfv_tests.openstack.vmtp.vmtp - ERROR - Exception when calling ['vmtp_genchart', '-c', '/home/opnfv/functest/results/vmtp/vmtp.html', '/home/opnfv/functest/results/vmtp/vmtp.json']
Error: No such file %s: /home/opnfv/functest/results/vmtp/vmtp.json

2019-09-21 10:25:59,066 - xtesting.core.testcase - INFO - The results were successfully pushed to DB
2019-09-21 10:25:59,067 - xtesting.ci.run_tests - INFO - Test result:

+-------------------+------------------+------------------+----------------+
|     TEST CASE     |     PROJECT      |     DURATION     |     RESULT     |
+-------------------+------------------+------------------+----------------+
|        vmtp       |     functest     |      35:10       |      FAIL      |
+-------------------+------------------+------------------+----------------+

2019-09-21 10:25:59,889 - functest.core.tenantnetwork - ERROR - cannot clean all resources
Traceback (most recent call last):
  File "/usr/lib/python2.7/site-packages/functest/core/tenantnetwork.py", line 284, in clean
    self.cloud.delete_router(self.router.id)
  File "/usr/lib/python2.7/site-packages/shade/openstackcloud.py", line 4156, in delete_router
    error_message="Error deleting router {0}".format(name_or_id))
  File "/usr/lib/python2.7/site-packages/keystoneauth1/adapter.py", line 343, in delete
    return self.request(url, 'DELETE', **kwargs)
  File "/usr/lib/python2.7/site-packages/openstack/_adapter.py", line 164, in request
    return _json_response(response, error_message=error_message)
  File "/usr/lib/python2.7/site-packages/openstack/_adapter.py", line 95, in _json_response
    exceptions.raise_from_response(response, error_message=error_message)
  File "/usr/lib/python2.7/site-packages/openstack/exceptions.py", line 229, in raise_from_response
    http_status=http_status, request_id=request_id
ConflictException: Error deleting router 1777c639-7ba2-4956-92d6-cdc58823206b: Client Error for url: http://172.16.10.36:9696/v2.0/routers/1777c639-7ba2-4956-92d6-cdc58823206b.json, Router 1777c639-7ba2-4956-92d6-cdc58823206b still has ports
2019-09-21 10:26:02,376 - xtesting.ci.run_tests - ERROR - The test case 'vmtp' failed.
2019-09-21 10:26:02,397 - xtesting.ci.run_tests - INFO - Loading test case 'shaker'...
2019-09-21 10:26:04,521 - xtesting.ci.run_tests - INFO - Running test case 'shaker'...
2019-09-21 11:27:30,070 - functest.opnfv_tests.openstack.shaker.shaker - ERROR - cannot get report files
Traceback (most recent call last):
  File "/usr/lib/python2.7/site-packages/functest/opnfv_tests/openstack/shaker/shaker.py", line 127, in execute
    scpc.get('report.json', self.res_dir)
  File "/usr/lib/python2.7/site-packages/scp.py", line 217, in get
    self._recv_all()
  File "/usr/lib/python2.7/site-packages/scp.py", line 367, in _recv_all
    raise SCPException(asunicode(msg[1:]))
SCPException: scp: report.json: No such file or directory
2019-09-21 11:27:30,405 - xtesting.core.testcase - INFO - The results were successfully pushed to DB
2019-09-21 11:27:30,406 - xtesting.ci.run_tests - INFO - Test result:

+-------------------+------------------+------------------+----------------+
|     TEST CASE     |     PROJECT      |     DURATION     |     RESULT     |
+-------------------+------------------+------------------+----------------+
|       shaker      |     functest     |      61:26       |      FAIL      |
+-------------------+------------------+------------------+----------------+

2019-09-21 11:27:47,550 - xtesting.ci.run_tests - ERROR - The test case 'shaker' failed.
2019-09-21 11:27:47,551 - xtesting.ci.run_tests - INFO - Xtesting report:

+--------------------+------------------+----------------------+------------------+----------------+
|     TEST CASE      |     PROJECT      |         TIER         |     DURATION     |     RESULT     |
+--------------------+------------------+----------------------+------------------+----------------+
|     rally_full     |     functest     |     benchmarking     |      100:21      |      FAIL      |
|     rally_jobs     |     functest     |     benchmarking     |      45:53       |      PASS      |
|        vmtp        |     functest     |     benchmarking     |      35:10       |      FAIL      |
|       shaker       |     functest     |     benchmarking     |      61:26       |      FAIL      |
+--------------------+------------------+----------------------+------------------+----------------+

2019-09-21 11:27:47,554 - xtesting.ci.run_tests - INFO - Execution exit value: Result.EX_ERROR
Functest: Pulling Functest Docker image opnfv/functest-vnf:hunter ...
Running Functest tier 'vnf'. CMD: docker run --rm  -e INSTALLER_TYPE=fuel -e INSTALLER_IP=10.20.0.2     -e NODE_NAME=ericsson-virtual2 -e DEPLOY_SCENARIO=os-odl-ovs-noha     -e BUILD_TAG=jenkins-functest-fuel-virtual-daily-hunter-806 -e DEPLOY_TYPE=virt -e CI_LOOP=daily     -e TEST_DB_URL=http://testresults.opnfv.org/test/api/v1/results -e ENERGY_RECORDER_API_URL=http://energy.opnfv.fr/resources     -e DEBUG=true -e POD_ARCH=x86_64 -e BLOCK_MIGRATION=false -e SDN_CONTROLLER_RESTCONFPORT=8080 -e IMAGE_PROPERTIES=hw_disk_bus:scsi,hw_scsi_model:virtio-scsi,hw_mem_page_size:large -e FLAVOR_EXTRA_SPECS=hw:mem_page_size:large -v /home/jenkins/opnfv/functest/images:/home/opnfv/functest/images -v /home/jenkins/opnfv/functest/results/hunter:/home/opnfv/functest/results -v /var/lib/opnfv/mcp.rsa:/root/.ssh/id_rsa       -v /home/jenkins/opnfv-openrc.sh:/home/opnfv/functest/conf/env_file      -v /tmp/tmp.Vfg1KZE9rz:/usr/lib/python2.7/site-packages/functest/opnfv_tests/openstack/tempest/custom_tests/tempest_conf.yaml  opnfv/functest-vnf:hunter /bin/bash -c 'run_tests -r -t all'
2019-09-21 11:27:51,751 - xtesting.ci.run_tests - INFO - Deployment description:

+--------------------------------------+----------------------------------------------------------+
|               ENV VAR                |                          VALUE                           |
+--------------------------------------+----------------------------------------------------------+
|              BUILD_TAG               |      jenkins-functest-fuel-virtual-daily-hunter-806      |
|             TEST_DB_URL              |     http://testresults.opnfv.org/test/api/v1/results     |
|     ENERGY_RECORDER_API_PASSWORD     |                                                          |
|               CI_LOOP                |                          daily                           |
|                DEBUG                 |                           true                           |
|            INSTALLER_TYPE            |                           fuel                           |
|       ENERGY_RECORDER_API_URL        |             http://energy.opnfv.fr/resources             |
|           DEPLOY_SCENARIO            |                     os-odl-ovs-noha                      |
|       ENERGY_RECORDER_API_USER       |                                                          |
|              NODE_NAME               |                    ericsson-virtual2                     |
+--------------------------------------+----------------------------------------------------------+

2019-09-21 11:27:51,755 - xtesting.ci.run_tests - INFO - Sourcing env file /var/lib/xtesting/conf/env_file


export OS_IDENTITY_API_VERSION=3
export OS_PROJECT_DOMAIN_NAME=Default
export OS_USER_DOMAIN_NAME=Default
export OS_PROJECT_NAME=admin
export OS_TENANT_NAME=admin
export OS_USERNAME=admin
export OS_PASSWORD=opnfv_secret
export OS_REGION_NAME=RegionOne
export OS_INTERFACE=internal
export OS_ENDPOINT_TYPE="internal"
export OS_CACERT="/etc/ssl/certs/ca-certificates.crt"
export SDN_CONTROLLER_USER=admin
export SDN_CONTROLLER_RESTCONFPORT=8282
export SDN_CONTROLLER_PASSWORD=admin
export SDN_CONTROLLER_WEBPORT=8282
export SDN_CONTROLLER_IP=10.16.0.107
export VOLUME_DEVICE_NAME=sdc
export OS_AUTH_URL=http://172.16.10.36:35357/v3

2019-09-21 11:27:51,756 - xtesting.ci.run_tests - INFO - TESTS TO BE EXECUTED:

+---------------+---------------+---------------------------------------+----------------------------------------+
|     TIERS     |     ORDER     |              DESCRIPTION              |               TESTCASES                |
+---------------+---------------+---------------------------------------+----------------------------------------+
|      vnf      |       4       |     Collection of VNF test cases.     |     cloudify cloudify_ims heat_ims     |
|               |               |                                       |         vyos_vrouter juju_epc          |
+---------------+---------------+---------------------------------------+----------------------------------------+

2019-09-21 11:27:51,767 - xtesting.ci.run_tests - INFO - Loading test case 'cloudify'...
2019-09-21 11:27:53,804 - xtesting.ci.run_tests - INFO - Running test case 'cloudify'...
2019-09-21 11:34:29,318 - functest.core.cloudify - INFO - Attemps running status of the Manager
2019-09-21 11:34:59,788 - functest.core.cloudify - INFO - The current manager status is running
2019-09-21 11:35:00,365 - functest.core.cloudify - INFO - Secrets API successfully reached
2019-09-21 11:35:00,365 - functest.core.cloudify - INFO - Cloudify Manager is up and running
2019-09-21 11:35:00,675 - xtesting.core.testcase - INFO - The results were successfully pushed to DB
2019-09-21 11:35:00,676 - xtesting.ci.run_tests - INFO - Test result:

+-------------------+------------------+------------------+----------------+
|     TEST CASE     |     PROJECT      |     DURATION     |     RESULT     |
+-------------------+------------------+------------------+----------------+
|      cloudify     |     functest     |      07:07       |      PASS      |
+-------------------+------------------+------------------+----------------+

2019-09-21 11:35:15,239 - xtesting.ci.run_tests - INFO - Loading test case 'cloudify_ims'...
2019-09-21 11:35:17,244 - xtesting.ci.run_tests - INFO - Running test case 'cloudify_ims'...
2019-09-21 11:41:13,410 - functest.core.cloudify - INFO - Attemps running status of the Manager
2019-09-21 11:41:43,895 - functest.core.cloudify - INFO - The current manager status is running
2019-09-21 11:41:44,474 - functest.core.cloudify - INFO - Secrets API successfully reached
2019-09-21 11:41:44,475 - functest.core.cloudify - INFO - Cloudify Manager is up and running
2019-09-21 11:41:46,032 - functest.core.cloudify - INFO - Put private keypair in manager
2019-09-21 11:45:22,085 - functest.core.singlevm - ERROR - Cannot run cloudify_ims
Traceback (most recent call last):
  File "/usr/lib/python2.7/site-packages/functest/core/singlevm.py", line 468, in run
    if not self.execute():
  File "/usr/lib/python2.7/site-packages/functest/opnfv_tests/vnf/ims/cloudify_ims.py", line 166, in execute
    if self.deploy_vnf() and self.test_vnf():
  File "/usr/lib/python2.7/site-packages/functest/opnfv_tests/vnf/ims/cloudify_ims.py", line 217, in deploy_vnf
    self.cfy_client, execution, self.__logger, timeout=3600)
  File "/usr/lib/python2.7/site-packages/functest/core/cloudify.py", line 182, in wait_for_execution
    sort='@timestamp').items
  File "/usr/lib/python2.7/site-packages/cloudify_rest_client/events.py", line 77, in list
    response = self.api.get(uri, _include=_include, params=params)
  File "/usr/lib/python2.7/site-packages/cloudify_rest_client/client.py", line 252, in get
    timeout=timeout)
  File "/usr/lib/python2.7/site-packages/cloudify_rest_client/client.py", line 233, in do_request
    'SSL, but the client does'.format(e)
ConnectionError: HTTPConnectionPool(host='10.16.0.118', port=80): Max retries exceeded with url: /api/v3.1/events?_offset=326&type=cloudify_event&type=cloudify_log&execution_id=76d822c9-26f1-44b1-8cc6-280ea3bc6404&_sort=%40timestamp&_size=50 (Caused by NewConnectionError('<urllib3.connection.HTTPConnection object at 0x7f3497f52e50>: Failed to establish a new connection: [Errno 110] Operation timed out',))
This can happen when the manager is not working with SSL, but the client does
2019-09-21 11:45:22,398 - xtesting.core.testcase - INFO - The results were successfully pushed to DB
2019-09-21 11:45:22,398 - xtesting.ci.run_tests - INFO - Test result:

+----------------------+------------------+------------------+----------------+
|      TEST CASE       |     PROJECT      |     DURATION     |     RESULT     |
+----------------------+------------------+------------------+----------------+
|     cloudify_ims     |     functest     |      10:05       |      FAIL      |
+----------------------+------------------+------------------+----------------+

2019-09-21 11:45:22,401 - functest.core.cloudify - INFO - Deleting the current deployment
2019-09-21 11:47:33,157 - functest.core.cloudify - ERROR - Some issue during the undeployment ..
Traceback (most recent call last):
  File "/usr/lib/python2.7/site-packages/functest/core/cloudify.py", line 143, in kill_existing_execution
    exec_list = self.cfy_client.executions.list()
  File "/usr/lib/python2.7/site-packages/cloudify_rest_client/executions.py", line 139, in list
    _include=_include)
  File "/usr/lib/python2.7/site-packages/cloudify_rest_client/client.py", line 252, in get
    timeout=timeout)
  File "/usr/lib/python2.7/site-packages/cloudify_rest_client/client.py", line 233, in do_request
    'SSL, but the client does'.format(e)
ConnectionError: HTTPConnectionPool(host='10.16.0.118', port=80): Max retries exceeded with url: /api/v3.1/executions?_include_system_workflows=False (Caused by NewConnectionError('<urllib3.connection.HTTPConnection object at 0x7f3497f490d0>: Failed to establish a new connection: [Errno 110] Operation timed out',))
This can happen when the manager is not working with SSL, but the client does
2019-09-21 11:47:44,212 - functest.core.tenantnetwork - ERROR - cannot clean all resources
Traceback (most recent call last):
  File "/usr/lib/python2.7/site-packages/functest/core/tenantnetwork.py", line 286, in clean
    self.cloud.delete_subnet(self.subnet.id)
  File "/usr/lib/python2.7/site-packages/shade/openstackcloud.py", line 7680, in delete_subnet
    "/subnets/{subnet_id}.json".format(subnet_id=subnet['id']))
  File "/usr/lib/python2.7/site-packages/keystoneauth1/adapter.py", line 343, in delete
    return self.request(url, 'DELETE', **kwargs)
  File "/usr/lib/python2.7/site-packages/openstack/_adapter.py", line 164, in request
    return _json_response(response, error_message=error_message)
  File "/usr/lib/python2.7/site-packages/openstack/_adapter.py", line 95, in _json_response
    exceptions.raise_from_response(response, error_message=error_message)
  File "/usr/lib/python2.7/site-packages/openstack/exceptions.py", line 229, in raise_from_response
    http_status=http_status, request_id=request_id
ConflictException: ConflictException: 409: Client Error for url: http://172.16.10.36:9696/v2.0/subnets/a7ff8594-b0f0-483f-a51a-916176f4a8af.json, Unable to complete operation on subnet a7ff8594-b0f0-483f-a51a-916176f4a8af: One or more ports have an IP allocation from this subnet.
2019-09-21 11:47:46,481 - functest.core.tenantnetwork - ERROR - Cannot clean all resources
Traceback (most recent call last):
  File "/usr/lib/python2.7/site-packages/functest/core/tenantnetwork.py", line 131, in clean
    self.orig_cloud.delete_security_group(sec_id)
  File "/usr/lib/python2.7/site-packages/shade/openstackcloud.py", line 7987, in delete_security_group
    name_or_id)
  File "/usr/lib/python2.7/site-packages/keystoneauth1/adapter.py", line 343, in delete
    return self.request(url, 'DELETE', **kwargs)
  File "/usr/lib/python2.7/site-packages/openstack/_adapter.py", line 164, in request
    return _json_response(response, error_message=error_message)
  File "/usr/lib/python2.7/site-packages/openstack/_adapter.py", line 95, in _json_response
    exceptions.raise_from_response(response, error_message=error_message)
  File "/usr/lib/python2.7/site-packages/openstack/exceptions.py", line 229, in raise_from_response
    http_status=http_status, request_id=request_id
ConflictException: Error deleting security group 9fd5889d-6299-48e6-99b1-2599fc8b6ef4: Client Error for url: http://172.16.10.36:9696/v2.0/security-groups/9fd5889d-6299-48e6-99b1-2599fc8b6ef4.json, Security Group 9fd5889d-6299-48e6-99b1-2599fc8b6ef4 in use.
2019-09-21 11:47:46,482 - xtesting.ci.run_tests - ERROR - The test case 'cloudify_ims' failed.
2019-09-21 11:47:46,493 - xtesting.ci.run_tests - INFO - Loading test case 'heat_ims'...
2019-09-21 11:47:48,312 - xtesting.ci.run_tests - INFO - Running test case 'heat_ims'...
2019-09-21 12:10:09,701 - functest.opnfv_tests.vnf.ims.heat_ims - ERROR - Cannot run heat_ims
Traceback (most recent call last):
  File "/usr/lib/python2.7/site-packages/functest/opnfv_tests/vnf/ims/heat_ims.py", line 143, in run
    if not self.execute():
  File "/usr/lib/python2.7/site-packages/functest/opnfv_tests/vnf/ims/heat_ims.py", line 120, in execute
    if self.deploy_vnf() and self.test_vnf():
  File "/usr/lib/python2.7/site-packages/functest/opnfv_tests/vnf/ims/heat_ims.py", line 188, in deploy_vnf
    self._monit()
  File "/usr/lib/python2.7/site-packages/functest/opnfv_tests/vnf/ims/heat_ims.py", line 163, in _monit
    key_filename=self.key_filename, timeout=timeout)
  File "/usr/lib/python2.7/site-packages/paramiko/client.py", line 357, in connect
    raise NoValidConnectionsError(errors)
NoValidConnectionsError: [Errno None] Unable to connect to port 22 on 10.16.0.145
2019-09-21 12:10:10,026 - xtesting.core.testcase - INFO - The results were successfully pushed to DB
2019-09-21 12:10:10,027 - xtesting.ci.run_tests - INFO - Test result:

+-------------------+------------------+------------------+----------------+
|     TEST CASE     |     PROJECT      |     DURATION     |     RESULT     |
+-------------------+------------------+------------------+----------------+
|      heat_ims     |     functest     |      22:21       |      FAIL      |
+-------------------+------------------+------------------+----------------+

2019-09-21 12:10:36,695 - xtesting.ci.run_tests - ERROR - The test case 'heat_ims' failed.
2019-09-21 12:10:36,707 - xtesting.ci.run_tests - INFO - Loading test case 'vyos_vrouter'...
2019-09-21 12:10:38,767 - xtesting.ci.run_tests - INFO - Running test case 'vyos_vrouter'...
2019-09-21 12:15:58,459 - functest.core.cloudify - INFO - Attemps running status of the Manager
2019-09-21 12:16:28,847 - functest.core.cloudify - INFO - The current manager status is running
2019-09-21 12:16:29,140 - functest.core.cloudify - INFO - Secrets API successfully reached
2019-09-21 12:16:29,140 - functest.core.cloudify - INFO - Cloudify Manager is up and running
2019-09-21 12:16:29,141 - functest.core.cloudify - INFO - Put private keypair in manager
2019-09-21 12:18:58,431 - xtesting.core.testcase - INFO - The results were successfully pushed to DB
2019-09-21 12:18:58,432 - xtesting.ci.run_tests - INFO - Test result:

+----------------------+------------------+------------------+----------------+
|      TEST CASE       |     PROJECT      |     DURATION     |     RESULT     |
+----------------------+------------------+------------------+----------------+
|     vyos_vrouter     |     functest     |      08:19       |      FAIL      |
+----------------------+------------------+------------------+----------------+

2019-09-21 12:18:58,435 - functest.core.cloudify - INFO - Deleting the current deployment
2019-09-21 12:20:27,664 - xtesting.ci.run_tests - ERROR - The test case 'vyos_vrouter' failed.
2019-09-21 12:20:27,676 - xtesting.ci.run_tests - INFO - Loading test case 'juju_epc'...
2019-09-21 12:20:29,806 - xtesting.ci.run_tests - INFO - Running test case 'juju_epc'...
2019-09-21 12:33:14,506 - functest.opnfv_tests.vnf.epc.juju_epc - ERROR - Exception with Juju VNF Deployment: ['timeout', '-t', '4800', 'juju-wait']
ERROR:root:ERROR dial tcp 252.6.0.1:17070: i/o timeout

ERROR:root:juju status --format=json failed: 1

2019-09-21 12:33:14,816 - xtesting.core.testcase - INFO - The results were successfully pushed to DB
2019-09-21 12:33:14,816 - xtesting.ci.run_tests - INFO - Test result:

+-------------------+------------------+------------------+----------------+
|     TEST CASE     |     PROJECT      |     DURATION     |     RESULT     |
+-------------------+------------------+------------------+----------------+
|      juju_epc     |     functest     |      12:45       |      FAIL      |
+-------------------+------------------+------------------+----------------+

2019-09-21 12:43:14,929 - functest.opnfv_tests.vnf.epc.juju_epc - ERROR - Exception with Juju Cleanup: ['juju', 'debug-log', '--replay', '--no-tail']
ERROR dial tcp 252.6.0.1:17070: context deadline exceeded

2019-09-21 12:43:22,672 - functest.core.tenantnetwork - ERROR - cannot clean all resources
Traceback (most recent call last):
  File "/usr/lib/python2.7/site-packages/functest/core/tenantnetwork.py", line 286, in clean
    self.cloud.delete_subnet(self.subnet.id)
  File "/usr/lib/python2.7/site-packages/shade/openstackcloud.py", line 7680, in delete_subnet
    "/subnets/{subnet_id}.json".format(subnet_id=subnet['id']))
  File "/usr/lib/python2.7/site-packages/keystoneauth1/adapter.py", line 343, in delete
    return self.request(url, 'DELETE', **kwargs)
  File "/usr/lib/python2.7/site-packages/openstack/_adapter.py", line 164, in request
    return _json_response(response, error_message=error_message)
  File "/usr/lib/python2.7/site-packages/openstack/_adapter.py", line 95, in _json_response
    exceptions.raise_from_response(response, error_message=error_message)
  File "/usr/lib/python2.7/site-packages/openstack/exceptions.py", line 229, in raise_from_response
    http_status=http_status, request_id=request_id
ConflictException: ConflictException: 409: Client Error for url: http://172.16.10.36:9696/v2.0/subnets/feca84af-936c-447c-bf8e-46fe5e725157.json, Unable to complete operation on subnet feca84af-936c-447c-bf8e-46fe5e725157: One or more ports have an IP allocation from this subnet.
2019-09-21 12:43:28,954 - functest.core.tenantnetwork - ERROR - Cannot clean all resources
Traceback (most recent call last):
  File "/usr/lib/python2.7/site-packages/functest/core/tenantnetwork.py", line 131, in clean
    self.orig_cloud.delete_security_group(sec_id)
  File "/usr/lib/python2.7/site-packages/shade/openstackcloud.py", line 7987, in delete_security_group
    name_or_id)
  File "/usr/lib/python2.7/site-packages/keystoneauth1/adapter.py", line 343, in delete
    return self.request(url, 'DELETE', **kwargs)
  File "/usr/lib/python2.7/site-packages/openstack/_adapter.py", line 164, in request
    return _json_response(response, error_message=error_message)
  File "/usr/lib/python2.7/site-packages/openstack/_adapter.py", line 95, in _json_response
    exceptions.raise_from_response(response, error_message=error_message)
  File "/usr/lib/python2.7/site-packages/openstack/exceptions.py", line 229, in raise_from_response
    http_status=http_status, request_id=request_id
ConflictException: Error deleting security group de5e2a94-dbf5-45a9-97c7-35de7a27756d: Client Error for url: http://172.16.10.36:9696/v2.0/security-groups/de5e2a94-dbf5-45a9-97c7-35de7a27756d.json, Security Group de5e2a94-dbf5-45a9-97c7-35de7a27756d in use.
2019-09-21 12:43:28,955 - xtesting.ci.run_tests - ERROR - The test case 'juju_epc' failed.
2019-09-21 12:43:28,955 - xtesting.ci.run_tests - INFO - Xtesting report:

+----------------------+------------------+--------------+------------------+----------------+
|      TEST CASE       |     PROJECT      |     TIER     |     DURATION     |     RESULT     |
+----------------------+------------------+--------------+------------------+----------------+
|       cloudify       |     functest     |     vnf      |      07:07       |      PASS      |
|     cloudify_ims     |     functest     |     vnf      |      10:05       |      FAIL      |
|       heat_ims       |     functest     |     vnf      |      22:21       |      FAIL      |
|     vyos_vrouter     |     functest     |     vnf      |      08:19       |      FAIL      |
|       juju_epc       |     functest     |     vnf      |      12:45       |      FAIL      |
+----------------------+------------------+--------------+------------------+----------------+

2019-09-21 12:43:28,959 - xtesting.ci.run_tests - INFO - Execution exit value: Result.EX_ERROR
Regular expression run condition: Expression=[k8-.*], Label=[os-odl-ovs-noha]
Run condition [Regular expression match] preventing perform for step [Execute shell]
[functest-fuel-virtual-daily-hunter] $ /bin/bash /tmp/jenkins5342109060193793287.sh
Uploading logs to artifact logs/functest/ericsson-virtual2/hunter/2019-09-21_12-43-30
Logs can be found in https://artifacts.opnfv.org/logs_functest_ericsson-virtual2.html
https://artifacts.opnfv.org/logs/functest/ericsson-virtual2/hunter/2019-09-21_12-43-30/rally_jobs
https://artifacts.opnfv.org/logs/functest/ericsson-virtual2/hunter/2019-09-21_12-43-30/rally_jobs/rally_jobs.xml
https://artifacts.opnfv.org/logs/functest/ericsson-virtual2/hunter/2019-09-21_12-43-30/rally_jobs/neutron.json
https://artifacts.opnfv.org/logs/functest/ericsson-virtual2/hunter/2019-09-21_12-43-30/rally_jobs/rally.log
https://artifacts.opnfv.org/logs/functest/ericsson-virtual2/hunter/2019-09-21_12-43-30/rally_jobs/rally_jobs.html
https://artifacts.opnfv.org/logs/functest/ericsson-virtual2/hunter/2019-09-21_12-43-30/tempest_smoke
https://artifacts.opnfv.org/logs/functest/ericsson-virtual2/hunter/2019-09-21_12-43-30/tempest_smoke/test_list.txt
https://artifacts.opnfv.org/logs/functest/ericsson-virtual2/hunter/2019-09-21_12-43-30/tempest_smoke/tempest.debug.log
https://artifacts.opnfv.org/logs/functest/ericsson-virtual2/hunter/2019-09-21_12-43-30/tempest_smoke/test_raw_list.txt
https://artifacts.opnfv.org/logs/functest/ericsson-virtual2/hunter/2019-09-21_12-43-30/tempest_smoke/tempest.conf
https://artifacts.opnfv.org/logs/functest/ericsson-virtual2/hunter/2019-09-21_12-43-30/tempest_smoke/tempest-report.html
https://artifacts.opnfv.org/logs/functest/ericsson-virtual2/hunter/2019-09-21_12-43-30/tempest_smoke/tempest.log
https://artifacts.opnfv.org/logs/functest/ericsson-virtual2/hunter/2019-09-21_12-43-30/tempest_smoke/rally.log
https://artifacts.opnfv.org/logs/functest/ericsson-virtual2/hunter/2019-09-21_12-43-30/tempest_smoke/rally.conf
https://artifacts.opnfv.org/logs/functest/ericsson-virtual2/hunter/2019-09-21_12-43-30/tempest_smoke/tempest-report.xml
https://artifacts.opnfv.org/logs/functest/ericsson-virtual2/hunter/2019-09-21_12-43-30/refstack_defcore
https://artifacts.opnfv.org/logs/functest/ericsson-virtual2/hunter/2019-09-21_12-43-30/refstack_defcore/test_list.txt
https://artifacts.opnfv.org/logs/functest/ericsson-virtual2/hunter/2019-09-21_12-43-30/refstack_defcore/tempest.debug.log
https://artifacts.opnfv.org/logs/functest/ericsson-virtual2/hunter/2019-09-21_12-43-30/refstack_defcore/test_raw_list.txt
https://artifacts.opnfv.org/logs/functest/ericsson-virtual2/hunter/2019-09-21_12-43-30/refstack_defcore/tempest.conf
https://artifacts.opnfv.org/logs/functest/ericsson-virtual2/hunter/2019-09-21_12-43-30/refstack_defcore/tempest-report.html
https://artifacts.opnfv.org/logs/functest/ericsson-virtual2/hunter/2019-09-21_12-43-30/refstack_defcore/tempest.log
https://artifacts.opnfv.org/logs/functest/ericsson-virtual2/hunter/2019-09-21_12-43-30/refstack_defcore/rally.log
https://artifacts.opnfv.org/logs/functest/ericsson-virtual2/hunter/2019-09-21_12-43-30/refstack_defcore/rally.conf
https://artifacts.opnfv.org/logs/functest/ericsson-virtual2/hunter/2019-09-21_12-43-30/refstack_defcore/tempest-report.xml
https://artifacts.opnfv.org/logs/functest/ericsson-virtual2/hunter/2019-09-21_12-43-30/rally_full
https://artifacts.opnfv.org/logs/functest/ericsson-virtual2/hunter/2019-09-21_12-43-30/rally_full/gnocchi.json
https://artifacts.opnfv.org/logs/functest/ericsson-virtual2/hunter/2019-09-21_12-43-30/rally_full/keystone.json
https://artifacts.opnfv.org/logs/functest/ericsson-virtual2/hunter/2019-09-21_12-43-30/rally_full/glance.json
https://artifacts.opnfv.org/logs/functest/ericsson-virtual2/hunter/2019-09-21_12-43-30/rally_full/rally_full.xml
https://artifacts.opnfv.org/logs/functest/ericsson-virtual2/hunter/2019-09-21_12-43-30/rally_full/quotas.json
https://artifacts.opnfv.org/logs/functest/ericsson-virtual2/hunter/2019-09-21_12-43-30/rally_full/neutron.json
https://artifacts.opnfv.org/logs/functest/ericsson-virtual2/hunter/2019-09-21_12-43-30/rally_full/heat.json
https://artifacts.opnfv.org/logs/functest/ericsson-virtual2/hunter/2019-09-21_12-43-30/rally_full/nova.json
https://artifacts.opnfv.org/logs/functest/ericsson-virtual2/hunter/2019-09-21_12-43-30/rally_full/authenticate.json
https://artifacts.opnfv.org/logs/functest/ericsson-virtual2/hunter/2019-09-21_12-43-30/rally_full/cinder.json
https://artifacts.opnfv.org/logs/functest/ericsson-virtual2/hunter/2019-09-21_12-43-30/rally_full/rally.log
https://artifacts.opnfv.org/logs/functest/ericsson-virtual2/hunter/2019-09-21_12-43-30/rally_full/rally_full.html
https://artifacts.opnfv.org/logs/functest/ericsson-virtual2/hunter/2019-09-21_12-43-30/functest.log
https://artifacts.opnfv.org/logs/functest/ericsson-virtual2/hunter/2019-09-21_12-43-30/vmtp
https://artifacts.opnfv.org/logs/functest/ericsson-virtual2/hunter/2019-09-21_12-43-30/vmtp/vmtp.conf
https://artifacts.opnfv.org/logs/functest/ericsson-virtual2/hunter/2019-09-21_12-43-30/juju_epc
https://artifacts.opnfv.org/logs/functest/ericsson-virtual2/hunter/2019-09-21_12-43-30/juju_epc/clouds.yaml
https://artifacts.opnfv.org/logs/functest/ericsson-virtual2/hunter/2019-09-21_12-43-30/juju_epc/credentials.yaml
https://artifacts.opnfv.org/logs/functest/ericsson-virtual2/hunter/2019-09-21_12-43-30/functest.debug.log
https://artifacts.opnfv.org/logs/functest/ericsson-virtual2/hunter/2019-09-21_12-43-30/patrole
https://artifacts.opnfv.org/logs/functest/ericsson-virtual2/hunter/2019-09-21_12-43-30/patrole/test_list.txt
https://artifacts.opnfv.org/logs/functest/ericsson-virtual2/hunter/2019-09-21_12-43-30/patrole/tempest.debug.log
https://artifacts.opnfv.org/logs/functest/ericsson-virtual2/hunter/2019-09-21_12-43-30/patrole/test_raw_list.txt
https://artifacts.opnfv.org/logs/functest/ericsson-virtual2/hunter/2019-09-21_12-43-30/patrole/tempest.conf
https://artifacts.opnfv.org/logs/functest/ericsson-virtual2/hunter/2019-09-21_12-43-30/patrole/tempest-report.html
https://artifacts.opnfv.org/logs/functest/ericsson-virtual2/hunter/2019-09-21_12-43-30/patrole/tempest.log
https://artifacts.opnfv.org/logs/functest/ericsson-virtual2/hunter/2019-09-21_12-43-30/patrole/rally.log
https://artifacts.opnfv.org/logs/functest/ericsson-virtual2/hunter/2019-09-21_12-43-30/patrole/rally.conf
https://artifacts.opnfv.org/logs/functest/ericsson-virtual2/hunter/2019-09-21_12-43-30/patrole/tempest-report.xml
https://artifacts.opnfv.org/logs/functest/ericsson-virtual2/hunter/2019-09-21_12-43-30/barbican
https://artifacts.opnfv.org/logs/functest/ericsson-virtual2/hunter/2019-09-21_12-43-30/barbican/test_list.txt
https://artifacts.opnfv.org/logs/functest/ericsson-virtual2/hunter/2019-09-21_12-43-30/barbican/tempest.debug.log
https://artifacts.opnfv.org/logs/functest/ericsson-virtual2/hunter/2019-09-21_12-43-30/barbican/test_raw_list.txt
https://artifacts.opnfv.org/logs/functest/ericsson-virtual2/hunter/2019-09-21_12-43-30/barbican/tempest.conf
https://artifacts.opnfv.org/logs/functest/ericsson-virtual2/hunter/2019-09-21_12-43-30/barbican/tempest-report.html
https://artifacts.opnfv.org/logs/functest/ericsson-virtual2/hunter/2019-09-21_12-43-30/barbican/tempest.log
https://artifacts.opnfv.org/logs/functest/ericsson-virtual2/hunter/2019-09-21_12-43-30/barbican/rally.log
https://artifacts.opnfv.org/logs/functest/ericsson-virtual2/hunter/2019-09-21_12-43-30/barbican/rally.conf
https://artifacts.opnfv.org/logs/functest/ericsson-virtual2/hunter/2019-09-21_12-43-30/barbican/tempest-report.xml
https://artifacts.opnfv.org/logs/functest/ericsson-virtual2/hunter/2019-09-21_12-43-30/tempest_scenario
https://artifacts.opnfv.org/logs/functest/ericsson-virtual2/hunter/2019-09-21_12-43-30/tempest_scenario/test_list.txt
https://artifacts.opnfv.org/logs/functest/ericsson-virtual2/hunter/2019-09-21_12-43-30/tempest_scenario/tempest.debug.log
https://artifacts.opnfv.org/logs/functest/ericsson-virtual2/hunter/2019-09-21_12-43-30/tempest_scenario/test_raw_list.txt
https://artifacts.opnfv.org/logs/functest/ericsson-virtual2/hunter/2019-09-21_12-43-30/tempest_scenario/tempest.conf
https://artifacts.opnfv.org/logs/functest/ericsson-virtual2/hunter/2019-09-21_12-43-30/tempest_scenario/tempest-report.html
https://artifacts.opnfv.org/logs/functest/ericsson-virtual2/hunter/2019-09-21_12-43-30/tempest_scenario/tempest.log
https://artifacts.opnfv.org/logs/functest/ericsson-virtual2/hunter/2019-09-21_12-43-30/tempest_scenario/rally.log
https://artifacts.opnfv.org/logs/functest/ericsson-virtual2/hunter/2019-09-21_12-43-30/tempest_scenario/rally.conf
https://artifacts.opnfv.org/logs/functest/ericsson-virtual2/hunter/2019-09-21_12-43-30/tempest_scenario/tempest-report.xml
https://artifacts.opnfv.org/logs/functest/ericsson-virtual2/hunter/2019-09-21_12-43-30/tempest_full
https://artifacts.opnfv.org/logs/functest/ericsson-virtual2/hunter/2019-09-21_12-43-30/tempest_full/test_list.txt
https://artifacts.opnfv.org/logs/functest/ericsson-virtual2/hunter/2019-09-21_12-43-30/tempest_full/tempest.debug.log
https://artifacts.opnfv.org/logs/functest/ericsson-virtual2/hunter/2019-09-21_12-43-30/tempest_full/test_raw_list.txt
https://artifacts.opnfv.org/logs/functest/ericsson-virtual2/hunter/2019-09-21_12-43-30/tempest_full/tempest.conf
https://artifacts.opnfv.org/logs/functest/ericsson-virtual2/hunter/2019-09-21_12-43-30/tempest_full/tempest-report.html
https://artifacts.opnfv.org/logs/functest/ericsson-virtual2/hunter/2019-09-21_12-43-30/tempest_full/tempest.log
https://artifacts.opnfv.org/logs/functest/ericsson-virtual2/hunter/2019-09-21_12-43-30/tempest_full/rally.log
https://artifacts.opnfv.org/logs/functest/ericsson-virtual2/hunter/2019-09-21_12-43-30/tempest_full/rally.conf
https://artifacts.opnfv.org/logs/functest/ericsson-virtual2/hunter/2019-09-21_12-43-30/tempest_full/tempest-report.xml
https://artifacts.opnfv.org/logs/functest/ericsson-virtual2/hunter/2019-09-21_12-43-30/shaker
https://artifacts.opnfv.org/logs/functest/ericsson-virtual2/hunter/2019-09-21_12-43-30/neutron-tempest-plugin-api
https://artifacts.opnfv.org/logs/functest/ericsson-virtual2/hunter/2019-09-21_12-43-30/neutron-tempest-plugin-api/test_list.txt
https://artifacts.opnfv.org/logs/functest/ericsson-virtual2/hunter/2019-09-21_12-43-30/neutron-tempest-plugin-api/tempest.debug.log
https://artifacts.opnfv.org/logs/functest/ericsson-virtual2/hunter/2019-09-21_12-43-30/neutron-tempest-plugin-api/test_raw_list.txt
https://artifacts.opnfv.org/logs/functest/ericsson-virtual2/hunter/2019-09-21_12-43-30/neutron-tempest-plugin-api/tempest.conf
https://artifacts.opnfv.org/logs/functest/ericsson-virtual2/hunter/2019-09-21_12-43-30/neutron-tempest-plugin-api/tempest-report.html
https://artifacts.opnfv.org/logs/functest/ericsson-virtual2/hunter/2019-09-21_12-43-30/neutron-tempest-plugin-api/tempest.log
https://artifacts.opnfv.org/logs/functest/ericsson-virtual2/hunter/2019-09-21_12-43-30/neutron-tempest-plugin-api/rally.log
https://artifacts.opnfv.org/logs/functest/ericsson-virtual2/hunter/2019-09-21_12-43-30/neutron-tempest-plugin-api/rally.conf
https://artifacts.opnfv.org/logs/functest/ericsson-virtual2/hunter/2019-09-21_12-43-30/neutron-tempest-plugin-api/tempest-report.xml
https://artifacts.opnfv.org/logs/functest/ericsson-virtual2/hunter/2019-09-21_12-43-30/neutron_trunk
https://artifacts.opnfv.org/logs/functest/ericsson-virtual2/hunter/2019-09-21_12-43-30/neutron_trunk/test_list.txt
https://artifacts.opnfv.org/logs/functest/ericsson-virtual2/hunter/2019-09-21_12-43-30/neutron_trunk/tempest.debug.log
https://artifacts.opnfv.org/logs/functest/ericsson-virtual2/hunter/2019-09-21_12-43-30/neutron_trunk/test_raw_list.txt
https://artifacts.opnfv.org/logs/functest/ericsson-virtual2/hunter/2019-09-21_12-43-30/neutron_trunk/tempest.conf
https://artifacts.opnfv.org/logs/functest/ericsson-virtual2/hunter/2019-09-21_12-43-30/neutron_trunk/tempest-report.html
https://artifacts.opnfv.org/logs/functest/ericsson-virtual2/hunter/2019-09-21_12-43-30/neutron_trunk/tempest.log
https://artifacts.opnfv.org/logs/functest/ericsson-virtual2/hunter/2019-09-21_12-43-30/neutron_trunk/rally.log
https://artifacts.opnfv.org/logs/functest/ericsson-virtual2/hunter/2019-09-21_12-43-30/neutron_trunk/rally.conf
https://artifacts.opnfv.org/logs/functest/ericsson-virtual2/hunter/2019-09-21_12-43-30/neutron_trunk/tempest-report.xml
https://artifacts.opnfv.org/logs/functest/ericsson-virtual2/hunter/2019-09-21_12-43-30/return_value
https://artifacts.opnfv.org/logs/functest/ericsson-virtual2/hunter/2019-09-21_12-43-30/odl
https://artifacts.opnfv.org/logs/functest/ericsson-virtual2/hunter/2019-09-21_12-43-30/odl/output.xml
https://artifacts.opnfv.org/logs/functest/ericsson-virtual2/hunter/2019-09-21_12-43-30/odl/report.html
https://artifacts.opnfv.org/logs/functest/ericsson-virtual2/hunter/2019-09-21_12-43-30/odl/xunit.xml
https://artifacts.opnfv.org/logs/functest/ericsson-virtual2/hunter/2019-09-21_12-43-30/odl/log.html
https://artifacts.opnfv.org/logs/functest/ericsson-virtual2/hunter/2019-09-21_12-43-30/rally_sanity
https://artifacts.opnfv.org/logs/functest/ericsson-virtual2/hunter/2019-09-21_12-43-30/rally_sanity/gnocchi.json
https://artifacts.opnfv.org/logs/functest/ericsson-virtual2/hunter/2019-09-21_12-43-30/rally_sanity/keystone.json
https://artifacts.opnfv.org/logs/functest/ericsson-virtual2/hunter/2019-09-21_12-43-30/rally_sanity/glance.json
https://artifacts.opnfv.org/logs/functest/ericsson-virtual2/hunter/2019-09-21_12-43-30/rally_sanity/rally_sanity.xml
https://artifacts.opnfv.org/logs/functest/ericsson-virtual2/hunter/2019-09-21_12-43-30/rally_sanity/rally_sanity.html
https://artifacts.opnfv.org/logs/functest/ericsson-virtual2/hunter/2019-09-21_12-43-30/rally_sanity/quotas.json
https://artifacts.opnfv.org/logs/functest/ericsson-virtual2/hunter/2019-09-21_12-43-30/rally_sanity/neutron.json
https://artifacts.opnfv.org/logs/functest/ericsson-virtual2/hunter/2019-09-21_12-43-30/rally_sanity/heat.json
https://artifacts.opnfv.org/logs/functest/ericsson-virtual2/hunter/2019-09-21_12-43-30/rally_sanity/nova.json
https://artifacts.opnfv.org/logs/functest/ericsson-virtual2/hunter/2019-09-21_12-43-30/rally_sanity/authenticate.json
https://artifacts.opnfv.org/logs/functest/ericsson-virtual2/hunter/2019-09-21_12-43-30/rally_sanity/cinder.json
https://artifacts.opnfv.org/logs/functest/ericsson-virtual2/hunter/2019-09-21_12-43-30/rally_sanity/rally.log
[functest-fuel-virtual-daily-hunter] $ /bin/bash /tmp/jenkins7175550508568038067.sh
Build step 'Execute shell' marked build as failure
New run name is '806 Suite: daily Scenario: os-odl-ovs-noha'
Email was triggered for: Failure - Any
Sending email for trigger: Failure - Any
Request made to compress build log
Sending email to: tbramwell@linuxfoundation.org agardner@linuxfoundation.org rgrigar@linuxfoundation.org
Finished: FAILURE