FailedConsole Output

Started by upstream project "fuel-os-odl-bgpvpn-noha-virtual-daily-hunter" build number 53
originally caused by:
 Started by timer
Running as SYSTEM
[EnvInject] - Loading node environment variables.
Building remotely on ericsson-virtual4 (fuel-virtual ci-resource opnfv-sysinfo) in workspace /home/jenkins/opnfv/slave_root/workspace/functest-fuel-virtual-daily-hunter
using credential d42411ac011ad6f3dd2e1fa34eaa5d87f910eb2e
Wiping out workspace first.
Cloning the remote Git repository
Cloning repository https://gerrit.opnfv.org/gerrit/functest
 > git init /home/jenkins/opnfv/slave_root/workspace/functest-fuel-virtual-daily-hunter # timeout=10
Fetching upstream changes from https://gerrit.opnfv.org/gerrit/functest
 > git --version # timeout=10
using GIT_SSH to set credentials Jenkins Master SSH
 > git fetch --tags --progress https://gerrit.opnfv.org/gerrit/functest +refs/heads/*:refs/remotes/origin/* # timeout=15
 > git config remote.origin.url https://gerrit.opnfv.org/gerrit/functest # timeout=10
 > git config --add remote.origin.fetch +refs/heads/*:refs/remotes/origin/* # timeout=10
 > git config remote.origin.url https://gerrit.opnfv.org/gerrit/functest # timeout=10
Fetching upstream changes from https://gerrit.opnfv.org/gerrit/functest
using GIT_SSH to set credentials Jenkins Master SSH
 > git fetch --tags --progress https://gerrit.opnfv.org/gerrit/functest +refs/heads/*:refs/remotes/origin/* # timeout=15
 > git rev-parse refs/remotes/origin/stable/hunter^{commit} # timeout=10
 > git rev-parse refs/remotes/origin/origin/stable/hunter^{commit} # timeout=10
Checking out Revision 06f3e7837cd0a3374c701e4f3c54718a8bed8818 (refs/remotes/origin/stable/hunter)
 > git config core.sparsecheckout # timeout=10
 > git checkout -f 06f3e7837cd0a3374c701e4f3c54718a8bed8818 # timeout=15
Commit message: "Harden OS_ env vars for VMTP"
 > git rev-list --no-walk 06f3e7837cd0a3374c701e4f3c54718a8bed8818 # timeout=10
Run condition [Regular expression match] enabling prebuild for step [Execute shell]
Run condition [Regular expression match] enabling prebuild for step [Execute shell]
No emails were triggered.
New run name is '787 Suite: daily Scenario: os-odl-bgpvpn-noha'
[description-setter] Description set: Built on ericsson-virtual4
[functest-fuel-virtual-daily-hunter] $ /bin/bash /tmp/jenkins1791640880758379473.sh
Cleaning up docker containers/images...
Regular expression run condition: Expression=[os-.*], Label=[os-odl-bgpvpn-noha]
Run condition [Regular expression match] enabling perform for step [Execute shell]
[functest-fuel-virtual-daily-hunter] $ /usr/bin/env bash /tmp/jenkins1647957074148956969.sh
Map mcp ssh_key
<13>Sep 17 09:43:44 fetch_os_creds.info: Fetching rc file...
<13>Sep 17 09:43:44 fetch_os_creds.info: Verifying connectivity to 10.20.0.2...
<13>Sep 17 09:43:44 fetch_os_creds.info: 10.20.0.2 is reachable!
<13>Sep 17 09:43:45 fetch_os_creds.info: ... from controller 172.16.10.36 ...
Warning: Permanently added '172.16.10.36' (ECDSA) to the list of known hosts.
-------- Credentials: --------

export OS_IDENTITY_API_VERSION=3
export OS_PROJECT_DOMAIN_NAME=Default
export OS_USER_DOMAIN_NAME=Default
export OS_PROJECT_NAME=admin
export OS_TENANT_NAME=admin
export OS_USERNAME=admin
export OS_PASSWORD=opnfv_secret
export OS_REGION_NAME=RegionOne
export OS_INTERFACE=internal
export OS_ENDPOINT_TYPE="internal"
export OS_CACERT="/etc/ssl/certs/ca-certificates.crt"
export SDN_CONTROLLER_USER=admin
export SDN_CONTROLLER_RESTCONFPORT=8282
export SDN_CONTROLLER_PASSWORD=admin
export SDN_CONTROLLER_WEBPORT=8282
export SDN_CONTROLLER_IP=10.16.0.107
export VOLUME_DEVICE_NAME=sdc
export OS_AUTH_URL=http://172.16.10.36:35357/v3
Functest: Start Docker and prepare environment
Functest: Download images that will be used by test cases
+ wget_opts='-N --tries=1 --connect-timeout=30'
+ '[' -t 1 ']'
+ wget_opts='-N --tries=1 --connect-timeout=30 --progress=dot:giga'
+ cat
+ wget -N --tries=1 --connect-timeout=30 --progress=dot:giga -i - -P /home/jenkins/opnfv/functest/images
--2019-09-17 09:43:45--  http://download.cirros-cloud.net/0.4.0/cirros-0.4.0-x86_64-disk.img
Resolving download.cirros-cloud.net (download.cirros-cloud.net)... 64.90.42.85, 2607:f298:6:a036::bd6:a72a
Connecting to download.cirros-cloud.net (download.cirros-cloud.net)|64.90.42.85|:80... connected.
HTTP request sent, awaiting response... 304 Not Modified
File ‘/home/jenkins/opnfv/functest/images/cirros-0.4.0-x86_64-disk.img’ not modified on server. Omitting download.

--2019-09-17 09:43:46--  https://cloud-images.ubuntu.com/releases/14.04/release/ubuntu-14.04-server-cloudimg-amd64-disk1.img
Resolving cloud-images.ubuntu.com (cloud-images.ubuntu.com)... 91.189.88.89, 2001:67c:1560:8001::8001
Connecting to cloud-images.ubuntu.com (cloud-images.ubuntu.com)|91.189.88.89|:443... connected.
HTTP request sent, awaiting response... 302 Found
Location: https://cloud-images.ubuntu.com/releases/trusty/release/ubuntu-14.04-server-cloudimg-amd64-disk1.img [following]
--2019-09-17 09:43:46--  https://cloud-images.ubuntu.com/releases/trusty/release/ubuntu-14.04-server-cloudimg-amd64-disk1.img
Reusing existing connection to cloud-images.ubuntu.com:443.
HTTP request sent, awaiting response... 304 Not Modified
File ‘/home/jenkins/opnfv/functest/images/ubuntu-14.04-server-cloudimg-amd64-disk1.img’ not modified on server. Omitting download.

--2019-09-17 09:43:46--  https://cloud-images.ubuntu.com/releases/16.04/release/ubuntu-16.04-server-cloudimg-amd64-disk1.img
Reusing existing connection to cloud-images.ubuntu.com:443.
HTTP request sent, awaiting response... 302 Found
Location: https://cloud-images.ubuntu.com/releases/xenial/release/ubuntu-16.04-server-cloudimg-amd64-disk1.img [following]
--2019-09-17 09:43:46--  https://cloud-images.ubuntu.com/releases/xenial/release/ubuntu-16.04-server-cloudimg-amd64-disk1.img
Reusing existing connection to cloud-images.ubuntu.com:443.
HTTP request sent, awaiting response... 304 Not Modified
File ‘/home/jenkins/opnfv/functest/images/ubuntu-16.04-server-cloudimg-amd64-disk1.img’ not modified on server. Omitting download.

--2019-09-17 09:43:46--  http://download.cirros-cloud.net/0.4.0/cirros-0.4.0-aarch64-disk.img
Connecting to download.cirros-cloud.net (download.cirros-cloud.net)|64.90.42.85|:80... connected.
HTTP request sent, awaiting response... 304 Not Modified
File ‘/home/jenkins/opnfv/functest/images/cirros-0.4.0-aarch64-disk.img’ not modified on server. Omitting download.

--2019-09-17 09:43:47--  https://cloud-images.ubuntu.com/releases/14.04/release/ubuntu-14.04-server-cloudimg-arm64-uefi1.img
Connecting to cloud-images.ubuntu.com (cloud-images.ubuntu.com)|91.189.88.89|:443... connected.
HTTP request sent, awaiting response... 302 Found
Location: https://cloud-images.ubuntu.com/releases/trusty/release/ubuntu-14.04-server-cloudimg-arm64-uefi1.img [following]
--2019-09-17 09:43:47--  https://cloud-images.ubuntu.com/releases/trusty/release/ubuntu-14.04-server-cloudimg-arm64-uefi1.img
Reusing existing connection to cloud-images.ubuntu.com:443.
HTTP request sent, awaiting response... 304 Not Modified
File ‘/home/jenkins/opnfv/functest/images/ubuntu-14.04-server-cloudimg-arm64-uefi1.img’ not modified on server. Omitting download.

--2019-09-17 09:43:47--  http://repository.cloudifysource.org/cloudify/19.01.24/community-release/cloudify-docker-manager-community-19.01.24.tar
Resolving repository.cloudifysource.org (repository.cloudifysource.org)... 52.84.214.55, 52.84.214.47, 52.84.214.159, ...
Connecting to repository.cloudifysource.org (repository.cloudifysource.org)|52.84.214.55|:80... connected.
HTTP request sent, awaiting response... 304 Not Modified
File ‘/home/jenkins/opnfv/functest/images/cloudify-docker-manager-community-19.01.24.tar’ not modified on server. Omitting download.

--2019-09-17 09:43:47--  http://testresults.opnfv.org/functest/vyos-1.1.8-amd64.qcow2
Resolving testresults.opnfv.org (testresults.opnfv.org)... 104.154.71.112
Connecting to testresults.opnfv.org (testresults.opnfv.org)|104.154.71.112|:80... connected.
HTTP request sent, awaiting response... 304 Not Modified
File ‘/home/jenkins/opnfv/functest/images/vyos-1.1.8-amd64.qcow2’ not modified on server. Omitting download.

--2019-09-17 09:43:47--  http://testresults.opnfv.org/functest/shaker-image.qcow2
Reusing existing connection to testresults.opnfv.org:80.
HTTP request sent, awaiting response... 304 Not Modified
File ‘/home/jenkins/opnfv/functest/images/shaker-image.qcow2’ not modified on server. Omitting download.

--2019-09-17 09:43:48--  http://testresults.opnfv.org/functest/shaker-image-arm64.qcow2
Reusing existing connection to testresults.opnfv.org:80.
HTTP request sent, awaiting response... 304 Not Modified
File ‘/home/jenkins/opnfv/functest/images/shaker-image-arm64.qcow2’ not modified on server. Omitting download.

Warning: Permanently added '10.20.0.2' (ECDSA) to the list of known hosts.
tempest_conf.yaml:
---
compute-feature-enabled:
    shelve: false
    vnc_console: false
    spice_console: true
identity-feature-enabled:
    api_v2: false
    api_v2_admin: false
image-feature-enabled:
    api_v2: true
    api_v1: false
volume:
    storage_protocol: iSCSI
volume-feature-enabled:
    backup: false
compute:
    max_microversion: 2.65
Functest: Pulling Functest Docker image opnfv/functest-healthcheck:hunter ...
Running Functest tier 'healthcheck'. CMD: docker run --rm  -e INSTALLER_TYPE=fuel -e INSTALLER_IP=10.20.0.2     -e NODE_NAME=ericsson-virtual4 -e DEPLOY_SCENARIO=os-odl-bgpvpn-noha     -e BUILD_TAG=jenkins-functest-fuel-virtual-daily-hunter-787 -e DEPLOY_TYPE=virt -e CI_LOOP=daily     -e TEST_DB_URL=http://testresults.opnfv.org/test/api/v1/results -e ENERGY_RECORDER_API_URL=http://energy.opnfv.fr/resources     -e DEBUG=true -e POD_ARCH=x86_64 -e BLOCK_MIGRATION=false -e SDN_CONTROLLER_RESTCONFPORT=8080 -e IMAGE_PROPERTIES=hw_disk_bus:scsi,hw_scsi_model:virtio-scsi -e FLAVOR_EXTRA_SPECS= -v /home/jenkins/opnfv/functest/images:/home/opnfv/functest/images -v /home/jenkins/opnfv/functest/results/hunter:/home/opnfv/functest/results -v /var/lib/opnfv/mcp.rsa:/root/.ssh/id_rsa       -v /home/jenkins/opnfv-openrc.sh:/home/opnfv/functest/conf/env_file      -v /tmp/tmp.8k9D6803ys:/usr/lib/python2.7/site-packages/functest/opnfv_tests/openstack/tempest/custom_tests/tempest_conf.yaml  opnfv/functest-healthcheck:hunter /bin/bash -c 'run_tests -r -t all'
2019-09-17 07:43:52,438 - xtesting.ci.run_tests - INFO - Deployment description:

+--------------------------------------+----------------------------------------------------------+
|               ENV VAR                |                          VALUE                           |
+--------------------------------------+----------------------------------------------------------+
|              BUILD_TAG               |      jenkins-functest-fuel-virtual-daily-hunter-787      |
|             TEST_DB_URL              |     http://testresults.opnfv.org/test/api/v1/results     |
|     ENERGY_RECORDER_API_PASSWORD     |                                                          |
|               CI_LOOP                |                          daily                           |
|                DEBUG                 |                           true                           |
|            INSTALLER_TYPE            |                           fuel                           |
|       ENERGY_RECORDER_API_URL        |             http://energy.opnfv.fr/resources             |
|           DEPLOY_SCENARIO            |                    os-odl-bgpvpn-noha                    |
|       ENERGY_RECORDER_API_USER       |                                                          |
|              NODE_NAME               |                    ericsson-virtual4                     |
+--------------------------------------+----------------------------------------------------------+

2019-09-17 07:43:52,446 - xtesting.ci.run_tests - INFO - Sourcing env file /var/lib/xtesting/conf/env_file


export OS_IDENTITY_API_VERSION=3
export OS_PROJECT_DOMAIN_NAME=Default
export OS_USER_DOMAIN_NAME=Default
export OS_PROJECT_NAME=admin
export OS_TENANT_NAME=admin
export OS_USERNAME=admin
export OS_PASSWORD=opnfv_secret
export OS_REGION_NAME=RegionOne
export OS_INTERFACE=internal
export OS_ENDPOINT_TYPE="internal"
export OS_CACERT="/etc/ssl/certs/ca-certificates.crt"
export SDN_CONTROLLER_USER=admin
export SDN_CONTROLLER_RESTCONFPORT=8282
export SDN_CONTROLLER_PASSWORD=admin
export SDN_CONTROLLER_WEBPORT=8282
export SDN_CONTROLLER_IP=10.16.0.107
export VOLUME_DEVICE_NAME=sdc
export OS_AUTH_URL=http://172.16.10.36:35357/v3

2019-09-17 07:43:52,448 - xtesting.ci.run_tests - INFO - TESTS TO BE EXECUTED:

+---------------------+---------------+-------------------------------------------------+------------------------------------------+
|        TIERS        |     ORDER     |                   DESCRIPTION                   |                TESTCASES                 |
+---------------------+---------------+-------------------------------------------------+------------------------------------------+
|     healthcheck     |       0       |     First tier to be executed to verify the     |     connection_check tenantnetwork1      |
|                     |               |           basic operations in the VIM.          |     tenantnetwork2 vmready1 vmready2     |
|                     |               |                                                 |      singlevm1 singlevm2 vping_ssh       |
|                     |               |                                                 |      vping_userdata cinder_test odl      |
|                     |               |                                                 |              tempest_smoke               |
+---------------------+---------------+-------------------------------------------------+------------------------------------------+

2019-09-17 07:43:52,500 - xtesting.ci.run_tests - INFO - Loading test case 'connection_check'...
2019-09-17 07:43:53,059 - xtesting.ci.run_tests - INFO - Running test case 'connection_check'...
2019-09-17 07:43:57,623 - xtesting.core.testcase - INFO - The results were successfully pushed to DB
2019-09-17 07:43:57,624 - xtesting.ci.run_tests - INFO - Test result:

+--------------------------+------------------+------------------+----------------+
|        TEST CASE         |     PROJECT      |     DURATION     |     RESULT     |
+--------------------------+------------------+------------------+----------------+
|     connection_check     |     functest     |      00:04       |      PASS      |
+--------------------------+------------------+------------------+----------------+

2019-09-17 07:43:57,670 - xtesting.ci.run_tests - INFO - Loading test case 'tenantnetwork1'...
2019-09-17 07:43:58,670 - xtesting.ci.run_tests - INFO - Running test case 'tenantnetwork1'...
2019-09-17 07:44:03,976 - xtesting.core.testcase - INFO - The results were successfully pushed to DB
2019-09-17 07:44:03,976 - xtesting.ci.run_tests - INFO - Test result:

+------------------------+------------------+------------------+----------------+
|       TEST CASE        |     PROJECT      |     DURATION     |     RESULT     |
+------------------------+------------------+------------------+----------------+
|     tenantnetwork1     |     functest     |      00:05       |      PASS      |
+------------------------+------------------+------------------+----------------+

2019-09-17 07:44:12,591 - xtesting.ci.run_tests - INFO - Loading test case 'tenantnetwork2'...
2019-09-17 07:44:14,767 - xtesting.ci.run_tests - INFO - Running test case 'tenantnetwork2'...
2019-09-17 07:44:21,318 - xtesting.core.testcase - INFO - The results were successfully pushed to DB
2019-09-17 07:44:21,319 - xtesting.ci.run_tests - INFO - Test result:

+------------------------+------------------+------------------+----------------+
|       TEST CASE        |     PROJECT      |     DURATION     |     RESULT     |
+------------------------+------------------+------------------+----------------+
|     tenantnetwork2     |     functest     |      00:06       |      PASS      |
+------------------------+------------------+------------------+----------------+

2019-09-17 07:44:30,737 - xtesting.ci.run_tests - INFO - Loading test case 'vmready1'...
2019-09-17 07:44:31,779 - xtesting.ci.run_tests - INFO - Running test case 'vmready1'...
2019-09-17 07:44:38,793 - xtesting.core.testcase - INFO - The results were successfully pushed to DB
2019-09-17 07:44:38,793 - xtesting.ci.run_tests - INFO - Test result:

+-------------------+------------------+------------------+----------------+
|     TEST CASE     |     PROJECT      |     DURATION     |     RESULT     |
+-------------------+------------------+------------------+----------------+
|      vmready1     |     functest     |      00:07       |      PASS      |
+-------------------+------------------+------------------+----------------+

2019-09-17 07:44:48,578 - xtesting.ci.run_tests - INFO - Loading test case 'vmready2'...
2019-09-17 07:44:50,516 - xtesting.ci.run_tests - INFO - Running test case 'vmready2'...
2019-09-17 07:44:58,998 - xtesting.core.testcase - INFO - The results were successfully pushed to DB
2019-09-17 07:44:58,998 - xtesting.ci.run_tests - INFO - Test result:

+-------------------+------------------+------------------+----------------+
|     TEST CASE     |     PROJECT      |     DURATION     |     RESULT     |
+-------------------+------------------+------------------+----------------+
|      vmready2     |     functest     |      00:08       |      PASS      |
+-------------------+------------------+------------------+----------------+

2019-09-17 07:45:09,564 - xtesting.ci.run_tests - INFO - Loading test case 'singlevm1'...
2019-09-17 07:45:10,755 - xtesting.ci.run_tests - INFO - Running test case 'singlevm1'...
2019-09-17 07:45:46,805 - xtesting.core.testcase - INFO - The results were successfully pushed to DB
2019-09-17 07:45:46,806 - xtesting.ci.run_tests - INFO - Test result:

+-------------------+------------------+------------------+----------------+
|     TEST CASE     |     PROJECT      |     DURATION     |     RESULT     |
+-------------------+------------------+------------------+----------------+
|     singlevm1     |     functest     |      00:36       |      PASS      |
+-------------------+------------------+------------------+----------------+

2019-09-17 07:46:00,104 - xtesting.ci.run_tests - INFO - Loading test case 'singlevm2'...
2019-09-17 07:46:01,988 - xtesting.ci.run_tests - INFO - Running test case 'singlevm2'...
2019-09-17 07:46:37,696 - xtesting.core.testcase - INFO - The results were successfully pushed to DB
2019-09-17 07:46:37,696 - xtesting.ci.run_tests - INFO - Test result:

+-------------------+------------------+------------------+----------------+
|     TEST CASE     |     PROJECT      |     DURATION     |     RESULT     |
+-------------------+------------------+------------------+----------------+
|     singlevm2     |     functest     |      00:35       |      PASS      |
+-------------------+------------------+------------------+----------------+

2019-09-17 07:46:52,735 - xtesting.ci.run_tests - INFO - Loading test case 'vping_ssh'...
2019-09-17 07:46:54,777 - xtesting.ci.run_tests - INFO - Running test case 'vping_ssh'...
2019-09-17 07:47:39,298 - xtesting.core.testcase - INFO - The results were successfully pushed to DB
2019-09-17 07:47:39,299 - xtesting.ci.run_tests - INFO - Test result:

+-------------------+------------------+------------------+----------------+
|     TEST CASE     |     PROJECT      |     DURATION     |     RESULT     |
+-------------------+------------------+------------------+----------------+
|     vping_ssh     |     functest     |      00:44       |      PASS      |
+-------------------+------------------+------------------+----------------+

2019-09-17 07:47:57,416 - xtesting.ci.run_tests - INFO - Loading test case 'vping_userdata'...
2019-09-17 07:47:59,712 - xtesting.ci.run_tests - INFO - Running test case 'vping_userdata'...
2019-09-17 07:48:35,401 - xtesting.core.testcase - INFO - The results were successfully pushed to DB
2019-09-17 07:48:35,402 - xtesting.ci.run_tests - INFO - Test result:

+------------------------+------------------+------------------+----------------+
|       TEST CASE        |     PROJECT      |     DURATION     |     RESULT     |
+------------------------+------------------+------------------+----------------+
|     vping_userdata     |     functest     |      00:35       |      PASS      |
+------------------------+------------------+------------------+----------------+

2019-09-17 07:48:51,666 - xtesting.ci.run_tests - INFO - Loading test case 'cinder_test'...
2019-09-17 07:48:53,778 - xtesting.ci.run_tests - INFO - Running test case 'cinder_test'...
2019-09-17 07:50:36,949 - xtesting.core.testcase - INFO - The results were successfully pushed to DB
2019-09-17 07:50:36,950 - xtesting.ci.run_tests - INFO - Test result:

+---------------------+------------------+------------------+----------------+
|      TEST CASE      |     PROJECT      |     DURATION     |     RESULT     |
+---------------------+------------------+------------------+----------------+
|     cinder_test     |     functest     |      01:43       |      PASS      |
+---------------------+------------------+------------------+----------------+

2019-09-17 07:51:00,850 - xtesting.ci.run_tests - INFO - Loading test case 'odl'...
2019-09-17 07:51:01,085 - xtesting.ci.run_tests - INFO - Running test case 'odl'...
[ WARN ] Deprecation Warning: Use Post Request in the future
2019-09-17 07:51:20,845 - xtesting.core.robotframework - INFO - 
==============================================================================
Basic & Neutron                                                               
==============================================================================
Basic & Neutron.Basic                                                         
==============================================================================
Basic & Neutron.Basic.Restconf Modules :: Test suite to verify Restconf is OK.
==============================================================================
Get Controller Modules :: Get the restconf modules, check 200 stat... | PASS |
------------------------------------------------------------------------------
Basic & Neutron.Basic.Restconf Modules :: Test suite to verify Res... | PASS |
1 critical test, 1 passed, 0 failed
1 test total, 1 passed, 0 failed
==============================================================================
Basic & Neutron.Basic                                                 | PASS |
1 critical test, 1 passed, 0 failed
1 test total, 1 passed, 0 failed
==============================================================================
Basic & Neutron.Neutron :: Test suite for Neutron Plugin                      
==============================================================================
Basic & Neutron.Neutron.Reachability                                          
==============================================================================
Get the complete list of networks :: Get the complete list of netw... | PASS |
------------------------------------------------------------------------------
Get the complete list of subnets :: Get the complete list of subnets  | PASS |
------------------------------------------------------------------------------
Get the complete list of ports :: Get the complete list of ports      | PASS |
------------------------------------------------------------------------------
Basic & Neutron.Neutron.Reachability                                  | PASS |
3 critical tests, 3 passed, 0 failed
3 tests total, 3 passed, 0 failed
==============================================================================
Basic & Neutron.Neutron.Networks :: Checking Network created in OpenStack a...
==============================================================================
Check OpenStack Networks :: Checking OpenStack Neutron for known n... | PASS |
------------------------------------------------------------------------------
Check OpenDaylight Networks :: Checking OpenDaylight Neutron API f... | PASS |
------------------------------------------------------------------------------
Create Network :: Create new network in OpenStack                     | PASS |
------------------------------------------------------------------------------
Check Network :: Check network created in OpenDaylight                | PASS |
------------------------------------------------------------------------------
Basic & Neutron.Neutron.Networks :: Checking Network created in Op... | PASS |
4 critical tests, 4 passed, 0 failed
4 tests total, 4 passed, 0 failed
==============================================================================
Basic & Neutron.Neutron.Subnets :: Checking Subnets created in OpenStack ar...
==============================================================================
Check OpenStack Subnets :: Checking OpenStack Neutron for known su... | PASS |
------------------------------------------------------------------------------
Check OpenDaylight subnets :: Checking OpenDaylight Neutron API fo... | PASS |
------------------------------------------------------------------------------
Create New subnet :: Create new subnet in OpenStack                   | PASS |
------------------------------------------------------------------------------
Check New subnet :: Check new subnet created in OpenDaylight          | PASS |
------------------------------------------------------------------------------
Basic & Neutron.Neutron.Subnets :: Checking Subnets created in Ope... | PASS |
4 critical tests, 4 passed, 0 failed
4 tests total, 4 passed, 0 failed
==============================================================================
Basic & Neutron.Neutron.Ports :: Checking Port created in OpenStack are pus...
==============================================================================
Check OpenStack ports :: Checking OpenStack Neutron for known ports   | PASS |
------------------------------------------------------------------------------
Check OpenDaylight ports :: Checking OpenDaylight Neutron API for ... | PASS |
------------------------------------------------------------------------------
Create New Port :: Create new port in OpenStack                       | PASS |
------------------------------------------------------------------------------
Check New Port :: Check new port created in OpenDaylight              | PASS |
------------------------------------------------------------------------------
Basic & Neutron.Neutron.Ports :: Checking Port created in OpenStac... | PASS |
4 critical tests, 4 passed, 0 failed
4 tests total, 4 passed, 0 failed
==============================================================================
Basic & Neutron.Neutron.Delete Ports :: Checking Port deleted in OpenStack ...
==============================================================================
Delete New Port :: Delete previously created port in OpenStack        | PASS |
------------------------------------------------------------------------------
Check Port Deleted :: Check port deleted in OpenDaylight              | PASS |
------------------------------------------------------------------------------
Basic & Neutron.Neutron.Delete Ports :: Checking Port deleted in O... | PASS |
2 critical tests, 2 passed, 0 failed
2 tests total, 2 passed, 0 failed
==============================================================================
Basic & Neutron.Neutron.Delete Subnets :: Checking Subnets deleted in OpenS...
==============================================================================
Delete New subnet :: Delete previously created subnet in OpenStack    | PASS |
------------------------------------------------------------------------------
Check New subnet deleted :: Check subnet deleted in OpenDaylight      | PASS |
------------------------------------------------------------------------------
Basic & Neutron.Neutron.Delete Subnets :: Checking Subnets deleted... | PASS |
2 critical tests, 2 passed, 0 failed
2 tests total, 2 passed, 0 failed
==============================================================================
Basic & Neutron.Neutron.Delete Networks :: Checking Network deleted in Open...
==============================================================================
Delete Network :: Delete network in OpenStack                         | PASS |
------------------------------------------------------------------------------
Check Network deleted :: Check network deleted in OpenDaylight        | PASS |
------------------------------------------------------------------------------
Basic & Neutron.Neutron.Delete Networks :: Checking Network delete... | PASS |
2 critical tests, 2 passed, 0 failed
2 tests total, 2 passed, 0 failed
==============================================================================
Basic & Neutron.Neutron :: Test suite for Neutron Plugin              | PASS |
21 critical tests, 21 passed, 0 failed
21 tests total, 21 passed, 0 failed
==============================================================================
Basic & Neutron                                                       | PASS |
22 critical tests, 22 passed, 0 failed
22 tests total, 22 passed, 0 failed
==============================================================================
Output:  /home/opnfv/functest/results/odl/output.xml

2019-09-17 07:51:20,869 - xtesting.core.robotframework - INFO - Results were successfully parsed
2019-09-17 07:51:21,000 - xtesting.core.robotframework - INFO - Results were successfully generated
2019-09-17 07:51:21,269 - xtesting.core.testcase - INFO - The results were successfully pushed to DB
2019-09-17 07:51:21,270 - xtesting.ci.run_tests - INFO - Test result:

+-------------------+------------------+------------------+----------------+
|     TEST CASE     |     PROJECT      |     DURATION     |     RESULT     |
+-------------------+------------------+------------------+----------------+
|        odl        |     functest     |      00:19       |      PASS      |
+-------------------+------------------+------------------+----------------+

2019-09-17 07:51:21,348 - xtesting.ci.run_tests - INFO - Loading test case 'tempest_smoke'...
2019-09-17 07:51:25,263 - xtesting.ci.run_tests - INFO - Running test case 'tempest_smoke'...
2019-09-17 07:56:04,812 - xtesting.core.testcase - INFO - The results were successfully pushed to DB
2019-09-17 07:56:04,813 - xtesting.ci.run_tests - INFO - Test result:

+-----------------------+------------------+------------------+----------------+
|       TEST CASE       |     PROJECT      |     DURATION     |     RESULT     |
+-----------------------+------------------+------------------+----------------+
|     tempest_smoke     |     functest     |      04:39       |      PASS      |
+-----------------------+------------------+------------------+----------------+

2019-09-17 07:56:15,437 - xtesting.ci.run_tests - INFO - Xtesting report:

+--------------------------+------------------+---------------------+------------------+----------------+
|        TEST CASE         |     PROJECT      |         TIER        |     DURATION     |     RESULT     |
+--------------------------+------------------+---------------------+------------------+----------------+
|     connection_check     |     functest     |     healthcheck     |      00:04       |      PASS      |
|      tenantnetwork1      |     functest     |     healthcheck     |      00:05       |      PASS      |
|      tenantnetwork2      |     functest     |     healthcheck     |      00:06       |      PASS      |
|         vmready1         |     functest     |     healthcheck     |      00:07       |      PASS      |
|         vmready2         |     functest     |     healthcheck     |      00:08       |      PASS      |
|        singlevm1         |     functest     |     healthcheck     |      00:36       |      PASS      |
|        singlevm2         |     functest     |     healthcheck     |      00:35       |      PASS      |
|        vping_ssh         |     functest     |     healthcheck     |      00:44       |      PASS      |
|      vping_userdata      |     functest     |     healthcheck     |      00:35       |      PASS      |
|       cinder_test        |     functest     |     healthcheck     |      01:43       |      PASS      |
|           odl            |     functest     |     healthcheck     |      00:19       |      PASS      |
|      tempest_smoke       |     functest     |     healthcheck     |      04:39       |      PASS      |
+--------------------------+------------------+---------------------+------------------+----------------+

2019-09-17 07:56:15,446 - xtesting.ci.run_tests - INFO - Execution exit value: Result.EX_OK
Functest: Pulling Functest Docker image opnfv/functest-smoke:hunter ...
Running Functest tier 'smoke'. CMD: docker run --rm  -e INSTALLER_TYPE=fuel -e INSTALLER_IP=10.20.0.2     -e NODE_NAME=ericsson-virtual4 -e DEPLOY_SCENARIO=os-odl-bgpvpn-noha     -e BUILD_TAG=jenkins-functest-fuel-virtual-daily-hunter-787 -e DEPLOY_TYPE=virt -e CI_LOOP=daily     -e TEST_DB_URL=http://testresults.opnfv.org/test/api/v1/results -e ENERGY_RECORDER_API_URL=http://energy.opnfv.fr/resources     -e DEBUG=true -e POD_ARCH=x86_64 -e BLOCK_MIGRATION=false -e SDN_CONTROLLER_RESTCONFPORT=8080 -e IMAGE_PROPERTIES=hw_disk_bus:scsi,hw_scsi_model:virtio-scsi -e FLAVOR_EXTRA_SPECS= -v /home/jenkins/opnfv/functest/images:/home/opnfv/functest/images -v /home/jenkins/opnfv/functest/results/hunter:/home/opnfv/functest/results -v /var/lib/opnfv/mcp.rsa:/root/.ssh/id_rsa       -v /home/jenkins/opnfv-openrc.sh:/home/opnfv/functest/conf/env_file      -v /tmp/tmp.8k9D6803ys:/usr/lib/python2.7/site-packages/functest/opnfv_tests/openstack/tempest/custom_tests/tempest_conf.yaml  opnfv/functest-smoke:hunter /bin/bash -c 'run_tests -r -t all'
2019-09-17 07:56:19,949 - xtesting.ci.run_tests - INFO - Deployment description:

+--------------------------------------+----------------------------------------------------------+
|               ENV VAR                |                          VALUE                           |
+--------------------------------------+----------------------------------------------------------+
|              BUILD_TAG               |      jenkins-functest-fuel-virtual-daily-hunter-787      |
|             TEST_DB_URL              |     http://testresults.opnfv.org/test/api/v1/results     |
|     ENERGY_RECORDER_API_PASSWORD     |                                                          |
|               CI_LOOP                |                          daily                           |
|                DEBUG                 |                           true                           |
|            INSTALLER_TYPE            |                           fuel                           |
|       ENERGY_RECORDER_API_URL        |             http://energy.opnfv.fr/resources             |
|           DEPLOY_SCENARIO            |                    os-odl-bgpvpn-noha                    |
|       ENERGY_RECORDER_API_USER       |                                                          |
|              NODE_NAME               |                    ericsson-virtual4                     |
+--------------------------------------+----------------------------------------------------------+

2019-09-17 07:56:19,954 - xtesting.ci.run_tests - INFO - Sourcing env file /var/lib/xtesting/conf/env_file


export OS_IDENTITY_API_VERSION=3
export OS_PROJECT_DOMAIN_NAME=Default
export OS_USER_DOMAIN_NAME=Default
export OS_PROJECT_NAME=admin
export OS_TENANT_NAME=admin
export OS_USERNAME=admin
export OS_PASSWORD=opnfv_secret
export OS_REGION_NAME=RegionOne
export OS_INTERFACE=internal
export OS_ENDPOINT_TYPE="internal"
export OS_CACERT="/etc/ssl/certs/ca-certificates.crt"
export SDN_CONTROLLER_USER=admin
export SDN_CONTROLLER_RESTCONFPORT=8282
export SDN_CONTROLLER_PASSWORD=admin
export SDN_CONTROLLER_WEBPORT=8282
export SDN_CONTROLLER_IP=10.16.0.107
export VOLUME_DEVICE_NAME=sdc
export OS_AUTH_URL=http://172.16.10.36:35357/v3

2019-09-17 07:56:19,955 - xtesting.ci.run_tests - INFO - TESTS TO BE EXECUTED:

+---------------+---------------+------------------------------------------+-------------------------------------------------+
|     TIERS     |     ORDER     |               DESCRIPTION                |                    TESTCASES                    |
+---------------+---------------+------------------------------------------+-------------------------------------------------+
|     smoke     |       1       |     Set of basic Functional tests to     |     neutron-tempest-plugin-api rally_sanity     |
|               |               |      validate the OPNFV scenarios.       |          refstack_defcore tempest_full          |
|               |               |                                          |      tempest_scenario patrole neutron_trunk     |
|               |               |                                          |         networking-bgpvpn networking-sfc        |
|               |               |                                          |                     barbican                    |
+---------------+---------------+------------------------------------------+-------------------------------------------------+

2019-09-17 07:56:19,991 - xtesting.ci.run_tests - INFO - Loading test case 'neutron-tempest-plugin-api'...
2019-09-17 07:56:24,378 - xtesting.ci.run_tests - INFO - Running test case 'neutron-tempest-plugin-api'...
2019-09-17 08:07:47,356 - xtesting.core.testcase - INFO - The results were successfully pushed to DB
2019-09-17 08:07:47,357 - xtesting.ci.run_tests - INFO - Test result:

+------------------------------------+------------------+------------------+----------------+
|             TEST CASE              |     PROJECT      |     DURATION     |     RESULT     |
+------------------------------------+------------------+------------------+----------------+
|     neutron-tempest-plugin-api     |     functest     |      11:22       |      FAIL      |
+------------------------------------+------------------+------------------+----------------+

2019-09-17 08:07:59,089 - xtesting.ci.run_tests - ERROR - The test case 'neutron-tempest-plugin-api' failed.
2019-09-17 08:07:59,123 - xtesting.ci.run_tests - INFO - Loading test case 'rally_sanity'...
2019-09-17 08:08:02,022 - xtesting.ci.run_tests - INFO - Running test case 'rally_sanity'...
2019-09-17 08:38:55,136 - xtesting.core.testcase - INFO - The results were successfully pushed to DB
2019-09-17 08:38:55,137 - xtesting.ci.run_tests - INFO - Test result:

+----------------------+------------------+------------------+----------------+
|      TEST CASE       |     PROJECT      |     DURATION     |     RESULT     |
+----------------------+------------------+------------------+----------------+
|     rally_sanity     |     functest     |      30:53       |      PASS      |
+----------------------+------------------+------------------+----------------+

2019-09-17 08:39:06,478 - xtesting.ci.run_tests - INFO - Loading test case 'refstack_defcore'...
2019-09-17 08:39:11,037 - xtesting.ci.run_tests - INFO - Running test case 'refstack_defcore'...
2019-09-17 08:47:24,670 - xtesting.core.testcase - INFO - The results were successfully pushed to DB
2019-09-17 08:47:24,670 - xtesting.ci.run_tests - INFO - Test result:

+--------------------------+------------------+------------------+----------------+
|        TEST CASE         |     PROJECT      |     DURATION     |     RESULT     |
+--------------------------+------------------+------------------+----------------+
|     refstack_defcore     |     functest     |      08:13       |      PASS      |
+--------------------------+------------------+------------------+----------------+

2019-09-17 08:47:35,996 - xtesting.ci.run_tests - INFO - Loading test case 'tempest_full'...
2019-09-17 08:47:39,821 - xtesting.ci.run_tests - INFO - Running test case 'tempest_full'...
2019-09-17 09:38:52,624 - xtesting.core.testcase - INFO - The results were successfully pushed to DB
2019-09-17 09:38:52,624 - xtesting.ci.run_tests - INFO - Test result:

+----------------------+------------------+------------------+----------------+
|      TEST CASE       |     PROJECT      |     DURATION     |     RESULT     |
+----------------------+------------------+------------------+----------------+
|     tempest_full     |     functest     |      51:12       |      FAIL      |
+----------------------+------------------+------------------+----------------+

2019-09-17 09:39:04,854 - xtesting.ci.run_tests - ERROR - The test case 'tempest_full' failed.
2019-09-17 09:39:04,888 - xtesting.ci.run_tests - INFO - Loading test case 'tempest_scenario'...
2019-09-17 09:39:08,994 - xtesting.ci.run_tests - INFO - Running test case 'tempest_scenario'...
2019-09-17 09:49:50,774 - xtesting.core.testcase - INFO - The results were successfully pushed to DB
2019-09-17 09:49:50,774 - xtesting.ci.run_tests - INFO - Test result:

+--------------------------+------------------+------------------+----------------+
|        TEST CASE         |     PROJECT      |     DURATION     |     RESULT     |
+--------------------------+------------------+------------------+----------------+
|     tempest_scenario     |     functest     |      10:41       |      PASS      |
+--------------------------+------------------+------------------+----------------+

2019-09-17 09:50:02,894 - xtesting.ci.run_tests - INFO - Loading test case 'patrole'...
2019-09-17 09:50:06,797 - xtesting.ci.run_tests - INFO - Running test case 'patrole'...
2019-09-17 09:53:17,356 - xtesting.core.testcase - INFO - The results were successfully pushed to DB
2019-09-17 09:53:17,357 - xtesting.ci.run_tests - INFO - Test result:

+-------------------+------------------+------------------+----------------+
|     TEST CASE     |     PROJECT      |     DURATION     |     RESULT     |
+-------------------+------------------+------------------+----------------+
|      patrole      |     functest     |      03:10       |      FAIL      |
+-------------------+------------------+------------------+----------------+

2019-09-17 09:53:27,401 - xtesting.ci.run_tests - ERROR - The test case 'patrole' failed.
2019-09-17 09:53:27,438 - xtesting.ci.run_tests - INFO - Loading test case 'neutron_trunk'...
2019-09-17 09:53:30,998 - xtesting.ci.run_tests - INFO - Running test case 'neutron_trunk'...
2019-09-17 09:56:10,226 - xtesting.core.testcase - INFO - The results were successfully pushed to DB
2019-09-17 09:56:10,227 - xtesting.ci.run_tests - INFO - Test result:

+-----------------------+------------------+------------------+----------------+
|       TEST CASE       |     PROJECT      |     DURATION     |     RESULT     |
+-----------------------+------------------+------------------+----------------+
|     neutron_trunk     |     functest     |      02:39       |      PASS      |
+-----------------------+------------------+------------------+----------------+

2019-09-17 09:56:21,752 - xtesting.ci.run_tests - INFO - Loading test case 'networking-bgpvpn'...
2019-09-17 09:56:25,636 - xtesting.ci.run_tests - INFO - Running test case 'networking-bgpvpn'...
2019-09-17 09:57:59,071 - xtesting.core.testcase - INFO - The results were successfully pushed to DB
2019-09-17 09:57:59,071 - xtesting.ci.run_tests - INFO - Test result:

+---------------------------+------------------+------------------+----------------+
|         TEST CASE         |     PROJECT      |     DURATION     |     RESULT     |
+---------------------------+------------------+------------------+----------------+
|     networking-bgpvpn     |     functest     |      01:33       |      FAIL      |
+---------------------------+------------------+------------------+----------------+

2019-09-17 09:58:08,724 - xtesting.ci.run_tests - ERROR - The test case 'networking-bgpvpn' failed.
2019-09-17 09:58:08,757 - xtesting.ci.run_tests - INFO - Loading test case 'networking-sfc'...
2019-09-17 09:58:12,378 - functest.opnfv_tests.openstack.tempest.tempest - WARNING - Cannot find Neutron extension: sfc
2019-09-17 09:58:12,979 - xtesting.ci.run_tests - INFO - Skipping test case 'networking-sfc'...
2019-09-17 09:58:12,979 - xtesting.ci.run_tests - INFO - Test result:

+------------------------+------------------+------------------+----------------+
|       TEST CASE        |     PROJECT      |     DURATION     |     RESULT     |
+------------------------+------------------+------------------+----------------+
|     networking-sfc     |     functest     |      00:00       |      SKIP      |
+------------------------+------------------+------------------+----------------+

2019-09-17 09:58:13,015 - xtesting.ci.run_tests - INFO - Loading test case 'barbican'...
2019-09-17 09:58:16,663 - xtesting.ci.run_tests - INFO - Running test case 'barbican'...
2019-09-17 10:01:00,942 - xtesting.core.testcase - INFO - The results were successfully pushed to DB
2019-09-17 10:01:00,943 - xtesting.ci.run_tests - INFO - Test result:

+-------------------+------------------+------------------+----------------+
|     TEST CASE     |     PROJECT      |     DURATION     |     RESULT     |
+-------------------+------------------+------------------+----------------+
|      barbican     |     functest     |      02:44       |      PASS      |
+-------------------+------------------+------------------+----------------+

2019-09-17 10:01:12,867 - xtesting.ci.run_tests - INFO - Xtesting report:

+------------------------------------+------------------+---------------+------------------+----------------+
|             TEST CASE              |     PROJECT      |      TIER     |     DURATION     |     RESULT     |
+------------------------------------+------------------+---------------+------------------+----------------+
|     neutron-tempest-plugin-api     |     functest     |     smoke     |      11:22       |      FAIL      |
|            rally_sanity            |     functest     |     smoke     |      30:53       |      PASS      |
|          refstack_defcore          |     functest     |     smoke     |      08:13       |      PASS      |
|            tempest_full            |     functest     |     smoke     |      51:12       |      FAIL      |
|          tempest_scenario          |     functest     |     smoke     |      10:41       |      PASS      |
|              patrole               |     functest     |     smoke     |      03:10       |      FAIL      |
|           neutron_trunk            |     functest     |     smoke     |      02:39       |      PASS      |
|         networking-bgpvpn          |     functest     |     smoke     |      01:33       |      FAIL      |
|           networking-sfc           |     functest     |     smoke     |      00:00       |      SKIP      |
|              barbican              |     functest     |     smoke     |      02:44       |      PASS      |
+------------------------------------+------------------+---------------+------------------+----------------+

2019-09-17 10:01:12,874 - xtesting.ci.run_tests - INFO - Execution exit value: Result.EX_ERROR
Functest: Pulling Functest Docker image opnfv/functest-benchmarking:hunter ...
Running Functest tier 'benchmarking'. CMD: docker run --rm  -e INSTALLER_TYPE=fuel -e INSTALLER_IP=10.20.0.2     -e NODE_NAME=ericsson-virtual4 -e DEPLOY_SCENARIO=os-odl-bgpvpn-noha     -e BUILD_TAG=jenkins-functest-fuel-virtual-daily-hunter-787 -e DEPLOY_TYPE=virt -e CI_LOOP=daily     -e TEST_DB_URL=http://testresults.opnfv.org/test/api/v1/results -e ENERGY_RECORDER_API_URL=http://energy.opnfv.fr/resources     -e DEBUG=true -e POD_ARCH=x86_64 -e BLOCK_MIGRATION=false -e SDN_CONTROLLER_RESTCONFPORT=8080 -e IMAGE_PROPERTIES=hw_disk_bus:scsi,hw_scsi_model:virtio-scsi -e FLAVOR_EXTRA_SPECS= -v /home/jenkins/opnfv/functest/images:/home/opnfv/functest/images -v /home/jenkins/opnfv/functest/results/hunter:/home/opnfv/functest/results -v /var/lib/opnfv/mcp.rsa:/root/.ssh/id_rsa       -v /home/jenkins/opnfv-openrc.sh:/home/opnfv/functest/conf/env_file      -v /tmp/tmp.8k9D6803ys:/usr/lib/python2.7/site-packages/functest/opnfv_tests/openstack/tempest/custom_tests/tempest_conf.yaml  opnfv/functest-benchmarking:hunter /bin/bash -c 'run_tests -r -t all'
2019-09-17 10:01:16,819 - xtesting.ci.run_tests - INFO - Deployment description:

+--------------------------------------+----------------------------------------------------------+
|               ENV VAR                |                          VALUE                           |
+--------------------------------------+----------------------------------------------------------+
|              BUILD_TAG               |      jenkins-functest-fuel-virtual-daily-hunter-787      |
|             TEST_DB_URL              |     http://testresults.opnfv.org/test/api/v1/results     |
|     ENERGY_RECORDER_API_PASSWORD     |                                                          |
|               CI_LOOP                |                          daily                           |
|                DEBUG                 |                           true                           |
|            INSTALLER_TYPE            |                           fuel                           |
|       ENERGY_RECORDER_API_URL        |             http://energy.opnfv.fr/resources             |
|           DEPLOY_SCENARIO            |                    os-odl-bgpvpn-noha                    |
|       ENERGY_RECORDER_API_USER       |                                                          |
|              NODE_NAME               |                    ericsson-virtual4                     |
+--------------------------------------+----------------------------------------------------------+

2019-09-17 10:01:16,824 - xtesting.ci.run_tests - INFO - Sourcing env file /var/lib/xtesting/conf/env_file


export OS_IDENTITY_API_VERSION=3
export OS_PROJECT_DOMAIN_NAME=Default
export OS_USER_DOMAIN_NAME=Default
export OS_PROJECT_NAME=admin
export OS_TENANT_NAME=admin
export OS_USERNAME=admin
export OS_PASSWORD=opnfv_secret
export OS_REGION_NAME=RegionOne
export OS_INTERFACE=internal
export OS_ENDPOINT_TYPE="internal"
export OS_CACERT="/etc/ssl/certs/ca-certificates.crt"
export SDN_CONTROLLER_USER=admin
export SDN_CONTROLLER_RESTCONFPORT=8282
export SDN_CONTROLLER_PASSWORD=admin
export SDN_CONTROLLER_WEBPORT=8282
export SDN_CONTROLLER_IP=10.16.0.107
export VOLUME_DEVICE_NAME=sdc
export OS_AUTH_URL=http://172.16.10.36:35357/v3

2019-09-17 10:01:16,825 - xtesting.ci.run_tests - INFO - TESTS TO BE EXECUTED:

+----------------------+---------------+-------------------------------------------------+-------------------------------------------+
|        TIERS         |     ORDER     |                   DESCRIPTION                   |                 TESTCASES                 |
+----------------------+---------------+-------------------------------------------------+-------------------------------------------+
|     benchmarking     |       2       |     Run several OpenStack performance tools     |     rally_full rally_jobs vmtp shaker     |
|                      |               |     https://docs.openstack.org/performance-     |                                           |
|                      |               |       docs/latest/methodologies/tools.html      |                                           |
+----------------------+---------------+-------------------------------------------------+-------------------------------------------+

2019-09-17 10:01:16,838 - xtesting.ci.run_tests - INFO - Loading test case 'rally_full'...
2019-09-17 10:01:19,939 - xtesting.ci.run_tests - INFO - Running test case 'rally_full'...
2019-09-17 12:41:53,021 - xtesting.core.testcase - INFO - The results were successfully pushed to DB
2019-09-17 12:41:53,022 - xtesting.ci.run_tests - INFO - Test result:

+--------------------+------------------+------------------+----------------+
|     TEST CASE      |     PROJECT      |     DURATION     |     RESULT     |
+--------------------+------------------+------------------+----------------+
|     rally_full     |     functest     |      160:33      |      PASS      |
+--------------------+------------------+------------------+----------------+

2019-09-17 12:42:05,716 - xtesting.ci.run_tests - INFO - Loading test case 'rally_jobs'...
2019-09-17 12:42:08,478 - xtesting.ci.run_tests - INFO - Running test case 'rally_jobs'...
2019-09-17 13:32:42,251 - xtesting.core.testcase - INFO - The results were successfully pushed to DB
2019-09-17 13:32:42,252 - xtesting.ci.run_tests - INFO - Test result:

+--------------------+------------------+------------------+----------------+
|     TEST CASE      |     PROJECT      |     DURATION     |     RESULT     |
+--------------------+------------------+------------------+----------------+
|     rally_jobs     |     functest     |      50:33       |      PASS      |
+--------------------+------------------+------------------+----------------+

2019-09-17 13:32:54,816 - xtesting.ci.run_tests - INFO - Loading test case 'vmtp'...
2019-09-17 13:32:57,701 - xtesting.ci.run_tests - INFO - Running test case 'vmtp'...
2019-09-17 14:09:03,301 - functest.opnfv_tests.openstack.vmtp.vmtp - ERROR - Exception when calling ['vmtp_genchart', '-c', '/home/opnfv/functest/results/vmtp/vmtp.html', '/home/opnfv/functest/results/vmtp/vmtp.json']
Error: No such file %s: /home/opnfv/functest/results/vmtp/vmtp.json

2019-09-17 14:09:03,616 - xtesting.core.testcase - INFO - The results were successfully pushed to DB
2019-09-17 14:09:03,616 - xtesting.ci.run_tests - INFO - Test result:

+-------------------+------------------+------------------+----------------+
|     TEST CASE     |     PROJECT      |     DURATION     |     RESULT     |
+-------------------+------------------+------------------+----------------+
|        vmtp       |     functest     |      36:06       |      FAIL      |
+-------------------+------------------+------------------+----------------+

2019-09-17 14:09:04,912 - functest.core.tenantnetwork - ERROR - cannot clean all resources
Traceback (most recent call last):
  File "/usr/lib/python2.7/site-packages/functest/core/tenantnetwork.py", line 282, in clean
    self.cloud.delete_router(self.router.id)
  File "/usr/lib/python2.7/site-packages/shade/openstackcloud.py", line 4156, in delete_router
    error_message="Error deleting router {0}".format(name_or_id))
  File "/usr/lib/python2.7/site-packages/keystoneauth1/adapter.py", line 343, in delete
    return self.request(url, 'DELETE', **kwargs)
  File "/usr/lib/python2.7/site-packages/openstack/_adapter.py", line 164, in request
    return _json_response(response, error_message=error_message)
  File "/usr/lib/python2.7/site-packages/openstack/_adapter.py", line 95, in _json_response
    exceptions.raise_from_response(response, error_message=error_message)
  File "/usr/lib/python2.7/site-packages/openstack/exceptions.py", line 229, in raise_from_response
    http_status=http_status, request_id=request_id
ConflictException: Error deleting router aed3ee5f-0f0a-4c1c-bde9-732566046da2: Client Error for url: http://172.16.10.36:9696/v2.0/routers/aed3ee5f-0f0a-4c1c-bde9-732566046da2.json, Router aed3ee5f-0f0a-4c1c-bde9-732566046da2 still has ports
2019-09-17 14:09:07,504 - xtesting.ci.run_tests - ERROR - The test case 'vmtp' failed.
2019-09-17 14:09:07,518 - xtesting.ci.run_tests - INFO - Loading test case 'shaker'...
2019-09-17 14:09:10,754 - xtesting.ci.run_tests - INFO - Running test case 'shaker'...
2019-09-17 15:10:47,704 - functest.opnfv_tests.openstack.shaker.shaker - ERROR - cannot get report files
Traceback (most recent call last):
  File "/usr/lib/python2.7/site-packages/functest/opnfv_tests/openstack/shaker/shaker.py", line 125, in execute
    scpc.get('report.json', self.res_dir)
  File "/usr/lib/python2.7/site-packages/scp.py", line 217, in get
    self._recv_all()
  File "/usr/lib/python2.7/site-packages/scp.py", line 367, in _recv_all
    raise SCPException(asunicode(msg[1:]))
SCPException: scp: report.json: No such file or directory
2019-09-17 15:10:48,012 - xtesting.core.testcase - INFO - The results were successfully pushed to DB
2019-09-17 15:10:48,013 - xtesting.ci.run_tests - INFO - Test result:

+-------------------+------------------+------------------+----------------+
|     TEST CASE     |     PROJECT      |     DURATION     |     RESULT     |
+-------------------+------------------+------------------+----------------+
|       shaker      |     functest     |      61:37       |      FAIL      |
+-------------------+------------------+------------------+----------------+

2019-09-17 15:11:08,751 - xtesting.ci.run_tests - ERROR - The test case 'shaker' failed.
2019-09-17 15:11:08,752 - xtesting.ci.run_tests - INFO - Xtesting report:

+--------------------+------------------+----------------------+------------------+----------------+
|     TEST CASE      |     PROJECT      |         TIER         |     DURATION     |     RESULT     |
+--------------------+------------------+----------------------+------------------+----------------+
|     rally_full     |     functest     |     benchmarking     |      160:33      |      PASS      |
|     rally_jobs     |     functest     |     benchmarking     |      50:33       |      PASS      |
|        vmtp        |     functest     |     benchmarking     |      36:06       |      FAIL      |
|       shaker       |     functest     |     benchmarking     |      61:37       |      FAIL      |
+--------------------+------------------+----------------------+------------------+----------------+

2019-09-17 15:11:08,755 - xtesting.ci.run_tests - INFO - Execution exit value: Result.EX_ERROR
Functest: Pulling Functest Docker image opnfv/functest-vnf:hunter ...
Running Functest tier 'vnf'. CMD: docker run --rm  -e INSTALLER_TYPE=fuel -e INSTALLER_IP=10.20.0.2     -e NODE_NAME=ericsson-virtual4 -e DEPLOY_SCENARIO=os-odl-bgpvpn-noha     -e BUILD_TAG=jenkins-functest-fuel-virtual-daily-hunter-787 -e DEPLOY_TYPE=virt -e CI_LOOP=daily     -e TEST_DB_URL=http://testresults.opnfv.org/test/api/v1/results -e ENERGY_RECORDER_API_URL=http://energy.opnfv.fr/resources     -e DEBUG=true -e POD_ARCH=x86_64 -e BLOCK_MIGRATION=false -e SDN_CONTROLLER_RESTCONFPORT=8080 -e IMAGE_PROPERTIES=hw_disk_bus:scsi,hw_scsi_model:virtio-scsi -e FLAVOR_EXTRA_SPECS= -v /home/jenkins/opnfv/functest/images:/home/opnfv/functest/images -v /home/jenkins/opnfv/functest/results/hunter:/home/opnfv/functest/results -v /var/lib/opnfv/mcp.rsa:/root/.ssh/id_rsa       -v /home/jenkins/opnfv-openrc.sh:/home/opnfv/functest/conf/env_file      -v /tmp/tmp.8k9D6803ys:/usr/lib/python2.7/site-packages/functest/opnfv_tests/openstack/tempest/custom_tests/tempest_conf.yaml  opnfv/functest-vnf:hunter /bin/bash -c 'run_tests -r -t all'
2019-09-17 15:11:12,434 - xtesting.ci.run_tests - INFO - Deployment description:

+--------------------------------------+----------------------------------------------------------+
|               ENV VAR                |                          VALUE                           |
+--------------------------------------+----------------------------------------------------------+
|              BUILD_TAG               |      jenkins-functest-fuel-virtual-daily-hunter-787      |
|             TEST_DB_URL              |     http://testresults.opnfv.org/test/api/v1/results     |
|     ENERGY_RECORDER_API_PASSWORD     |                                                          |
|               CI_LOOP                |                          daily                           |
|                DEBUG                 |                           true                           |
|            INSTALLER_TYPE            |                           fuel                           |
|       ENERGY_RECORDER_API_URL        |             http://energy.opnfv.fr/resources             |
|           DEPLOY_SCENARIO            |                    os-odl-bgpvpn-noha                    |
|       ENERGY_RECORDER_API_USER       |                                                          |
|              NODE_NAME               |                    ericsson-virtual4                     |
+--------------------------------------+----------------------------------------------------------+

2019-09-17 15:11:12,439 - xtesting.ci.run_tests - INFO - Sourcing env file /var/lib/xtesting/conf/env_file


export OS_IDENTITY_API_VERSION=3
export OS_PROJECT_DOMAIN_NAME=Default
export OS_USER_DOMAIN_NAME=Default
export OS_PROJECT_NAME=admin
export OS_TENANT_NAME=admin
export OS_USERNAME=admin
export OS_PASSWORD=opnfv_secret
export OS_REGION_NAME=RegionOne
export OS_INTERFACE=internal
export OS_ENDPOINT_TYPE="internal"
export OS_CACERT="/etc/ssl/certs/ca-certificates.crt"
export SDN_CONTROLLER_USER=admin
export SDN_CONTROLLER_RESTCONFPORT=8282
export SDN_CONTROLLER_PASSWORD=admin
export SDN_CONTROLLER_WEBPORT=8282
export SDN_CONTROLLER_IP=10.16.0.107
export VOLUME_DEVICE_NAME=sdc
export OS_AUTH_URL=http://172.16.10.36:35357/v3

2019-09-17 15:11:12,440 - xtesting.ci.run_tests - INFO - TESTS TO BE EXECUTED:

+---------------+---------------+---------------------------------------+----------------------------------------+
|     TIERS     |     ORDER     |              DESCRIPTION              |               TESTCASES                |
+---------------+---------------+---------------------------------------+----------------------------------------+
|      vnf      |       4       |     Collection of VNF test cases.     |     cloudify cloudify_ims heat_ims     |
|               |               |                                       |         vyos_vrouter juju_epc          |
+---------------+---------------+---------------------------------------+----------------------------------------+

2019-09-17 15:11:12,452 - xtesting.ci.run_tests - INFO - Loading test case 'cloudify'...
2019-09-17 15:11:15,029 - xtesting.ci.run_tests - INFO - Running test case 'cloudify'...
2019-09-17 15:15:51,448 - functest.core.cloudify - INFO - Attemps running status of the Manager
2019-09-17 15:16:22,480 - functest.core.cloudify - INFO - The current manager status is running
2019-09-17 15:16:23,177 - functest.core.cloudify - INFO - Secrets API successfully reached
2019-09-17 15:16:23,177 - functest.core.cloudify - INFO - Cloudify Manager is up and running
2019-09-17 15:16:23,509 - xtesting.core.testcase - INFO - The results were successfully pushed to DB
2019-09-17 15:16:23,509 - xtesting.ci.run_tests - INFO - Test result:

+-------------------+------------------+------------------+----------------+
|     TEST CASE     |     PROJECT      |     DURATION     |     RESULT     |
+-------------------+------------------+------------------+----------------+
|      cloudify     |     functest     |      05:08       |      PASS      |
+-------------------+------------------+------------------+----------------+

2019-09-17 15:16:41,296 - xtesting.ci.run_tests - INFO - Loading test case 'cloudify_ims'...
2019-09-17 15:16:43,858 - xtesting.ci.run_tests - INFO - Running test case 'cloudify_ims'...
2019-09-17 15:20:23,208 - functest.core.cloudify - INFO - Attemps running status of the Manager
2019-09-17 15:20:54,179 - functest.core.cloudify - INFO - The current manager status is running
2019-09-17 15:20:54,785 - functest.core.cloudify - INFO - Secrets API successfully reached
2019-09-17 15:20:54,785 - functest.core.cloudify - INFO - Cloudify Manager is up and running
2019-09-17 15:20:56,470 - functest.core.cloudify - INFO - Put private keypair in manager
2019-09-17 15:44:38,402 - xtesting.core.testcase - INFO - The results were successfully pushed to DB
2019-09-17 15:44:38,402 - xtesting.ci.run_tests - INFO - Test result:

+----------------------+------------------+------------------+----------------+
|      TEST CASE       |     PROJECT      |     DURATION     |     RESULT     |
+----------------------+------------------+------------------+----------------+
|     cloudify_ims     |     functest     |      27:54       |      PASS      |
+----------------------+------------------+------------------+----------------+

2019-09-17 15:44:38,414 - functest.core.cloudify - INFO - Deleting the current deployment
2019-09-17 15:47:58,044 - functest.core.cloudify - ERROR - Some issue during the undeployment ..
Traceback (most recent call last):
  File "/usr/lib/python2.7/site-packages/functest/core/cloudify.py", line 153, in kill_existing_execution
    wait_for_execution(self.cfy_client, execution, self.__logger)
  File "/usr/lib/python2.7/site-packages/functest/core/cloudify.py", line 182, in wait_for_execution
    sort='@timestamp').items
  File "/usr/lib/python2.7/site-packages/cloudify_rest_client/events.py", line 77, in list
    response = self.api.get(uri, _include=_include, params=params)
  File "/usr/lib/python2.7/site-packages/cloudify_rest_client/client.py", line 252, in get
    timeout=timeout)
  File "/usr/lib/python2.7/site-packages/cloudify_rest_client/client.py", line 233, in do_request
    'SSL, but the client does'.format(e)
ConnectionError: HTTPConnectionPool(host='10.16.0.123', port=80): Max retries exceeded with url: /api/v3.1/events?_offset=373&type=cloudify_event&type=cloudify_log&execution_id=a48075bb-f7a1-4fb3-b75d-4c1ad3644642&_sort=%40timestamp&_size=50 (Caused by NewConnectionError('<urllib3.connection.HTTPConnection object at 0x7f09647a5fd0>: Failed to establish a new connection: [Errno 110] Operation timed out',))
This can happen when the manager is not working with SSL, but the client does
2019-09-17 15:48:06,347 - functest.core.tenantnetwork - ERROR - cannot clean all resources
Traceback (most recent call last):
  File "/usr/lib/python2.7/site-packages/functest/core/tenantnetwork.py", line 281, in clean
    self.router, self.subnet.id)
  File "/usr/lib/python2.7/site-packages/shade/openstackcloud.py", line 3998, in remove_router_interface
    router['id']))
  File "/usr/lib/python2.7/site-packages/keystoneauth1/adapter.py", line 337, in put
    return self.request(url, 'PUT', **kwargs)
  File "/usr/lib/python2.7/site-packages/openstack/_adapter.py", line 164, in request
    return _json_response(response, error_message=error_message)
  File "/usr/lib/python2.7/site-packages/openstack/_adapter.py", line 95, in _json_response
    exceptions.raise_from_response(response, error_message=error_message)
  File "/usr/lib/python2.7/site-packages/openstack/exceptions.py", line 229, in raise_from_response
    http_status=http_status, request_id=request_id
ConflictException: Error detaching interface from router 62014b80-6267-489b-845a-7bcbea80803a: Client Error for url: http://172.16.10.36:9696/v2.0/routers/62014b80-6267-489b-845a-7bcbea80803a/remove_router_interface.json, Router interface for subnet b460d585-167f-4385-83a1-b49e91ca5687 on router 62014b80-6267-489b-845a-7bcbea80803a cannot be deleted, as it is required by one or more floating IPs.
2019-09-17 15:48:09,480 - functest.core.tenantnetwork - ERROR - Cannot clean all resources
Traceback (most recent call last):
  File "/usr/lib/python2.7/site-packages/functest/core/tenantnetwork.py", line 129, in clean
    self.orig_cloud.delete_security_group(sec_id)
  File "/usr/lib/python2.7/site-packages/shade/openstackcloud.py", line 7987, in delete_security_group
    name_or_id)
  File "/usr/lib/python2.7/site-packages/keystoneauth1/adapter.py", line 343, in delete
    return self.request(url, 'DELETE', **kwargs)
  File "/usr/lib/python2.7/site-packages/openstack/_adapter.py", line 164, in request
    return _json_response(response, error_message=error_message)
  File "/usr/lib/python2.7/site-packages/openstack/_adapter.py", line 95, in _json_response
    exceptions.raise_from_response(response, error_message=error_message)
  File "/usr/lib/python2.7/site-packages/openstack/exceptions.py", line 229, in raise_from_response
    http_status=http_status, request_id=request_id
ConflictException: Error deleting security group 0d6f23a9-9171-4d58-a54f-5b719799d4f1: Client Error for url: http://172.16.10.36:9696/v2.0/security-groups/0d6f23a9-9171-4d58-a54f-5b719799d4f1.json, Security Group 0d6f23a9-9171-4d58-a54f-5b719799d4f1 in use.
2019-09-17 15:48:09,493 - xtesting.ci.run_tests - INFO - Loading test case 'heat_ims'...
2019-09-17 15:48:12,680 - xtesting.ci.run_tests - INFO - Running test case 'heat_ims'...
2019-09-17 16:26:37,277 - xtesting.core.testcase - INFO - The results were successfully pushed to DB
2019-09-17 16:26:37,277 - xtesting.ci.run_tests - INFO - Test result:

+-------------------+------------------+------------------+----------------+
|     TEST CASE     |     PROJECT      |     DURATION     |     RESULT     |
+-------------------+------------------+------------------+----------------+
|      heat_ims     |     functest     |      38:24       |      PASS      |
+-------------------+------------------+------------------+----------------+

2019-09-17 16:27:51,033 - xtesting.ci.run_tests - INFO - Loading test case 'vyos_vrouter'...
2019-09-17 16:27:54,015 - xtesting.ci.run_tests - INFO - Running test case 'vyos_vrouter'...
2019-09-17 16:33:22,183 - functest.core.cloudify - INFO - Attemps running status of the Manager
2019-09-17 16:33:52,703 - functest.core.cloudify - INFO - The current manager status is running
2019-09-17 16:33:53,151 - functest.core.cloudify - INFO - Secrets API successfully reached
2019-09-17 16:33:53,151 - functest.core.cloudify - INFO - Cloudify Manager is up and running
2019-09-17 16:33:53,152 - functest.core.cloudify - INFO - Put private keypair in manager
2019-09-17 16:48:50,861 - xtesting.core.testcase - INFO - The results were successfully pushed to DB
2019-09-17 16:48:50,862 - xtesting.ci.run_tests - INFO - Test result:

+----------------------+------------------+------------------+----------------+
|      TEST CASE       |     PROJECT      |     DURATION     |     RESULT     |
+----------------------+------------------+------------------+----------------+
|     vyos_vrouter     |     functest     |      20:57       |      PASS      |
+----------------------+------------------+------------------+----------------+

2019-09-17 16:48:50,865 - functest.core.cloudify - INFO - Deleting the current deployment
2019-09-17 16:50:37,829 - xtesting.ci.run_tests - INFO - Loading test case 'juju_epc'...
2019-09-17 16:50:40,380 - xtesting.ci.run_tests - INFO - Running test case 'juju_epc'...
2019-09-17 17:24:04,926 - xtesting.core.testcase - INFO - The results were successfully pushed to DB
2019-09-17 17:24:04,926 - xtesting.ci.run_tests - INFO - Test result:

+-------------------+------------------+------------------+----------------+
|     TEST CASE     |     PROJECT      |     DURATION     |     RESULT     |
+-------------------+------------------+------------------+----------------+
|      juju_epc     |     functest     |      33:24       |      PASS      |
+-------------------+------------------+------------------+----------------+

2019-09-17 17:40:55,359 - xtesting.ci.run_tests - INFO - Xtesting report:

+----------------------+------------------+--------------+------------------+----------------+
|      TEST CASE       |     PROJECT      |     TIER     |     DURATION     |     RESULT     |
+----------------------+------------------+--------------+------------------+----------------+
|       cloudify       |     functest     |     vnf      |      05:08       |      PASS      |
|     cloudify_ims     |     functest     |     vnf      |      27:54       |      PASS      |
|       heat_ims       |     functest     |     vnf      |      38:24       |      PASS      |
|     vyos_vrouter     |     functest     |     vnf      |      20:57       |      PASS      |
|       juju_epc       |     functest     |     vnf      |      33:24       |      PASS      |
+----------------------+------------------+--------------+------------------+----------------+

2019-09-17 17:40:55,363 - xtesting.ci.run_tests - INFO - Execution exit value: Result.EX_OK
Regular expression run condition: Expression=[k8-.*], Label=[os-odl-bgpvpn-noha]
Run condition [Regular expression match] preventing perform for step [Execute shell]
[functest-fuel-virtual-daily-hunter] $ /bin/bash /tmp/jenkins3827040302590662984.sh
Uploading logs to artifact logs/functest/ericsson-virtual4/hunter/2019-09-17_17-40-57
Logs can be found in https://artifacts.opnfv.org/logs_functest_ericsson-virtual4.html
https://artifacts.opnfv.org/logs/functest/ericsson-virtual4/hunter/2019-09-17_17-40-57/barbican
https://artifacts.opnfv.org/logs/functest/ericsson-virtual4/hunter/2019-09-17_17-40-57/barbican/tempest.conf
https://artifacts.opnfv.org/logs/functest/ericsson-virtual4/hunter/2019-09-17_17-40-57/barbican/tempest-report.html
https://artifacts.opnfv.org/logs/functest/ericsson-virtual4/hunter/2019-09-17_17-40-57/barbican/rally.conf
https://artifacts.opnfv.org/logs/functest/ericsson-virtual4/hunter/2019-09-17_17-40-57/barbican/rally.log
https://artifacts.opnfv.org/logs/functest/ericsson-virtual4/hunter/2019-09-17_17-40-57/barbican/tempest.log
https://artifacts.opnfv.org/logs/functest/ericsson-virtual4/hunter/2019-09-17_17-40-57/barbican/tempest.debug.log
https://artifacts.opnfv.org/logs/functest/ericsson-virtual4/hunter/2019-09-17_17-40-57/barbican/test_raw_list.txt
https://artifacts.opnfv.org/logs/functest/ericsson-virtual4/hunter/2019-09-17_17-40-57/barbican/test_list.txt
https://artifacts.opnfv.org/logs/functest/ericsson-virtual4/hunter/2019-09-17_17-40-57/barbican/tempest-report.xml
https://artifacts.opnfv.org/logs/functest/ericsson-virtual4/hunter/2019-09-17_17-40-57/juju_epc
https://artifacts.opnfv.org/logs/functest/ericsson-virtual4/hunter/2019-09-17_17-40-57/juju_epc/credentials.yaml
https://artifacts.opnfv.org/logs/functest/ericsson-virtual4/hunter/2019-09-17_17-40-57/juju_epc/clouds.yaml
https://artifacts.opnfv.org/logs/functest/ericsson-virtual4/hunter/2019-09-17_17-40-57/juju_epc/TestResults.json
https://artifacts.opnfv.org/logs/functest/ericsson-virtual4/hunter/2019-09-17_17-40-57/rally_sanity
https://artifacts.opnfv.org/logs/functest/ericsson-virtual4/hunter/2019-09-17_17-40-57/rally_sanity/heat.json
https://artifacts.opnfv.org/logs/functest/ericsson-virtual4/hunter/2019-09-17_17-40-57/rally_sanity/keystone.json
https://artifacts.opnfv.org/logs/functest/ericsson-virtual4/hunter/2019-09-17_17-40-57/rally_sanity/quotas.json
https://artifacts.opnfv.org/logs/functest/ericsson-virtual4/hunter/2019-09-17_17-40-57/rally_sanity/cinder.json
https://artifacts.opnfv.org/logs/functest/ericsson-virtual4/hunter/2019-09-17_17-40-57/rally_sanity/authenticate.json
https://artifacts.opnfv.org/logs/functest/ericsson-virtual4/hunter/2019-09-17_17-40-57/rally_sanity/gnocchi.json
https://artifacts.opnfv.org/logs/functest/ericsson-virtual4/hunter/2019-09-17_17-40-57/rally_sanity/rally_sanity.html
https://artifacts.opnfv.org/logs/functest/ericsson-virtual4/hunter/2019-09-17_17-40-57/rally_sanity/rally.log
https://artifacts.opnfv.org/logs/functest/ericsson-virtual4/hunter/2019-09-17_17-40-57/rally_sanity/glance.json
https://artifacts.opnfv.org/logs/functest/ericsson-virtual4/hunter/2019-09-17_17-40-57/rally_sanity/neutron.json
https://artifacts.opnfv.org/logs/functest/ericsson-virtual4/hunter/2019-09-17_17-40-57/rally_sanity/nova.json
https://artifacts.opnfv.org/logs/functest/ericsson-virtual4/hunter/2019-09-17_17-40-57/rally_sanity/rally_sanity.xml
https://artifacts.opnfv.org/logs/functest/ericsson-virtual4/hunter/2019-09-17_17-40-57/refstack_defcore
https://artifacts.opnfv.org/logs/functest/ericsson-virtual4/hunter/2019-09-17_17-40-57/refstack_defcore/tempest.conf
https://artifacts.opnfv.org/logs/functest/ericsson-virtual4/hunter/2019-09-17_17-40-57/refstack_defcore/tempest-report.html
https://artifacts.opnfv.org/logs/functest/ericsson-virtual4/hunter/2019-09-17_17-40-57/refstack_defcore/rally.conf
https://artifacts.opnfv.org/logs/functest/ericsson-virtual4/hunter/2019-09-17_17-40-57/refstack_defcore/rally.log
https://artifacts.opnfv.org/logs/functest/ericsson-virtual4/hunter/2019-09-17_17-40-57/refstack_defcore/tempest.log
https://artifacts.opnfv.org/logs/functest/ericsson-virtual4/hunter/2019-09-17_17-40-57/refstack_defcore/tempest.debug.log
https://artifacts.opnfv.org/logs/functest/ericsson-virtual4/hunter/2019-09-17_17-40-57/refstack_defcore/test_raw_list.txt
https://artifacts.opnfv.org/logs/functest/ericsson-virtual4/hunter/2019-09-17_17-40-57/refstack_defcore/test_list.txt
https://artifacts.opnfv.org/logs/functest/ericsson-virtual4/hunter/2019-09-17_17-40-57/refstack_defcore/tempest-report.xml
https://artifacts.opnfv.org/logs/functest/ericsson-virtual4/hunter/2019-09-17_17-40-57/tempest_full
https://artifacts.opnfv.org/logs/functest/ericsson-virtual4/hunter/2019-09-17_17-40-57/tempest_full/tempest.conf
https://artifacts.opnfv.org/logs/functest/ericsson-virtual4/hunter/2019-09-17_17-40-57/tempest_full/tempest-report.html
https://artifacts.opnfv.org/logs/functest/ericsson-virtual4/hunter/2019-09-17_17-40-57/tempest_full/rally.conf
https://artifacts.opnfv.org/logs/functest/ericsson-virtual4/hunter/2019-09-17_17-40-57/tempest_full/rally.log
https://artifacts.opnfv.org/logs/functest/ericsson-virtual4/hunter/2019-09-17_17-40-57/tempest_full/tempest.log
https://artifacts.opnfv.org/logs/functest/ericsson-virtual4/hunter/2019-09-17_17-40-57/tempest_full/tempest.debug.log
https://artifacts.opnfv.org/logs/functest/ericsson-virtual4/hunter/2019-09-17_17-40-57/tempest_full/test_raw_list.txt
https://artifacts.opnfv.org/logs/functest/ericsson-virtual4/hunter/2019-09-17_17-40-57/tempest_full/test_list.txt
https://artifacts.opnfv.org/logs/functest/ericsson-virtual4/hunter/2019-09-17_17-40-57/tempest_full/tempest-report.xml
https://artifacts.opnfv.org/logs/functest/ericsson-virtual4/hunter/2019-09-17_17-40-57/functest.log
https://artifacts.opnfv.org/logs/functest/ericsson-virtual4/hunter/2019-09-17_17-40-57/neutron_trunk
https://artifacts.opnfv.org/logs/functest/ericsson-virtual4/hunter/2019-09-17_17-40-57/neutron_trunk/tempest.conf
https://artifacts.opnfv.org/logs/functest/ericsson-virtual4/hunter/2019-09-17_17-40-57/neutron_trunk/tempest-report.html
https://artifacts.opnfv.org/logs/functest/ericsson-virtual4/hunter/2019-09-17_17-40-57/neutron_trunk/rally.conf
https://artifacts.opnfv.org/logs/functest/ericsson-virtual4/hunter/2019-09-17_17-40-57/neutron_trunk/rally.log
https://artifacts.opnfv.org/logs/functest/ericsson-virtual4/hunter/2019-09-17_17-40-57/neutron_trunk/tempest.log
https://artifacts.opnfv.org/logs/functest/ericsson-virtual4/hunter/2019-09-17_17-40-57/neutron_trunk/tempest.debug.log
https://artifacts.opnfv.org/logs/functest/ericsson-virtual4/hunter/2019-09-17_17-40-57/neutron_trunk/test_raw_list.txt
https://artifacts.opnfv.org/logs/functest/ericsson-virtual4/hunter/2019-09-17_17-40-57/neutron_trunk/test_list.txt
https://artifacts.opnfv.org/logs/functest/ericsson-virtual4/hunter/2019-09-17_17-40-57/neutron_trunk/tempest-report.xml
https://artifacts.opnfv.org/logs/functest/ericsson-virtual4/hunter/2019-09-17_17-40-57/networking-bgpvpn
https://artifacts.opnfv.org/logs/functest/ericsson-virtual4/hunter/2019-09-17_17-40-57/networking-bgpvpn/tempest.conf
https://artifacts.opnfv.org/logs/functest/ericsson-virtual4/hunter/2019-09-17_17-40-57/networking-bgpvpn/tempest-report.html
https://artifacts.opnfv.org/logs/functest/ericsson-virtual4/hunter/2019-09-17_17-40-57/networking-bgpvpn/rally.conf
https://artifacts.opnfv.org/logs/functest/ericsson-virtual4/hunter/2019-09-17_17-40-57/networking-bgpvpn/rally.log
https://artifacts.opnfv.org/logs/functest/ericsson-virtual4/hunter/2019-09-17_17-40-57/networking-bgpvpn/tempest.log
https://artifacts.opnfv.org/logs/functest/ericsson-virtual4/hunter/2019-09-17_17-40-57/networking-bgpvpn/tempest.debug.log
https://artifacts.opnfv.org/logs/functest/ericsson-virtual4/hunter/2019-09-17_17-40-57/networking-bgpvpn/test_raw_list.txt
https://artifacts.opnfv.org/logs/functest/ericsson-virtual4/hunter/2019-09-17_17-40-57/networking-bgpvpn/test_list.txt
https://artifacts.opnfv.org/logs/functest/ericsson-virtual4/hunter/2019-09-17_17-40-57/networking-bgpvpn/tempest-report.xml
https://artifacts.opnfv.org/logs/functest/ericsson-virtual4/hunter/2019-09-17_17-40-57/rally_jobs
https://artifacts.opnfv.org/logs/functest/ericsson-virtual4/hunter/2019-09-17_17-40-57/rally_jobs/rally_jobs.html
https://artifacts.opnfv.org/logs/functest/ericsson-virtual4/hunter/2019-09-17_17-40-57/rally_jobs/rally_jobs.xml
https://artifacts.opnfv.org/logs/functest/ericsson-virtual4/hunter/2019-09-17_17-40-57/rally_jobs/rally.log
https://artifacts.opnfv.org/logs/functest/ericsson-virtual4/hunter/2019-09-17_17-40-57/rally_jobs/neutron.json
https://artifacts.opnfv.org/logs/functest/ericsson-virtual4/hunter/2019-09-17_17-40-57/functest.debug.log
https://artifacts.opnfv.org/logs/functest/ericsson-virtual4/hunter/2019-09-17_17-40-57/tempest_scenario
https://artifacts.opnfv.org/logs/functest/ericsson-virtual4/hunter/2019-09-17_17-40-57/tempest_scenario/tempest.conf
https://artifacts.opnfv.org/logs/functest/ericsson-virtual4/hunter/2019-09-17_17-40-57/tempest_scenario/tempest-report.html
https://artifacts.opnfv.org/logs/functest/ericsson-virtual4/hunter/2019-09-17_17-40-57/tempest_scenario/rally.conf
https://artifacts.opnfv.org/logs/functest/ericsson-virtual4/hunter/2019-09-17_17-40-57/tempest_scenario/rally.log
https://artifacts.opnfv.org/logs/functest/ericsson-virtual4/hunter/2019-09-17_17-40-57/tempest_scenario/tempest.log
https://artifacts.opnfv.org/logs/functest/ericsson-virtual4/hunter/2019-09-17_17-40-57/tempest_scenario/tempest.debug.log
https://artifacts.opnfv.org/logs/functest/ericsson-virtual4/hunter/2019-09-17_17-40-57/tempest_scenario/test_raw_list.txt
https://artifacts.opnfv.org/logs/functest/ericsson-virtual4/hunter/2019-09-17_17-40-57/tempest_scenario/test_list.txt
https://artifacts.opnfv.org/logs/functest/ericsson-virtual4/hunter/2019-09-17_17-40-57/tempest_scenario/tempest-report.xml
https://artifacts.opnfv.org/logs/functest/ericsson-virtual4/hunter/2019-09-17_17-40-57/rally_full
https://artifacts.opnfv.org/logs/functest/ericsson-virtual4/hunter/2019-09-17_17-40-57/rally_full/heat.json
https://artifacts.opnfv.org/logs/functest/ericsson-virtual4/hunter/2019-09-17_17-40-57/rally_full/keystone.json
https://artifacts.opnfv.org/logs/functest/ericsson-virtual4/hunter/2019-09-17_17-40-57/rally_full/quotas.json
https://artifacts.opnfv.org/logs/functest/ericsson-virtual4/hunter/2019-09-17_17-40-57/rally_full/cinder.json
https://artifacts.opnfv.org/logs/functest/ericsson-virtual4/hunter/2019-09-17_17-40-57/rally_full/authenticate.json
https://artifacts.opnfv.org/logs/functest/ericsson-virtual4/hunter/2019-09-17_17-40-57/rally_full/gnocchi.json
https://artifacts.opnfv.org/logs/functest/ericsson-virtual4/hunter/2019-09-17_17-40-57/rally_full/rally_full.xml
https://artifacts.opnfv.org/logs/functest/ericsson-virtual4/hunter/2019-09-17_17-40-57/rally_full/rally.log
https://artifacts.opnfv.org/logs/functest/ericsson-virtual4/hunter/2019-09-17_17-40-57/rally_full/glance.json
https://artifacts.opnfv.org/logs/functest/ericsson-virtual4/hunter/2019-09-17_17-40-57/rally_full/neutron.json
https://artifacts.opnfv.org/logs/functest/ericsson-virtual4/hunter/2019-09-17_17-40-57/rally_full/nova.json
https://artifacts.opnfv.org/logs/functest/ericsson-virtual4/hunter/2019-09-17_17-40-57/rally_full/rally_full.html
https://artifacts.opnfv.org/logs/functest/ericsson-virtual4/hunter/2019-09-17_17-40-57/cloudify_ims
https://artifacts.opnfv.org/logs/functest/ericsson-virtual4/hunter/2019-09-17_17-40-57/cloudify_ims/ims_test_output.txt
https://artifacts.opnfv.org/logs/functest/ericsson-virtual4/hunter/2019-09-17_17-40-57/heat_ims
https://artifacts.opnfv.org/logs/functest/ericsson-virtual4/hunter/2019-09-17_17-40-57/heat_ims/ims_test_output.txt
https://artifacts.opnfv.org/logs/functest/ericsson-virtual4/hunter/2019-09-17_17-40-57/shaker
https://artifacts.opnfv.org/logs/functest/ericsson-virtual4/hunter/2019-09-17_17-40-57/tempest_smoke
https://artifacts.opnfv.org/logs/functest/ericsson-virtual4/hunter/2019-09-17_17-40-57/tempest_smoke/tempest.conf
https://artifacts.opnfv.org/logs/functest/ericsson-virtual4/hunter/2019-09-17_17-40-57/tempest_smoke/tempest-report.html
https://artifacts.opnfv.org/logs/functest/ericsson-virtual4/hunter/2019-09-17_17-40-57/tempest_smoke/rally.conf
https://artifacts.opnfv.org/logs/functest/ericsson-virtual4/hunter/2019-09-17_17-40-57/tempest_smoke/rally.log
https://artifacts.opnfv.org/logs/functest/ericsson-virtual4/hunter/2019-09-17_17-40-57/tempest_smoke/tempest.log
https://artifacts.opnfv.org/logs/functest/ericsson-virtual4/hunter/2019-09-17_17-40-57/tempest_smoke/tempest.debug.log
https://artifacts.opnfv.org/logs/functest/ericsson-virtual4/hunter/2019-09-17_17-40-57/tempest_smoke/test_raw_list.txt
https://artifacts.opnfv.org/logs/functest/ericsson-virtual4/hunter/2019-09-17_17-40-57/tempest_smoke/test_list.txt
https://artifacts.opnfv.org/logs/functest/ericsson-virtual4/hunter/2019-09-17_17-40-57/tempest_smoke/tempest-report.xml
https://artifacts.opnfv.org/logs/functest/ericsson-virtual4/hunter/2019-09-17_17-40-57/patrole
https://artifacts.opnfv.org/logs/functest/ericsson-virtual4/hunter/2019-09-17_17-40-57/patrole/tempest.conf
https://artifacts.opnfv.org/logs/functest/ericsson-virtual4/hunter/2019-09-17_17-40-57/patrole/tempest-report.html
https://artifacts.opnfv.org/logs/functest/ericsson-virtual4/hunter/2019-09-17_17-40-57/patrole/rally.conf
https://artifacts.opnfv.org/logs/functest/ericsson-virtual4/hunter/2019-09-17_17-40-57/patrole/rally.log
https://artifacts.opnfv.org/logs/functest/ericsson-virtual4/hunter/2019-09-17_17-40-57/patrole/tempest.log
https://artifacts.opnfv.org/logs/functest/ericsson-virtual4/hunter/2019-09-17_17-40-57/patrole/tempest.debug.log
https://artifacts.opnfv.org/logs/functest/ericsson-virtual4/hunter/2019-09-17_17-40-57/patrole/test_raw_list.txt
https://artifacts.opnfv.org/logs/functest/ericsson-virtual4/hunter/2019-09-17_17-40-57/patrole/test_list.txt
https://artifacts.opnfv.org/logs/functest/ericsson-virtual4/hunter/2019-09-17_17-40-57/patrole/tempest-report.xml
https://artifacts.opnfv.org/logs/functest/ericsson-virtual4/hunter/2019-09-17_17-40-57/return_value
https://artifacts.opnfv.org/logs/functest/ericsson-virtual4/hunter/2019-09-17_17-40-57/vmtp
https://artifacts.opnfv.org/logs/functest/ericsson-virtual4/hunter/2019-09-17_17-40-57/vmtp/vmtp.conf
https://artifacts.opnfv.org/logs/functest/ericsson-virtual4/hunter/2019-09-17_17-40-57/neutron-tempest-plugin-api
https://artifacts.opnfv.org/logs/functest/ericsson-virtual4/hunter/2019-09-17_17-40-57/neutron-tempest-plugin-api/tempest.conf
https://artifacts.opnfv.org/logs/functest/ericsson-virtual4/hunter/2019-09-17_17-40-57/neutron-tempest-plugin-api/tempest-report.html
https://artifacts.opnfv.org/logs/functest/ericsson-virtual4/hunter/2019-09-17_17-40-57/neutron-tempest-plugin-api/rally.conf
https://artifacts.opnfv.org/logs/functest/ericsson-virtual4/hunter/2019-09-17_17-40-57/neutron-tempest-plugin-api/rally.log
https://artifacts.opnfv.org/logs/functest/ericsson-virtual4/hunter/2019-09-17_17-40-57/neutron-tempest-plugin-api/tempest.log
https://artifacts.opnfv.org/logs/functest/ericsson-virtual4/hunter/2019-09-17_17-40-57/neutron-tempest-plugin-api/tempest.debug.log
https://artifacts.opnfv.org/logs/functest/ericsson-virtual4/hunter/2019-09-17_17-40-57/neutron-tempest-plugin-api/test_raw_list.txt
https://artifacts.opnfv.org/logs/functest/ericsson-virtual4/hunter/2019-09-17_17-40-57/neutron-tempest-plugin-api/test_list.txt
https://artifacts.opnfv.org/logs/functest/ericsson-virtual4/hunter/2019-09-17_17-40-57/neutron-tempest-plugin-api/tempest-report.xml
https://artifacts.opnfv.org/logs/functest/ericsson-virtual4/hunter/2019-09-17_17-40-57/odl
https://artifacts.opnfv.org/logs/functest/ericsson-virtual4/hunter/2019-09-17_17-40-57/odl/xunit.xml
https://artifacts.opnfv.org/logs/functest/ericsson-virtual4/hunter/2019-09-17_17-40-57/odl/output.xml
https://artifacts.opnfv.org/logs/functest/ericsson-virtual4/hunter/2019-09-17_17-40-57/odl/log.html
https://artifacts.opnfv.org/logs/functest/ericsson-virtual4/hunter/2019-09-17_17-40-57/odl/report.html
[functest-fuel-virtual-daily-hunter] $ /bin/bash /tmp/jenkins4943516190960368284.sh
Build step 'Execute shell' marked build as failure
New run name is '787 Suite: daily Scenario: os-odl-bgpvpn-noha'
Email was triggered for: Failure - Any
Sending email for trigger: Failure - Any
Request made to compress build log
Sending email to: tbramwell@linuxfoundation.org agardner@linuxfoundation.org rgrigar@linuxfoundation.org
Finished: FAILURE