AbortedConsole Output

Started by upstream project "fuel-os-odl-nofeature-noha-virtual-daily-hunter" build number 147
originally caused by:
 Started by timer
Running as SYSTEM
[EnvInject] - Loading node environment variables.
Building remotely on ericsson-virtual3 (fuel-virtual ci-resource opnfv-sysinfo) in workspace /home/jenkins/opnfv/slave_root/workspace/functest-fuel-virtual-daily-hunter
using credential d42411ac011ad6f3dd2e1fa34eaa5d87f910eb2e
Wiping out workspace first.
Cloning the remote Git repository
Cloning repository https://gerrit.opnfv.org/gerrit/functest
 > git init /home/jenkins/opnfv/slave_root/workspace/functest-fuel-virtual-daily-hunter # timeout=10
Fetching upstream changes from https://gerrit.opnfv.org/gerrit/functest
 > git --version # timeout=10
using GIT_SSH to set credentials Jenkins Master SSH
 > git fetch --tags --progress https://gerrit.opnfv.org/gerrit/functest +refs/heads/*:refs/remotes/origin/* # timeout=15
 > git config remote.origin.url https://gerrit.opnfv.org/gerrit/functest # timeout=10
 > git config --add remote.origin.fetch +refs/heads/*:refs/remotes/origin/* # timeout=10
 > git config remote.origin.url https://gerrit.opnfv.org/gerrit/functest # timeout=10
Fetching upstream changes from https://gerrit.opnfv.org/gerrit/functest
using GIT_SSH to set credentials Jenkins Master SSH
 > git fetch --tags --progress https://gerrit.opnfv.org/gerrit/functest +refs/heads/*:refs/remotes/origin/* # timeout=15
 > git rev-parse refs/remotes/origin/stable/hunter^{commit} # timeout=10
 > git rev-parse refs/remotes/origin/origin/stable/hunter^{commit} # timeout=10
Checking out Revision 06f3e7837cd0a3374c701e4f3c54718a8bed8818 (refs/remotes/origin/stable/hunter)
 > git config core.sparsecheckout # timeout=10
 > git checkout -f 06f3e7837cd0a3374c701e4f3c54718a8bed8818 # timeout=15
Commit message: "Harden OS_ env vars for VMTP"
 > git rev-list --no-walk 06f3e7837cd0a3374c701e4f3c54718a8bed8818 # timeout=10
Run condition [Regular expression match] enabling prebuild for step [Execute shell]
Run condition [Regular expression match] enabling prebuild for step [Execute shell]
No emails were triggered.
New run name is '784 Suite: daily Scenario: os-odl-nofeature-noha'
[description-setter] Description set: Built on ericsson-virtual3
[functest-fuel-virtual-daily-hunter] $ /bin/bash /tmp/jenkins5781867480543233823.sh
Cleaning up docker containers/images...
Regular expression run condition: Expression=[os-.*], Label=[os-odl-nofeature-noha]
Run condition [Regular expression match] enabling perform for step [Execute shell]
[functest-fuel-virtual-daily-hunter] $ /usr/bin/env bash /tmp/jenkins8706296844953344579.sh
Map mcp ssh_key
<13>Sep 16 23:20:06 fetch_os_creds.info: Fetching rc file...
<13>Sep 16 23:20:06 fetch_os_creds.info: Verifying connectivity to 10.20.0.2...
<13>Sep 16 23:20:06 fetch_os_creds.info: 10.20.0.2 is reachable!
<13>Sep 16 23:20:07 fetch_os_creds.info: ... from controller 172.16.10.36 ...
Warning: Permanently added '172.16.10.36' (ECDSA) to the list of known hosts.
-------- Credentials: --------

export OS_IDENTITY_API_VERSION=3
export OS_PROJECT_DOMAIN_NAME=Default
export OS_USER_DOMAIN_NAME=Default
export OS_PROJECT_NAME=admin
export OS_TENANT_NAME=admin
export OS_USERNAME=admin
export OS_PASSWORD=opnfv_secret
export OS_REGION_NAME=RegionOne
export OS_INTERFACE=internal
export OS_ENDPOINT_TYPE="internal"
export OS_CACERT="/etc/ssl/certs/ca-certificates.crt"
export SDN_CONTROLLER_USER=admin
export SDN_CONTROLLER_RESTCONFPORT=8282
export SDN_CONTROLLER_PASSWORD=admin
export SDN_CONTROLLER_WEBPORT=8282
export SDN_CONTROLLER_IP=10.16.0.107
export VOLUME_DEVICE_NAME=sdc
export OS_AUTH_URL=http://172.16.10.36:35357/v3
Functest: Start Docker and prepare environment
Functest: Download images that will be used by test cases
+ wget_opts='-N --tries=1 --connect-timeout=30'
+ '[' -t 1 ']'
+ wget_opts='-N --tries=1 --connect-timeout=30 --progress=dot:giga'
+ cat
+ wget -N --tries=1 --connect-timeout=30 --progress=dot:giga -i - -P /home/jenkins/opnfv/functest/images
--2019-09-16 23:20:07--  http://download.cirros-cloud.net/0.4.0/cirros-0.4.0-x86_64-disk.img
Resolving download.cirros-cloud.net (download.cirros-cloud.net)... 64.90.42.85, 2607:f298:6:a036::bd6:a72a
Connecting to download.cirros-cloud.net (download.cirros-cloud.net)|64.90.42.85|:80... connected.
HTTP request sent, awaiting response... 304 Not Modified
File ‘/home/jenkins/opnfv/functest/images/cirros-0.4.0-x86_64-disk.img’ not modified on server. Omitting download.

--2019-09-16 23:20:08--  https://cloud-images.ubuntu.com/releases/14.04/release/ubuntu-14.04-server-cloudimg-amd64-disk1.img
Resolving cloud-images.ubuntu.com (cloud-images.ubuntu.com)... 91.189.88.89, 2001:67c:1560:8001::8001
Connecting to cloud-images.ubuntu.com (cloud-images.ubuntu.com)|91.189.88.89|:443... connected.
HTTP request sent, awaiting response... 302 Found
Location: https://cloud-images.ubuntu.com/releases/trusty/release/ubuntu-14.04-server-cloudimg-amd64-disk1.img [following]
--2019-09-16 23:20:08--  https://cloud-images.ubuntu.com/releases/trusty/release/ubuntu-14.04-server-cloudimg-amd64-disk1.img
Reusing existing connection to cloud-images.ubuntu.com:443.
HTTP request sent, awaiting response... 304 Not Modified
File ‘/home/jenkins/opnfv/functest/images/ubuntu-14.04-server-cloudimg-amd64-disk1.img’ not modified on server. Omitting download.

--2019-09-16 23:20:08--  https://cloud-images.ubuntu.com/releases/16.04/release/ubuntu-16.04-server-cloudimg-amd64-disk1.img
Reusing existing connection to cloud-images.ubuntu.com:443.
HTTP request sent, awaiting response... 302 Found
Location: https://cloud-images.ubuntu.com/releases/xenial/release/ubuntu-16.04-server-cloudimg-amd64-disk1.img [following]
--2019-09-16 23:20:08--  https://cloud-images.ubuntu.com/releases/xenial/release/ubuntu-16.04-server-cloudimg-amd64-disk1.img
Reusing existing connection to cloud-images.ubuntu.com:443.
HTTP request sent, awaiting response... 304 Not Modified
File ‘/home/jenkins/opnfv/functest/images/ubuntu-16.04-server-cloudimg-amd64-disk1.img’ not modified on server. Omitting download.

--2019-09-16 23:20:08--  http://download.cirros-cloud.net/0.4.0/cirros-0.4.0-aarch64-disk.img
Connecting to download.cirros-cloud.net (download.cirros-cloud.net)|64.90.42.85|:80... connected.
HTTP request sent, awaiting response... 304 Not Modified
File ‘/home/jenkins/opnfv/functest/images/cirros-0.4.0-aarch64-disk.img’ not modified on server. Omitting download.

--2019-09-16 23:20:08--  https://cloud-images.ubuntu.com/releases/14.04/release/ubuntu-14.04-server-cloudimg-arm64-uefi1.img
Connecting to cloud-images.ubuntu.com (cloud-images.ubuntu.com)|91.189.88.89|:443... connected.
HTTP request sent, awaiting response... 302 Found
Location: https://cloud-images.ubuntu.com/releases/trusty/release/ubuntu-14.04-server-cloudimg-arm64-uefi1.img [following]
--2019-09-16 23:20:09--  https://cloud-images.ubuntu.com/releases/trusty/release/ubuntu-14.04-server-cloudimg-arm64-uefi1.img
Reusing existing connection to cloud-images.ubuntu.com:443.
HTTP request sent, awaiting response... 304 Not Modified
File ‘/home/jenkins/opnfv/functest/images/ubuntu-14.04-server-cloudimg-arm64-uefi1.img’ not modified on server. Omitting download.

--2019-09-16 23:20:09--  http://repository.cloudifysource.org/cloudify/19.01.24/community-release/cloudify-docker-manager-community-19.01.24.tar
Resolving repository.cloudifysource.org (repository.cloudifysource.org)... 52.84.214.18, 52.84.214.55, 52.84.214.47, ...
Connecting to repository.cloudifysource.org (repository.cloudifysource.org)|52.84.214.18|:80... connected.
HTTP request sent, awaiting response... 304 Not Modified
File ‘/home/jenkins/opnfv/functest/images/cloudify-docker-manager-community-19.01.24.tar’ not modified on server. Omitting download.

--2019-09-16 23:20:09--  http://testresults.opnfv.org/functest/vyos-1.1.8-amd64.qcow2
Resolving testresults.opnfv.org (testresults.opnfv.org)... 104.154.71.112
Connecting to testresults.opnfv.org (testresults.opnfv.org)|104.154.71.112|:80... connected.
HTTP request sent, awaiting response... 304 Not Modified
File ‘/home/jenkins/opnfv/functest/images/vyos-1.1.8-amd64.qcow2’ not modified on server. Omitting download.

--2019-09-16 23:20:09--  http://testresults.opnfv.org/functest/shaker-image.qcow2
Reusing existing connection to testresults.opnfv.org:80.
HTTP request sent, awaiting response... 304 Not Modified
File ‘/home/jenkins/opnfv/functest/images/shaker-image.qcow2’ not modified on server. Omitting download.

--2019-09-16 23:20:09--  http://testresults.opnfv.org/functest/shaker-image-arm64.qcow2
Reusing existing connection to testresults.opnfv.org:80.
HTTP request sent, awaiting response... 304 Not Modified
File ‘/home/jenkins/opnfv/functest/images/shaker-image-arm64.qcow2’ not modified on server. Omitting download.

Warning: Permanently added '10.20.0.2' (ECDSA) to the list of known hosts.
tempest_conf.yaml:
---
compute-feature-enabled:
    shelve: false
    vnc_console: false
    spice_console: true
identity-feature-enabled:
    api_v2: false
    api_v2_admin: false
image-feature-enabled:
    api_v2: true
    api_v1: false
volume:
    storage_protocol: iSCSI
volume-feature-enabled:
    backup: false
compute:
    max_microversion: 2.65
Functest: Pulling Functest Docker image opnfv/functest-healthcheck:hunter ...
Running Functest tier 'healthcheck'. CMD: docker run --rm  -e INSTALLER_TYPE=fuel -e INSTALLER_IP=10.20.0.2     -e NODE_NAME=ericsson-virtual3 -e DEPLOY_SCENARIO=os-odl-nofeature-noha     -e BUILD_TAG=jenkins-functest-fuel-virtual-daily-hunter-784 -e DEPLOY_TYPE=virt -e CI_LOOP=daily     -e TEST_DB_URL=http://testresults.opnfv.org/test/api/v1/results -e ENERGY_RECORDER_API_URL=http://energy.opnfv.fr/resources     -e DEBUG=true -e POD_ARCH=x86_64 -e BLOCK_MIGRATION=false -e SDN_CONTROLLER_RESTCONFPORT=8080 -e IMAGE_PROPERTIES=hw_disk_bus:scsi,hw_scsi_model:virtio-scsi -e FLAVOR_EXTRA_SPECS= -v /home/jenkins/opnfv/functest/images:/home/opnfv/functest/images -v /home/jenkins/opnfv/functest/results/hunter:/home/opnfv/functest/results -v /var/lib/opnfv/mcp.rsa:/root/.ssh/id_rsa       -v /home/jenkins/opnfv-openrc.sh:/home/opnfv/functest/conf/env_file      -v /tmp/tmp.qsVjJElXPK:/usr/lib/python2.7/site-packages/functest/opnfv_tests/openstack/tempest/custom_tests/tempest_conf.yaml  opnfv/functest-healthcheck:hunter /bin/bash -c 'run_tests -r -t all'
2019-09-16 21:20:14,177 - xtesting.ci.run_tests - INFO - Deployment description:

+--------------------------------------+----------------------------------------------------------+
|               ENV VAR                |                          VALUE                           |
+--------------------------------------+----------------------------------------------------------+
|              BUILD_TAG               |      jenkins-functest-fuel-virtual-daily-hunter-784      |
|             TEST_DB_URL              |     http://testresults.opnfv.org/test/api/v1/results     |
|     ENERGY_RECORDER_API_PASSWORD     |                                                          |
|               CI_LOOP                |                          daily                           |
|                DEBUG                 |                           true                           |
|            INSTALLER_TYPE            |                           fuel                           |
|       ENERGY_RECORDER_API_URL        |             http://energy.opnfv.fr/resources             |
|           DEPLOY_SCENARIO            |                  os-odl-nofeature-noha                   |
|       ENERGY_RECORDER_API_USER       |                                                          |
|              NODE_NAME               |                    ericsson-virtual3                     |
+--------------------------------------+----------------------------------------------------------+

2019-09-16 21:20:14,182 - xtesting.ci.run_tests - INFO - Sourcing env file /var/lib/xtesting/conf/env_file


export OS_IDENTITY_API_VERSION=3
export OS_PROJECT_DOMAIN_NAME=Default
export OS_USER_DOMAIN_NAME=Default
export OS_PROJECT_NAME=admin
export OS_TENANT_NAME=admin
export OS_USERNAME=admin
export OS_PASSWORD=opnfv_secret
export OS_REGION_NAME=RegionOne
export OS_INTERFACE=internal
export OS_ENDPOINT_TYPE="internal"
export OS_CACERT="/etc/ssl/certs/ca-certificates.crt"
export SDN_CONTROLLER_USER=admin
export SDN_CONTROLLER_RESTCONFPORT=8282
export SDN_CONTROLLER_PASSWORD=admin
export SDN_CONTROLLER_WEBPORT=8282
export SDN_CONTROLLER_IP=10.16.0.107
export VOLUME_DEVICE_NAME=sdc
export OS_AUTH_URL=http://172.16.10.36:35357/v3

2019-09-16 21:20:14,183 - xtesting.ci.run_tests - INFO - TESTS TO BE EXECUTED:

+---------------------+---------------+-------------------------------------------------+------------------------------------------+
|        TIERS        |     ORDER     |                   DESCRIPTION                   |                TESTCASES                 |
+---------------------+---------------+-------------------------------------------------+------------------------------------------+
|     healthcheck     |       0       |     First tier to be executed to verify the     |     connection_check tenantnetwork1      |
|                     |               |           basic operations in the VIM.          |     tenantnetwork2 vmready1 vmready2     |
|                     |               |                                                 |      singlevm1 singlevm2 vping_ssh       |
|                     |               |                                                 |      vping_userdata cinder_test odl      |
|                     |               |                                                 |              tempest_smoke               |
+---------------------+---------------+-------------------------------------------------+------------------------------------------+

2019-09-16 21:20:14,213 - xtesting.ci.run_tests - INFO - Loading test case 'connection_check'...
2019-09-16 21:20:14,666 - xtesting.ci.run_tests - INFO - Running test case 'connection_check'...
2019-09-16 21:20:18,953 - xtesting.core.testcase - INFO - The results were successfully pushed to DB
2019-09-16 21:20:18,954 - xtesting.ci.run_tests - INFO - Test result:

+--------------------------+------------------+------------------+----------------+
|        TEST CASE         |     PROJECT      |     DURATION     |     RESULT     |
+--------------------------+------------------+------------------+----------------+
|     connection_check     |     functest     |      00:04       |      PASS      |
+--------------------------+------------------+------------------+----------------+

2019-09-16 21:20:19,022 - xtesting.ci.run_tests - INFO - Loading test case 'tenantnetwork1'...
2019-09-16 21:20:19,843 - xtesting.ci.run_tests - INFO - Running test case 'tenantnetwork1'...
2019-09-16 21:20:25,573 - xtesting.core.testcase - INFO - The results were successfully pushed to DB
2019-09-16 21:20:25,573 - xtesting.ci.run_tests - INFO - Test result:

+------------------------+------------------+------------------+----------------+
|       TEST CASE        |     PROJECT      |     DURATION     |     RESULT     |
+------------------------+------------------+------------------+----------------+
|     tenantnetwork1     |     functest     |      00:05       |      PASS      |
+------------------------+------------------+------------------+----------------+

2019-09-16 21:20:33,778 - xtesting.ci.run_tests - INFO - Loading test case 'tenantnetwork2'...
2019-09-16 21:20:37,397 - xtesting.ci.run_tests - INFO - Running test case 'tenantnetwork2'...
2019-09-16 21:20:44,397 - xtesting.core.testcase - INFO - The results were successfully pushed to DB
2019-09-16 21:20:44,397 - xtesting.ci.run_tests - INFO - Test result:

+------------------------+------------------+------------------+----------------+
|       TEST CASE        |     PROJECT      |     DURATION     |     RESULT     |
+------------------------+------------------+------------------+----------------+
|     tenantnetwork2     |     functest     |      00:07       |      PASS      |
+------------------------+------------------+------------------+----------------+

2019-09-16 21:20:54,407 - xtesting.ci.run_tests - INFO - Loading test case 'vmready1'...
2019-09-16 21:20:55,712 - xtesting.ci.run_tests - INFO - Running test case 'vmready1'...
2019-09-16 21:21:03,386 - xtesting.core.testcase - INFO - The results were successfully pushed to DB
2019-09-16 21:21:03,386 - xtesting.ci.run_tests - INFO - Test result:

+-------------------+------------------+------------------+----------------+
|     TEST CASE     |     PROJECT      |     DURATION     |     RESULT     |
+-------------------+------------------+------------------+----------------+
|      vmready1     |     functest     |      00:07       |      PASS      |
+-------------------+------------------+------------------+----------------+

2019-09-16 21:21:11,974 - xtesting.ci.run_tests - INFO - Loading test case 'vmready2'...
2019-09-16 21:21:13,990 - xtesting.ci.run_tests - INFO - Running test case 'vmready2'...
2019-09-16 21:21:21,852 - xtesting.core.testcase - INFO - The results were successfully pushed to DB
2019-09-16 21:21:21,852 - xtesting.ci.run_tests - INFO - Test result:

+-------------------+------------------+------------------+----------------+
|     TEST CASE     |     PROJECT      |     DURATION     |     RESULT     |
+-------------------+------------------+------------------+----------------+
|      vmready2     |     functest     |      00:08       |      PASS      |
+-------------------+------------------+------------------+----------------+

2019-09-16 21:21:31,923 - xtesting.ci.run_tests - INFO - Loading test case 'singlevm1'...
2019-09-16 21:21:32,751 - xtesting.ci.run_tests - INFO - Running test case 'singlevm1'...
2019-09-16 21:22:09,437 - xtesting.core.testcase - INFO - The results were successfully pushed to DB
2019-09-16 21:22:09,437 - xtesting.ci.run_tests - INFO - Test result:

+-------------------+------------------+------------------+----------------+
|     TEST CASE     |     PROJECT      |     DURATION     |     RESULT     |
+-------------------+------------------+------------------+----------------+
|     singlevm1     |     functest     |      00:36       |      PASS      |
+-------------------+------------------+------------------+----------------+

2019-09-16 21:22:23,136 - xtesting.ci.run_tests - INFO - Loading test case 'singlevm2'...
2019-09-16 21:22:25,346 - xtesting.ci.run_tests - INFO - Running test case 'singlevm2'...
2019-09-16 21:23:00,223 - xtesting.core.testcase - INFO - The results were successfully pushed to DB
2019-09-16 21:23:00,223 - xtesting.ci.run_tests - INFO - Test result:

+-------------------+------------------+------------------+----------------+
|     TEST CASE     |     PROJECT      |     DURATION     |     RESULT     |
+-------------------+------------------+------------------+----------------+
|     singlevm2     |     functest     |      00:35       |      PASS      |
+-------------------+------------------+------------------+----------------+

2019-09-16 21:23:14,407 - xtesting.ci.run_tests - INFO - Loading test case 'vping_ssh'...
2019-09-16 21:23:16,452 - xtesting.ci.run_tests - INFO - Running test case 'vping_ssh'...
2019-09-16 21:24:00,309 - xtesting.core.testcase - INFO - The results were successfully pushed to DB
2019-09-16 21:24:00,310 - xtesting.ci.run_tests - INFO - Test result:

+-------------------+------------------+------------------+----------------+
|     TEST CASE     |     PROJECT      |     DURATION     |     RESULT     |
+-------------------+------------------+------------------+----------------+
|     vping_ssh     |     functest     |      00:44       |      PASS      |
+-------------------+------------------+------------------+----------------+

2019-09-16 21:24:17,849 - xtesting.ci.run_tests - INFO - Loading test case 'vping_userdata'...
2019-09-16 21:24:20,044 - xtesting.ci.run_tests - INFO - Running test case 'vping_userdata'...
2019-09-16 21:24:56,792 - xtesting.core.testcase - INFO - The results were successfully pushed to DB
2019-09-16 21:24:56,793 - xtesting.ci.run_tests - INFO - Test result:

+------------------------+------------------+------------------+----------------+
|       TEST CASE        |     PROJECT      |     DURATION     |     RESULT     |
+------------------------+------------------+------------------+----------------+
|     vping_userdata     |     functest     |      00:36       |      PASS      |
+------------------------+------------------+------------------+----------------+

2019-09-16 21:25:12,661 - xtesting.ci.run_tests - INFO - Loading test case 'cinder_test'...
2019-09-16 21:25:14,868 - xtesting.ci.run_tests - INFO - Running test case 'cinder_test'...
2019-09-16 21:27:01,958 - xtesting.core.testcase - INFO - The results were successfully pushed to DB
2019-09-16 21:27:01,958 - xtesting.ci.run_tests - INFO - Test result:

+---------------------+------------------+------------------+----------------+
|      TEST CASE      |     PROJECT      |     DURATION     |     RESULT     |
+---------------------+------------------+------------------+----------------+
|     cinder_test     |     functest     |      01:47       |      PASS      |
+---------------------+------------------+------------------+----------------+

2019-09-16 21:27:25,626 - xtesting.ci.run_tests - INFO - Loading test case 'odl'...
2019-09-16 21:27:25,857 - xtesting.ci.run_tests - INFO - Running test case 'odl'...
[ WARN ] Deprecation Warning: Use Post Request in the future
2019-09-16 21:27:45,840 - xtesting.core.robotframework - INFO - 
==============================================================================
Basic & Neutron                                                               
==============================================================================
Basic & Neutron.Basic                                                         
==============================================================================
Basic & Neutron.Basic.Restconf Modules :: Test suite to verify Restconf is OK.
==============================================================================
Get Controller Modules :: Get the restconf modules, check 200 stat... | PASS |
------------------------------------------------------------------------------
Basic & Neutron.Basic.Restconf Modules :: Test suite to verify Res... | PASS |
1 critical test, 1 passed, 0 failed
1 test total, 1 passed, 0 failed
==============================================================================
Basic & Neutron.Basic                                                 | PASS |
1 critical test, 1 passed, 0 failed
1 test total, 1 passed, 0 failed
==============================================================================
Basic & Neutron.Neutron :: Test suite for Neutron Plugin                      
==============================================================================
Basic & Neutron.Neutron.Reachability                                          
==============================================================================
Get the complete list of networks :: Get the complete list of netw... | PASS |
------------------------------------------------------------------------------
Get the complete list of subnets :: Get the complete list of subnets  | PASS |
------------------------------------------------------------------------------
Get the complete list of ports :: Get the complete list of ports      | PASS |
------------------------------------------------------------------------------
Basic & Neutron.Neutron.Reachability                                  | PASS |
3 critical tests, 3 passed, 0 failed
3 tests total, 3 passed, 0 failed
==============================================================================
Basic & Neutron.Neutron.Networks :: Checking Network created in OpenStack a...
==============================================================================
Check OpenStack Networks :: Checking OpenStack Neutron for known n... | PASS |
------------------------------------------------------------------------------
Check OpenDaylight Networks :: Checking OpenDaylight Neutron API f... | PASS |
------------------------------------------------------------------------------
Create Network :: Create new network in OpenStack                     | PASS |
------------------------------------------------------------------------------
Check Network :: Check network created in OpenDaylight                | PASS |
------------------------------------------------------------------------------
Basic & Neutron.Neutron.Networks :: Checking Network created in Op... | PASS |
4 critical tests, 4 passed, 0 failed
4 tests total, 4 passed, 0 failed
==============================================================================
Basic & Neutron.Neutron.Subnets :: Checking Subnets created in OpenStack ar...
==============================================================================
Check OpenStack Subnets :: Checking OpenStack Neutron for known su... | PASS |
------------------------------------------------------------------------------
Check OpenDaylight subnets :: Checking OpenDaylight Neutron API fo... | PASS |
------------------------------------------------------------------------------
Create New subnet :: Create new subnet in OpenStack                   | PASS |
------------------------------------------------------------------------------
Check New subnet :: Check new subnet created in OpenDaylight          | PASS |
------------------------------------------------------------------------------
Basic & Neutron.Neutron.Subnets :: Checking Subnets created in Ope... | PASS |
4 critical tests, 4 passed, 0 failed
4 tests total, 4 passed, 0 failed
==============================================================================
Basic & Neutron.Neutron.Ports :: Checking Port created in OpenStack are pus...
==============================================================================
Check OpenStack ports :: Checking OpenStack Neutron for known ports   | PASS |
------------------------------------------------------------------------------
Check OpenDaylight ports :: Checking OpenDaylight Neutron API for ... | PASS |
------------------------------------------------------------------------------
Create New Port :: Create new port in OpenStack                       | PASS |
------------------------------------------------------------------------------
Check New Port :: Check new port created in OpenDaylight              | PASS |
------------------------------------------------------------------------------
Basic & Neutron.Neutron.Ports :: Checking Port created in OpenStac... | PASS |
4 critical tests, 4 passed, 0 failed
4 tests total, 4 passed, 0 failed
==============================================================================
Basic & Neutron.Neutron.Delete Ports :: Checking Port deleted in OpenStack ...
==============================================================================
Delete New Port :: Delete previously created port in OpenStack        | PASS |
------------------------------------------------------------------------------
Check Port Deleted :: Check port deleted in OpenDaylight              | PASS |
------------------------------------------------------------------------------
Basic & Neutron.Neutron.Delete Ports :: Checking Port deleted in O... | PASS |
2 critical tests, 2 passed, 0 failed
2 tests total, 2 passed, 0 failed
==============================================================================
Basic & Neutron.Neutron.Delete Subnets :: Checking Subnets deleted in OpenS...
==============================================================================
Delete New subnet :: Delete previously created subnet in OpenStack    | PASS |
------------------------------------------------------------------------------
Check New subnet deleted :: Check subnet deleted in OpenDaylight      | PASS |
------------------------------------------------------------------------------
Basic & Neutron.Neutron.Delete Subnets :: Checking Subnets deleted... | PASS |
2 critical tests, 2 passed, 0 failed
2 tests total, 2 passed, 0 failed
==============================================================================
Basic & Neutron.Neutron.Delete Networks :: Checking Network deleted in Open...
==============================================================================
Delete Network :: Delete network in OpenStack                         | PASS |
------------------------------------------------------------------------------
Check Network deleted :: Check network deleted in OpenDaylight        | PASS |
------------------------------------------------------------------------------
Basic & Neutron.Neutron.Delete Networks :: Checking Network delete... | PASS |
2 critical tests, 2 passed, 0 failed
2 tests total, 2 passed, 0 failed
==============================================================================
Basic & Neutron.Neutron :: Test suite for Neutron Plugin              | PASS |
21 critical tests, 21 passed, 0 failed
21 tests total, 21 passed, 0 failed
==============================================================================
Basic & Neutron                                                       | PASS |
22 critical tests, 22 passed, 0 failed
22 tests total, 22 passed, 0 failed
==============================================================================
Output:  /home/opnfv/functest/results/odl/output.xml

2019-09-16 21:27:45,885 - xtesting.core.robotframework - INFO - Results were successfully parsed
2019-09-16 21:27:46,071 - xtesting.core.robotframework - INFO - Results were successfully generated
2019-09-16 21:27:46,352 - xtesting.core.testcase - INFO - The results were successfully pushed to DB
2019-09-16 21:27:46,352 - xtesting.ci.run_tests - INFO - Test result:

+-------------------+------------------+------------------+----------------+
|     TEST CASE     |     PROJECT      |     DURATION     |     RESULT     |
+-------------------+------------------+------------------+----------------+
|        odl        |     functest     |      00:19       |      PASS      |
+-------------------+------------------+------------------+----------------+

2019-09-16 21:27:46,393 - xtesting.ci.run_tests - INFO - Loading test case 'tempest_smoke'...
2019-09-16 21:27:49,822 - xtesting.ci.run_tests - INFO - Running test case 'tempest_smoke'...
2019-09-16 21:32:30,325 - xtesting.core.testcase - INFO - The results were successfully pushed to DB
2019-09-16 21:32:30,325 - xtesting.ci.run_tests - INFO - Test result:

+-----------------------+------------------+------------------+----------------+
|       TEST CASE       |     PROJECT      |     DURATION     |     RESULT     |
+-----------------------+------------------+------------------+----------------+
|     tempest_smoke     |     functest     |      04:40       |      PASS      |
+-----------------------+------------------+------------------+----------------+

2019-09-16 21:32:40,459 - xtesting.ci.run_tests - INFO - Xtesting report:

+--------------------------+------------------+---------------------+------------------+----------------+
|        TEST CASE         |     PROJECT      |         TIER        |     DURATION     |     RESULT     |
+--------------------------+------------------+---------------------+------------------+----------------+
|     connection_check     |     functest     |     healthcheck     |      00:04       |      PASS      |
|      tenantnetwork1      |     functest     |     healthcheck     |      00:05       |      PASS      |
|      tenantnetwork2      |     functest     |     healthcheck     |      00:07       |      PASS      |
|         vmready1         |     functest     |     healthcheck     |      00:07       |      PASS      |
|         vmready2         |     functest     |     healthcheck     |      00:08       |      PASS      |
|        singlevm1         |     functest     |     healthcheck     |      00:36       |      PASS      |
|        singlevm2         |     functest     |     healthcheck     |      00:35       |      PASS      |
|        vping_ssh         |     functest     |     healthcheck     |      00:44       |      PASS      |
|      vping_userdata      |     functest     |     healthcheck     |      00:36       |      PASS      |
|       cinder_test        |     functest     |     healthcheck     |      01:47       |      PASS      |
|           odl            |     functest     |     healthcheck     |      00:19       |      PASS      |
|      tempest_smoke       |     functest     |     healthcheck     |      04:40       |      PASS      |
+--------------------------+------------------+---------------------+------------------+----------------+

2019-09-16 21:32:40,468 - xtesting.ci.run_tests - INFO - Execution exit value: Result.EX_OK
Functest: Pulling Functest Docker image opnfv/functest-smoke:hunter ...
Running Functest tier 'smoke'. CMD: docker run --rm  -e INSTALLER_TYPE=fuel -e INSTALLER_IP=10.20.0.2     -e NODE_NAME=ericsson-virtual3 -e DEPLOY_SCENARIO=os-odl-nofeature-noha     -e BUILD_TAG=jenkins-functest-fuel-virtual-daily-hunter-784 -e DEPLOY_TYPE=virt -e CI_LOOP=daily     -e TEST_DB_URL=http://testresults.opnfv.org/test/api/v1/results -e ENERGY_RECORDER_API_URL=http://energy.opnfv.fr/resources     -e DEBUG=true -e POD_ARCH=x86_64 -e BLOCK_MIGRATION=false -e SDN_CONTROLLER_RESTCONFPORT=8080 -e IMAGE_PROPERTIES=hw_disk_bus:scsi,hw_scsi_model:virtio-scsi -e FLAVOR_EXTRA_SPECS= -v /home/jenkins/opnfv/functest/images:/home/opnfv/functest/images -v /home/jenkins/opnfv/functest/results/hunter:/home/opnfv/functest/results -v /var/lib/opnfv/mcp.rsa:/root/.ssh/id_rsa       -v /home/jenkins/opnfv-openrc.sh:/home/opnfv/functest/conf/env_file      -v /tmp/tmp.qsVjJElXPK:/usr/lib/python2.7/site-packages/functest/opnfv_tests/openstack/tempest/custom_tests/tempest_conf.yaml  opnfv/functest-smoke:hunter /bin/bash -c 'run_tests -r -t all'
2019-09-16 21:32:44,876 - xtesting.ci.run_tests - INFO - Deployment description:

+--------------------------------------+----------------------------------------------------------+
|               ENV VAR                |                          VALUE                           |
+--------------------------------------+----------------------------------------------------------+
|              BUILD_TAG               |      jenkins-functest-fuel-virtual-daily-hunter-784      |
|             TEST_DB_URL              |     http://testresults.opnfv.org/test/api/v1/results     |
|     ENERGY_RECORDER_API_PASSWORD     |                                                          |
|               CI_LOOP                |                          daily                           |
|                DEBUG                 |                           true                           |
|            INSTALLER_TYPE            |                           fuel                           |
|       ENERGY_RECORDER_API_URL        |             http://energy.opnfv.fr/resources             |
|           DEPLOY_SCENARIO            |                  os-odl-nofeature-noha                   |
|       ENERGY_RECORDER_API_USER       |                                                          |
|              NODE_NAME               |                    ericsson-virtual3                     |
+--------------------------------------+----------------------------------------------------------+

2019-09-16 21:32:44,881 - xtesting.ci.run_tests - INFO - Sourcing env file /var/lib/xtesting/conf/env_file


export OS_IDENTITY_API_VERSION=3
export OS_PROJECT_DOMAIN_NAME=Default
export OS_USER_DOMAIN_NAME=Default
export OS_PROJECT_NAME=admin
export OS_TENANT_NAME=admin
export OS_USERNAME=admin
export OS_PASSWORD=opnfv_secret
export OS_REGION_NAME=RegionOne
export OS_INTERFACE=internal
export OS_ENDPOINT_TYPE="internal"
export OS_CACERT="/etc/ssl/certs/ca-certificates.crt"
export SDN_CONTROLLER_USER=admin
export SDN_CONTROLLER_RESTCONFPORT=8282
export SDN_CONTROLLER_PASSWORD=admin
export SDN_CONTROLLER_WEBPORT=8282
export SDN_CONTROLLER_IP=10.16.0.107
export VOLUME_DEVICE_NAME=sdc
export OS_AUTH_URL=http://172.16.10.36:35357/v3

2019-09-16 21:32:44,882 - xtesting.ci.run_tests - INFO - TESTS TO BE EXECUTED:

+---------------+---------------+------------------------------------------+-------------------------------------------------+
|     TIERS     |     ORDER     |               DESCRIPTION                |                    TESTCASES                    |
+---------------+---------------+------------------------------------------+-------------------------------------------------+
|     smoke     |       1       |     Set of basic Functional tests to     |     neutron-tempest-plugin-api rally_sanity     |
|               |               |      validate the OPNFV scenarios.       |          refstack_defcore tempest_full          |
|               |               |                                          |      tempest_scenario patrole neutron_trunk     |
|               |               |                                          |         networking-bgpvpn networking-sfc        |
|               |               |                                          |                     barbican                    |
+---------------+---------------+------------------------------------------+-------------------------------------------------+

2019-09-16 21:32:44,917 - xtesting.ci.run_tests - INFO - Loading test case 'neutron-tempest-plugin-api'...
2019-09-16 21:32:49,116 - xtesting.ci.run_tests - INFO - Running test case 'neutron-tempest-plugin-api'...
2019-09-16 21:44:03,429 - xtesting.core.testcase - INFO - The results were successfully pushed to DB
2019-09-16 21:44:03,430 - xtesting.ci.run_tests - INFO - Test result:

+------------------------------------+------------------+------------------+----------------+
|             TEST CASE              |     PROJECT      |     DURATION     |     RESULT     |
+------------------------------------+------------------+------------------+----------------+
|     neutron-tempest-plugin-api     |     functest     |      11:14       |      FAIL      |
+------------------------------------+------------------+------------------+----------------+

2019-09-16 21:44:15,082 - xtesting.ci.run_tests - ERROR - The test case 'neutron-tempest-plugin-api' failed.
2019-09-16 21:44:15,120 - xtesting.ci.run_tests - INFO - Loading test case 'rally_sanity'...
2019-09-16 21:44:17,777 - xtesting.ci.run_tests - INFO - Running test case 'rally_sanity'...
2019-09-16 22:15:17,882 - xtesting.core.testcase - INFO - The results were successfully pushed to DB
2019-09-16 22:15:17,883 - xtesting.ci.run_tests - INFO - Test result:

+----------------------+------------------+------------------+----------------+
|      TEST CASE       |     PROJECT      |     DURATION     |     RESULT     |
+----------------------+------------------+------------------+----------------+
|     rally_sanity     |     functest     |      30:60       |      PASS      |
+----------------------+------------------+------------------+----------------+

2019-09-16 22:15:29,254 - xtesting.ci.run_tests - INFO - Loading test case 'refstack_defcore'...
2019-09-16 22:15:33,052 - xtesting.ci.run_tests - INFO - Running test case 'refstack_defcore'...
2019-09-16 22:23:55,094 - xtesting.core.testcase - INFO - The results were successfully pushed to DB
2019-09-16 22:23:55,095 - xtesting.ci.run_tests - INFO - Test result:

+--------------------------+------------------+------------------+----------------+
|        TEST CASE         |     PROJECT      |     DURATION     |     RESULT     |
+--------------------------+------------------+------------------+----------------+
|     refstack_defcore     |     functest     |      08:22       |      PASS      |
+--------------------------+------------------+------------------+----------------+

2019-09-16 22:24:06,376 - xtesting.ci.run_tests - INFO - Loading test case 'tempest_full'...
2019-09-16 22:24:10,186 - xtesting.ci.run_tests - INFO - Running test case 'tempest_full'...
2019-09-16 23:10:23,416 - xtesting.core.testcase - INFO - The results were successfully pushed to DB
2019-09-16 23:10:23,417 - xtesting.ci.run_tests - INFO - Test result:

+----------------------+------------------+------------------+----------------+
|      TEST CASE       |     PROJECT      |     DURATION     |     RESULT     |
+----------------------+------------------+------------------+----------------+
|     tempest_full     |     functest     |      46:12       |      PASS      |
+----------------------+------------------+------------------+----------------+

2019-09-16 23:10:35,052 - xtesting.ci.run_tests - INFO - Loading test case 'tempest_scenario'...
2019-09-16 23:10:39,157 - xtesting.ci.run_tests - INFO - Running test case 'tempest_scenario'...
2019-09-16 23:21:13,769 - xtesting.core.testcase - INFO - The results were successfully pushed to DB
2019-09-16 23:21:13,770 - xtesting.ci.run_tests - INFO - Test result:

+--------------------------+------------------+------------------+----------------+
|        TEST CASE         |     PROJECT      |     DURATION     |     RESULT     |
+--------------------------+------------------+------------------+----------------+
|     tempest_scenario     |     functest     |      10:34       |      PASS      |
+--------------------------+------------------+------------------+----------------+

2019-09-16 23:21:25,207 - xtesting.ci.run_tests - INFO - Loading test case 'patrole'...
2019-09-16 23:21:29,242 - xtesting.ci.run_tests - INFO - Running test case 'patrole'...
2019-09-16 23:24:39,890 - xtesting.core.testcase - INFO - The results were successfully pushed to DB
2019-09-16 23:24:39,891 - xtesting.ci.run_tests - INFO - Test result:

+-------------------+------------------+------------------+----------------+
|     TEST CASE     |     PROJECT      |     DURATION     |     RESULT     |
+-------------------+------------------+------------------+----------------+
|      patrole      |     functest     |      03:10       |      PASS      |
+-------------------+------------------+------------------+----------------+

2019-09-16 23:24:51,053 - xtesting.ci.run_tests - INFO - Loading test case 'neutron_trunk'...
2019-09-16 23:24:55,031 - xtesting.ci.run_tests - INFO - Running test case 'neutron_trunk'...
2019-09-16 23:27:38,983 - xtesting.core.testcase - INFO - The results were successfully pushed to DB
2019-09-16 23:27:38,983 - xtesting.ci.run_tests - INFO - Test result:

+-----------------------+------------------+------------------+----------------+
|       TEST CASE       |     PROJECT      |     DURATION     |     RESULT     |
+-----------------------+------------------+------------------+----------------+
|     neutron_trunk     |     functest     |      02:44       |      PASS      |
+-----------------------+------------------+------------------+----------------+

2019-09-16 23:27:49,947 - xtesting.ci.run_tests - INFO - Loading test case 'networking-bgpvpn'...
2019-09-16 23:27:53,730 - functest.opnfv_tests.openstack.tempest.tempest - WARNING - Cannot find Neutron extension: bgpvpn
2019-09-16 23:27:54,355 - xtesting.ci.run_tests - INFO - Skipping test case 'networking-bgpvpn'...
2019-09-16 23:27:54,355 - xtesting.ci.run_tests - INFO - Test result:

+---------------------------+------------------+------------------+----------------+
|         TEST CASE         |     PROJECT      |     DURATION     |     RESULT     |
+---------------------------+------------------+------------------+----------------+
|     networking-bgpvpn     |     functest     |      00:00       |      SKIP      |
+---------------------------+------------------+------------------+----------------+

2019-09-16 23:27:54,398 - xtesting.ci.run_tests - INFO - Loading test case 'networking-sfc'...
2019-09-16 23:27:58,494 - functest.opnfv_tests.openstack.tempest.tempest - WARNING - Cannot find Neutron extension: sfc
2019-09-16 23:27:59,120 - xtesting.ci.run_tests - INFO - Skipping test case 'networking-sfc'...
2019-09-16 23:27:59,120 - xtesting.ci.run_tests - INFO - Test result:

+------------------------+------------------+------------------+----------------+
|       TEST CASE        |     PROJECT      |     DURATION     |     RESULT     |
+------------------------+------------------+------------------+----------------+
|     networking-sfc     |     functest     |      00:00       |      SKIP      |
+------------------------+------------------+------------------+----------------+

2019-09-16 23:27:59,160 - xtesting.ci.run_tests - INFO - Loading test case 'barbican'...
2019-09-16 23:28:02,990 - xtesting.ci.run_tests - INFO - Running test case 'barbican'...
2019-09-16 23:30:48,307 - xtesting.core.testcase - INFO - The results were successfully pushed to DB
2019-09-16 23:30:48,307 - xtesting.ci.run_tests - INFO - Test result:

+-------------------+------------------+------------------+----------------+
|     TEST CASE     |     PROJECT      |     DURATION     |     RESULT     |
+-------------------+------------------+------------------+----------------+
|      barbican     |     functest     |      02:45       |      PASS      |
+-------------------+------------------+------------------+----------------+

2019-09-16 23:30:58,853 - xtesting.ci.run_tests - INFO - Xtesting report:

+------------------------------------+------------------+---------------+------------------+----------------+
|             TEST CASE              |     PROJECT      |      TIER     |     DURATION     |     RESULT     |
+------------------------------------+------------------+---------------+------------------+----------------+
|     neutron-tempest-plugin-api     |     functest     |     smoke     |      11:14       |      FAIL      |
|            rally_sanity            |     functest     |     smoke     |      30:60       |      PASS      |
|          refstack_defcore          |     functest     |     smoke     |      08:22       |      PASS      |
|            tempest_full            |     functest     |     smoke     |      46:12       |      PASS      |
|          tempest_scenario          |     functest     |     smoke     |      10:34       |      PASS      |
|              patrole               |     functest     |     smoke     |      03:10       |      PASS      |
|           neutron_trunk            |     functest     |     smoke     |      02:44       |      PASS      |
|         networking-bgpvpn          |     functest     |     smoke     |      00:00       |      SKIP      |
|           networking-sfc           |     functest     |     smoke     |      00:00       |      SKIP      |
|              barbican              |     functest     |     smoke     |      02:45       |      PASS      |
+------------------------------------+------------------+---------------+------------------+----------------+

2019-09-16 23:30:58,860 - xtesting.ci.run_tests - INFO - Execution exit value: Result.EX_ERROR
Functest: Pulling Functest Docker image opnfv/functest-benchmarking:hunter ...
Running Functest tier 'benchmarking'. CMD: docker run --rm  -e INSTALLER_TYPE=fuel -e INSTALLER_IP=10.20.0.2     -e NODE_NAME=ericsson-virtual3 -e DEPLOY_SCENARIO=os-odl-nofeature-noha     -e BUILD_TAG=jenkins-functest-fuel-virtual-daily-hunter-784 -e DEPLOY_TYPE=virt -e CI_LOOP=daily     -e TEST_DB_URL=http://testresults.opnfv.org/test/api/v1/results -e ENERGY_RECORDER_API_URL=http://energy.opnfv.fr/resources     -e DEBUG=true -e POD_ARCH=x86_64 -e BLOCK_MIGRATION=false -e SDN_CONTROLLER_RESTCONFPORT=8080 -e IMAGE_PROPERTIES=hw_disk_bus:scsi,hw_scsi_model:virtio-scsi -e FLAVOR_EXTRA_SPECS= -v /home/jenkins/opnfv/functest/images:/home/opnfv/functest/images -v /home/jenkins/opnfv/functest/results/hunter:/home/opnfv/functest/results -v /var/lib/opnfv/mcp.rsa:/root/.ssh/id_rsa       -v /home/jenkins/opnfv-openrc.sh:/home/opnfv/functest/conf/env_file      -v /tmp/tmp.qsVjJElXPK:/usr/lib/python2.7/site-packages/functest/opnfv_tests/openstack/tempest/custom_tests/tempest_conf.yaml  opnfv/functest-benchmarking:hunter /bin/bash -c 'run_tests -r -t all'
2019-09-16 23:31:02,980 - xtesting.ci.run_tests - INFO - Deployment description:

+--------------------------------------+----------------------------------------------------------+
|               ENV VAR                |                          VALUE                           |
+--------------------------------------+----------------------------------------------------------+
|              BUILD_TAG               |      jenkins-functest-fuel-virtual-daily-hunter-784      |
|             TEST_DB_URL              |     http://testresults.opnfv.org/test/api/v1/results     |
|     ENERGY_RECORDER_API_PASSWORD     |                                                          |
|               CI_LOOP                |                          daily                           |
|                DEBUG                 |                           true                           |
|            INSTALLER_TYPE            |                           fuel                           |
|       ENERGY_RECORDER_API_URL        |             http://energy.opnfv.fr/resources             |
|           DEPLOY_SCENARIO            |                  os-odl-nofeature-noha                   |
|       ENERGY_RECORDER_API_USER       |                                                          |
|              NODE_NAME               |                    ericsson-virtual3                     |
+--------------------------------------+----------------------------------------------------------+

2019-09-16 23:31:02,985 - xtesting.ci.run_tests - INFO - Sourcing env file /var/lib/xtesting/conf/env_file


export OS_IDENTITY_API_VERSION=3
export OS_PROJECT_DOMAIN_NAME=Default
export OS_USER_DOMAIN_NAME=Default
export OS_PROJECT_NAME=admin
export OS_TENANT_NAME=admin
export OS_USERNAME=admin
export OS_PASSWORD=opnfv_secret
export OS_REGION_NAME=RegionOne
export OS_INTERFACE=internal
export OS_ENDPOINT_TYPE="internal"
export OS_CACERT="/etc/ssl/certs/ca-certificates.crt"
export SDN_CONTROLLER_USER=admin
export SDN_CONTROLLER_RESTCONFPORT=8282
export SDN_CONTROLLER_PASSWORD=admin
export SDN_CONTROLLER_WEBPORT=8282
export SDN_CONTROLLER_IP=10.16.0.107
export VOLUME_DEVICE_NAME=sdc
export OS_AUTH_URL=http://172.16.10.36:35357/v3

2019-09-16 23:31:02,986 - xtesting.ci.run_tests - INFO - TESTS TO BE EXECUTED:

+----------------------+---------------+-------------------------------------------------+-------------------------------------------+
|        TIERS         |     ORDER     |                   DESCRIPTION                   |                 TESTCASES                 |
+----------------------+---------------+-------------------------------------------------+-------------------------------------------+
|     benchmarking     |       2       |     Run several OpenStack performance tools     |     rally_full rally_jobs vmtp shaker     |
|                      |               |     https://docs.openstack.org/performance-     |                                           |
|                      |               |       docs/latest/methodologies/tools.html      |                                           |
+----------------------+---------------+-------------------------------------------------+-------------------------------------------+

2019-09-16 23:31:02,999 - xtesting.ci.run_tests - INFO - Loading test case 'rally_full'...
2019-09-16 23:31:06,146 - xtesting.ci.run_tests - INFO - Running test case 'rally_full'...
2019-09-17 02:13:44,686 - xtesting.core.testcase - INFO - The results were successfully pushed to DB
2019-09-17 02:13:44,687 - xtesting.ci.run_tests - INFO - Test result:

+--------------------+------------------+------------------+----------------+
|     TEST CASE      |     PROJECT      |     DURATION     |     RESULT     |
+--------------------+------------------+------------------+----------------+
|     rally_full     |     functest     |      162:38      |      PASS      |
+--------------------+------------------+------------------+----------------+

2019-09-17 02:13:57,981 - xtesting.ci.run_tests - INFO - Loading test case 'rally_jobs'...
2019-09-17 02:14:00,601 - xtesting.ci.run_tests - INFO - Running test case 'rally_jobs'...
2019-09-17 03:02:13,991 - xtesting.core.testcase - INFO - The results were successfully pushed to DB
2019-09-17 03:02:13,992 - xtesting.ci.run_tests - INFO - Test result:

+--------------------+------------------+------------------+----------------+
|     TEST CASE      |     PROJECT      |     DURATION     |     RESULT     |
+--------------------+------------------+------------------+----------------+
|     rally_jobs     |     functest     |      48:13       |      PASS      |
+--------------------+------------------+------------------+----------------+

2019-09-17 03:02:26,472 - xtesting.ci.run_tests - INFO - Loading test case 'vmtp'...
2019-09-17 03:02:29,035 - xtesting.ci.run_tests - INFO - Running test case 'vmtp'...
2019-09-17 03:38:49,851 - functest.opnfv_tests.openstack.vmtp.vmtp - ERROR - Exception when calling ['vmtp_genchart', '-c', '/home/opnfv/functest/results/vmtp/vmtp.html', '/home/opnfv/functest/results/vmtp/vmtp.json']
Error: No such file %s: /home/opnfv/functest/results/vmtp/vmtp.json

2019-09-17 03:38:50,119 - xtesting.core.testcase - INFO - The results were successfully pushed to DB
2019-09-17 03:38:50,120 - xtesting.ci.run_tests - INFO - Test result:

+-------------------+------------------+------------------+----------------+
|     TEST CASE     |     PROJECT      |     DURATION     |     RESULT     |
+-------------------+------------------+------------------+----------------+
|        vmtp       |     functest     |      36:21       |      FAIL      |
+-------------------+------------------+------------------+----------------+

2019-09-17 03:38:51,273 - functest.core.tenantnetwork - ERROR - cannot clean all resources
Traceback (most recent call last):
  File "/usr/lib/python2.7/site-packages/functest/core/tenantnetwork.py", line 282, in clean
    self.cloud.delete_router(self.router.id)
  File "/usr/lib/python2.7/site-packages/shade/openstackcloud.py", line 4156, in delete_router
    error_message="Error deleting router {0}".format(name_or_id))
  File "/usr/lib/python2.7/site-packages/keystoneauth1/adapter.py", line 343, in delete
    return self.request(url, 'DELETE', **kwargs)
  File "/usr/lib/python2.7/site-packages/openstack/_adapter.py", line 164, in request
    return _json_response(response, error_message=error_message)
  File "/usr/lib/python2.7/site-packages/openstack/_adapter.py", line 95, in _json_response
    exceptions.raise_from_response(response, error_message=error_message)
  File "/usr/lib/python2.7/site-packages/openstack/exceptions.py", line 229, in raise_from_response
    http_status=http_status, request_id=request_id
ConflictException: Error deleting router 0e5d60c2-d2db-4f84-947d-3b83fa185624: Client Error for url: http://172.16.10.36:9696/v2.0/routers/0e5d60c2-d2db-4f84-947d-3b83fa185624.json, Router 0e5d60c2-d2db-4f84-947d-3b83fa185624 still has ports
2019-09-17 03:38:54,527 - xtesting.ci.run_tests - ERROR - The test case 'vmtp' failed.
2019-09-17 03:38:54,539 - xtesting.ci.run_tests - INFO - Loading test case 'shaker'...
2019-09-17 03:38:57,042 - xtesting.ci.run_tests - INFO - Running test case 'shaker'...
2019-09-17 04:40:37,953 - functest.opnfv_tests.openstack.shaker.shaker - ERROR - cannot get report files
Traceback (most recent call last):
  File "/usr/lib/python2.7/site-packages/functest/opnfv_tests/openstack/shaker/shaker.py", line 125, in execute
    scpc.get('report.json', self.res_dir)
  File "/usr/lib/python2.7/site-packages/scp.py", line 217, in get
    self._recv_all()
  File "/usr/lib/python2.7/site-packages/scp.py", line 367, in _recv_all
    raise SCPException(asunicode(msg[1:]))
SCPException: scp: report.json: No such file or directory
2019-09-17 04:40:38,657 - xtesting.core.testcase - INFO - The results were successfully pushed to DB
2019-09-17 04:40:38,658 - xtesting.ci.run_tests - INFO - Test result:

+-------------------+------------------+------------------+----------------+
|     TEST CASE     |     PROJECT      |     DURATION     |     RESULT     |
+-------------------+------------------+------------------+----------------+
|       shaker      |     functest     |      61:41       |      FAIL      |
+-------------------+------------------+------------------+----------------+

2019-09-17 04:40:58,917 - xtesting.ci.run_tests - ERROR - The test case 'shaker' failed.
2019-09-17 04:40:58,918 - xtesting.ci.run_tests - INFO - Xtesting report:

+--------------------+------------------+----------------------+------------------+----------------+
|     TEST CASE      |     PROJECT      |         TIER         |     DURATION     |     RESULT     |
+--------------------+------------------+----------------------+------------------+----------------+
|     rally_full     |     functest     |     benchmarking     |      162:38      |      PASS      |
|     rally_jobs     |     functest     |     benchmarking     |      48:13       |      PASS      |
|        vmtp        |     functest     |     benchmarking     |      36:21       |      FAIL      |
|       shaker       |     functest     |     benchmarking     |      61:41       |      FAIL      |
+--------------------+------------------+----------------------+------------------+----------------+

2019-09-17 04:40:58,923 - xtesting.ci.run_tests - INFO - Execution exit value: Result.EX_ERROR
Functest: Pulling Functest Docker image opnfv/functest-vnf:hunter ...
Running Functest tier 'vnf'. CMD: docker run --rm  -e INSTALLER_TYPE=fuel -e INSTALLER_IP=10.20.0.2     -e NODE_NAME=ericsson-virtual3 -e DEPLOY_SCENARIO=os-odl-nofeature-noha     -e BUILD_TAG=jenkins-functest-fuel-virtual-daily-hunter-784 -e DEPLOY_TYPE=virt -e CI_LOOP=daily     -e TEST_DB_URL=http://testresults.opnfv.org/test/api/v1/results -e ENERGY_RECORDER_API_URL=http://energy.opnfv.fr/resources     -e DEBUG=true -e POD_ARCH=x86_64 -e BLOCK_MIGRATION=false -e SDN_CONTROLLER_RESTCONFPORT=8080 -e IMAGE_PROPERTIES=hw_disk_bus:scsi,hw_scsi_model:virtio-scsi -e FLAVOR_EXTRA_SPECS= -v /home/jenkins/opnfv/functest/images:/home/opnfv/functest/images -v /home/jenkins/opnfv/functest/results/hunter:/home/opnfv/functest/results -v /var/lib/opnfv/mcp.rsa:/root/.ssh/id_rsa       -v /home/jenkins/opnfv-openrc.sh:/home/opnfv/functest/conf/env_file      -v /tmp/tmp.qsVjJElXPK:/usr/lib/python2.7/site-packages/functest/opnfv_tests/openstack/tempest/custom_tests/tempest_conf.yaml  opnfv/functest-vnf:hunter /bin/bash -c 'run_tests -r -t all'
2019-09-17 04:41:02,705 - xtesting.ci.run_tests - INFO - Deployment description:

+--------------------------------------+----------------------------------------------------------+
|               ENV VAR                |                          VALUE                           |
+--------------------------------------+----------------------------------------------------------+
|              BUILD_TAG               |      jenkins-functest-fuel-virtual-daily-hunter-784      |
|             TEST_DB_URL              |     http://testresults.opnfv.org/test/api/v1/results     |
|     ENERGY_RECORDER_API_PASSWORD     |                                                          |
|               CI_LOOP                |                          daily                           |
|                DEBUG                 |                           true                           |
|            INSTALLER_TYPE            |                           fuel                           |
|       ENERGY_RECORDER_API_URL        |             http://energy.opnfv.fr/resources             |
|           DEPLOY_SCENARIO            |                  os-odl-nofeature-noha                   |
|       ENERGY_RECORDER_API_USER       |                                                          |
|              NODE_NAME               |                    ericsson-virtual3                     |
+--------------------------------------+----------------------------------------------------------+

2019-09-17 04:41:02,710 - xtesting.ci.run_tests - INFO - Sourcing env file /var/lib/xtesting/conf/env_file


export OS_IDENTITY_API_VERSION=3
export OS_PROJECT_DOMAIN_NAME=Default
export OS_USER_DOMAIN_NAME=Default
export OS_PROJECT_NAME=admin
export OS_TENANT_NAME=admin
export OS_USERNAME=admin
export OS_PASSWORD=opnfv_secret
export OS_REGION_NAME=RegionOne
export OS_INTERFACE=internal
export OS_ENDPOINT_TYPE="internal"
export OS_CACERT="/etc/ssl/certs/ca-certificates.crt"
export SDN_CONTROLLER_USER=admin
export SDN_CONTROLLER_RESTCONFPORT=8282
export SDN_CONTROLLER_PASSWORD=admin
export SDN_CONTROLLER_WEBPORT=8282
export SDN_CONTROLLER_IP=10.16.0.107
export VOLUME_DEVICE_NAME=sdc
export OS_AUTH_URL=http://172.16.10.36:35357/v3

2019-09-17 04:41:02,711 - xtesting.ci.run_tests - INFO - TESTS TO BE EXECUTED:

+---------------+---------------+---------------------------------------+----------------------------------------+
|     TIERS     |     ORDER     |              DESCRIPTION              |               TESTCASES                |
+---------------+---------------+---------------------------------------+----------------------------------------+
|      vnf      |       4       |     Collection of VNF test cases.     |     cloudify cloudify_ims heat_ims     |
|               |               |                                       |         vyos_vrouter juju_epc          |
+---------------+---------------+---------------------------------------+----------------------------------------+

2019-09-17 04:41:02,723 - xtesting.ci.run_tests - INFO - Loading test case 'cloudify'...
2019-09-17 04:41:05,260 - xtesting.ci.run_tests - INFO - Running test case 'cloudify'...
2019-09-17 04:45:08,508 - functest.core.cloudify - INFO - Attemps running status of the Manager
2019-09-17 04:45:38,943 - functest.core.cloudify - INFO - The current manager status is running
2019-09-17 04:45:39,313 - functest.core.cloudify - INFO - Secrets API successfully reached
2019-09-17 04:45:39,313 - functest.core.cloudify - INFO - Cloudify Manager is up and running
2019-09-17 04:45:39,618 - xtesting.core.testcase - INFO - The results were successfully pushed to DB
2019-09-17 04:45:39,619 - xtesting.ci.run_tests - INFO - Test result:

+-------------------+------------------+------------------+----------------+
|     TEST CASE     |     PROJECT      |     DURATION     |     RESULT     |
+-------------------+------------------+------------------+----------------+
|      cloudify     |     functest     |      04:34       |      PASS      |
+-------------------+------------------+------------------+----------------+

2019-09-17 04:45:58,879 - xtesting.ci.run_tests - INFO - Loading test case 'cloudify_ims'...
2019-09-17 04:46:01,171 - xtesting.ci.run_tests - INFO - Running test case 'cloudify_ims'...
2019-09-17 04:49:37,410 - functest.core.cloudify - INFO - Attemps running status of the Manager
2019-09-17 04:50:07,903 - functest.core.cloudify - INFO - The current manager status is running
2019-09-17 04:50:08,393 - functest.core.cloudify - INFO - Secrets API successfully reached
2019-09-17 04:50:08,393 - functest.core.cloudify - INFO - Cloudify Manager is up and running
2019-09-17 04:50:10,111 - functest.core.cloudify - INFO - Put private keypair in manager
Build timed out (after 600 minutes). Marking the build as aborted.
New run name is '784 Suite: daily Scenario: os-odl-nofeature-noha'
Build was aborted
No emails were triggered.
Finished: ABORTED