FailedConsole Output

Started by upstream project "fuel-os-odl-ovs-noha-virtual-daily-hunter" build number 119
originally caused by:
 Started by timer
Running as SYSTEM
[EnvInject] - Loading node environment variables.
Building remotely on ericsson-virtual1 (fuel-virtual ci-resource opnfv-sysinfo) in workspace /home/jenkins/opnfv/slave_root/workspace/functest-fuel-virtual-daily-hunter
using credential d42411ac011ad6f3dd2e1fa34eaa5d87f910eb2e
Wiping out workspace first.
Cloning the remote Git repository
Cloning repository https://gerrit.opnfv.org/gerrit/functest
 > git init /home/jenkins/opnfv/slave_root/workspace/functest-fuel-virtual-daily-hunter # timeout=10
Fetching upstream changes from https://gerrit.opnfv.org/gerrit/functest
 > git --version # timeout=10
using GIT_SSH to set credentials Jenkins Master SSH
 > git fetch --tags --progress https://gerrit.opnfv.org/gerrit/functest +refs/heads/*:refs/remotes/origin/* # timeout=15
 > git config remote.origin.url https://gerrit.opnfv.org/gerrit/functest # timeout=10
 > git config --add remote.origin.fetch +refs/heads/*:refs/remotes/origin/* # timeout=10
 > git config remote.origin.url https://gerrit.opnfv.org/gerrit/functest # timeout=10
Fetching upstream changes from https://gerrit.opnfv.org/gerrit/functest
using GIT_SSH to set credentials Jenkins Master SSH
 > git fetch --tags --progress https://gerrit.opnfv.org/gerrit/functest +refs/heads/*:refs/remotes/origin/* # timeout=15
 > git rev-parse refs/remotes/origin/stable/hunter^{commit} # timeout=10
 > git rev-parse refs/remotes/origin/origin/stable/hunter^{commit} # timeout=10
Checking out Revision ec20777fe4188cb29e7e50002143cbbc384f2456 (refs/remotes/origin/stable/hunter)
 > git config core.sparsecheckout # timeout=10
 > git checkout -f ec20777fe4188cb29e7e50002143cbbc384f2456 # timeout=15
Commit message: "Conforms with latest changes in Xtesting ansible role."
 > git rev-list --no-walk f8800b23d406c8acad7acc62035d5425d7358338 # timeout=10
Run condition [Regular expression match] enabling prebuild for step [Execute shell]
Run condition [Regular expression match] enabling prebuild for step [Execute shell]
No emails were triggered.
New run name is '641 Suite: daily Scenario: os-odl-ovs-noha'
[description-setter] Description set: Built on ericsson-virtual1
[functest-fuel-virtual-daily-hunter] $ /bin/bash /tmp/jenkins7821133115368120353.sh
Cleaning up docker containers/images...
Regular expression run condition: Expression=[os-.*], Label=[os-odl-ovs-noha]
Run condition [Regular expression match] enabling perform for step [Execute shell]
[functest-fuel-virtual-daily-hunter] $ /usr/bin/env bash /tmp/jenkins6446499769589215669.sh
Map mcp ssh_key
<13>Aug 23 04:47:08 fetch_os_creds.info: Fetching rc file...
<13>Aug 23 04:47:08 fetch_os_creds.info: Verifying connectivity to 10.20.0.2...
<13>Aug 23 04:47:08 fetch_os_creds.info: 10.20.0.2 is reachable!
<13>Aug 23 04:47:09 fetch_os_creds.info: ... from controller 172.16.10.36 ...
Warning: Permanently added '172.16.10.36' (ECDSA) to the list of known hosts.
-------- Credentials: --------

export OS_IDENTITY_API_VERSION=3
export OS_PROJECT_DOMAIN_NAME=Default
export OS_USER_DOMAIN_NAME=Default
export OS_PROJECT_NAME=admin
export OS_TENANT_NAME=admin
export OS_USERNAME=admin
export OS_PASSWORD=opnfv_secret
export OS_REGION_NAME=RegionOne
export OS_INTERFACE=internal
export OS_ENDPOINT_TYPE="internal"
export OS_CACERT="/etc/ssl/certs/ca-certificates.crt"
export SDN_CONTROLLER_USER=admin
export SDN_CONTROLLER_RESTCONFPORT=8282
export SDN_CONTROLLER_PASSWORD=admin
export SDN_CONTROLLER_WEBPORT=8282
export SDN_CONTROLLER_IP=10.16.0.107
export VOLUME_DEVICE_NAME=sdc
export OS_AUTH_URL=http://172.16.10.36:35357/v3
Functest: Start Docker and prepare environment
Functest: Download images that will be used by test cases
+ wget_opts='-N --tries=1 --connect-timeout=30'
+ '[' -t 1 ']'
+ wget_opts='-N --tries=1 --connect-timeout=30 --progress=dot:giga'
+ cat
+ wget -N --tries=1 --connect-timeout=30 --progress=dot:giga -i - -P /home/jenkins/opnfv/functest/images
--2019-08-23 04:47:10--  http://download.cirros-cloud.net/0.4.0/cirros-0.4.0-x86_64-disk.img
Resolving download.cirros-cloud.net (download.cirros-cloud.net)... 64.90.42.85, 2607:f298:6:a036::bd6:a72a
Connecting to download.cirros-cloud.net (download.cirros-cloud.net)|64.90.42.85|:80... connected.
HTTP request sent, awaiting response... 304 Not Modified
File ‘/home/jenkins/opnfv/functest/images/cirros-0.4.0-x86_64-disk.img’ not modified on server. Omitting download.

--2019-08-23 04:47:10--  https://cloud-images.ubuntu.com/releases/14.04/release/ubuntu-14.04-server-cloudimg-amd64-disk1.img
Resolving cloud-images.ubuntu.com (cloud-images.ubuntu.com)... 91.189.88.89, 2001:67c:1560:8001::8001
Connecting to cloud-images.ubuntu.com (cloud-images.ubuntu.com)|91.189.88.89|:443... connected.
HTTP request sent, awaiting response... 302 Found
Location: https://cloud-images.ubuntu.com/releases/trusty/release/ubuntu-14.04-server-cloudimg-amd64-disk1.img [following]
--2019-08-23 04:47:10--  https://cloud-images.ubuntu.com/releases/trusty/release/ubuntu-14.04-server-cloudimg-amd64-disk1.img
Reusing existing connection to cloud-images.ubuntu.com:443.
HTTP request sent, awaiting response... 304 Not Modified
File ‘/home/jenkins/opnfv/functest/images/ubuntu-14.04-server-cloudimg-amd64-disk1.img’ not modified on server. Omitting download.

--2019-08-23 04:47:10--  https://cloud-images.ubuntu.com/releases/16.04/release/ubuntu-16.04-server-cloudimg-amd64-disk1.img
Reusing existing connection to cloud-images.ubuntu.com:443.
HTTP request sent, awaiting response... 302 Found
Location: https://cloud-images.ubuntu.com/releases/xenial/release/ubuntu-16.04-server-cloudimg-amd64-disk1.img [following]
--2019-08-23 04:47:10--  https://cloud-images.ubuntu.com/releases/xenial/release/ubuntu-16.04-server-cloudimg-amd64-disk1.img
Reusing existing connection to cloud-images.ubuntu.com:443.
HTTP request sent, awaiting response... 304 Not Modified
File ‘/home/jenkins/opnfv/functest/images/ubuntu-16.04-server-cloudimg-amd64-disk1.img’ not modified on server. Omitting download.

--2019-08-23 04:47:10--  http://download.cirros-cloud.net/0.4.0/cirros-0.4.0-aarch64-disk.img
Connecting to download.cirros-cloud.net (download.cirros-cloud.net)|64.90.42.85|:80... connected.
HTTP request sent, awaiting response... 304 Not Modified
File ‘/home/jenkins/opnfv/functest/images/cirros-0.4.0-aarch64-disk.img’ not modified on server. Omitting download.

--2019-08-23 04:47:11--  https://cloud-images.ubuntu.com/releases/14.04/release/ubuntu-14.04-server-cloudimg-arm64-uefi1.img
Connecting to cloud-images.ubuntu.com (cloud-images.ubuntu.com)|91.189.88.89|:443... connected.
HTTP request sent, awaiting response... 302 Found
Location: https://cloud-images.ubuntu.com/releases/trusty/release/ubuntu-14.04-server-cloudimg-arm64-uefi1.img [following]
--2019-08-23 04:47:11--  https://cloud-images.ubuntu.com/releases/trusty/release/ubuntu-14.04-server-cloudimg-arm64-uefi1.img
Reusing existing connection to cloud-images.ubuntu.com:443.
HTTP request sent, awaiting response... 304 Not Modified
File ‘/home/jenkins/opnfv/functest/images/ubuntu-14.04-server-cloudimg-arm64-uefi1.img’ not modified on server. Omitting download.

--2019-08-23 04:47:11--  http://repository.cloudifysource.org/cloudify/19.01.24/community-release/cloudify-docker-manager-community-19.01.24.tar
Resolving repository.cloudifysource.org (repository.cloudifysource.org)... 54.192.98.97, 54.192.98.186, 54.192.98.108, ...
Connecting to repository.cloudifysource.org (repository.cloudifysource.org)|54.192.98.97|:80... connected.
HTTP request sent, awaiting response... 304 Not Modified
File ‘/home/jenkins/opnfv/functest/images/cloudify-docker-manager-community-19.01.24.tar’ not modified on server. Omitting download.

--2019-08-23 04:47:11--  http://testresults.opnfv.org/functest/vyos-1.1.8-amd64.qcow2
Resolving testresults.opnfv.org (testresults.opnfv.org)... 104.154.71.112
Connecting to testresults.opnfv.org (testresults.opnfv.org)|104.154.71.112|:80... connected.
HTTP request sent, awaiting response... 304 Not Modified
File ‘/home/jenkins/opnfv/functest/images/vyos-1.1.8-amd64.qcow2’ not modified on server. Omitting download.

--2019-08-23 04:47:11--  http://testresults.opnfv.org/functest/shaker-image.qcow2
Reusing existing connection to testresults.opnfv.org:80.
HTTP request sent, awaiting response... 304 Not Modified
File ‘/home/jenkins/opnfv/functest/images/shaker-image.qcow2’ not modified on server. Omitting download.

--2019-08-23 04:47:11--  http://testresults.opnfv.org/functest/shaker-image-arm64.qcow2
Reusing existing connection to testresults.opnfv.org:80.
HTTP request sent, awaiting response... 304 Not Modified
File ‘/home/jenkins/opnfv/functest/images/shaker-image-arm64.qcow2’ not modified on server. Omitting download.

Warning: Permanently added '10.20.0.2' (ECDSA) to the list of known hosts.
tempest_conf.yaml:
---
compute-feature-enabled:
    shelve: false
    vnc_console: false
    spice_console: true
identity-feature-enabled:
    api_v2: false
    api_v2_admin: false
image-feature-enabled:
    api_v2: true
    api_v1: false
volume:
    storage_protocol: iSCSI
volume-feature-enabled:
    backup: false
compute:
    max_microversion: 2.65
Functest: Pulling Functest Docker image opnfv/functest-healthcheck:hunter ...
Running Functest tier 'healthcheck'. CMD: docker run --rm  -e INSTALLER_TYPE=fuel -e INSTALLER_IP=10.20.0.2     -e NODE_NAME=ericsson-virtual1 -e DEPLOY_SCENARIO=os-odl-ovs-noha     -e BUILD_TAG=jenkins-functest-fuel-virtual-daily-hunter-641 -e DEPLOY_TYPE=virt -e CI_LOOP=daily     -e TEST_DB_URL=http://testresults.opnfv.org/test/api/v1/results -e ENERGY_RECORDER_API_URL=http://energy.opnfv.fr/resources     -e DEBUG=true -e POD_ARCH=x86_64 -e BLOCK_MIGRATION=false -e SDN_CONTROLLER_RESTCONFPORT=8080 -e IMAGE_PROPERTIES=hw_disk_bus:scsi,hw_scsi_model:virtio-scsi,hw_mem_page_size:large -e FLAVOR_EXTRA_SPECS=hw:mem_page_size:large -v /home/jenkins/opnfv/functest/images:/home/opnfv/functest/images -v /home/jenkins/opnfv/functest/results/hunter:/home/opnfv/functest/results -v /var/lib/opnfv/mcp.rsa:/root/.ssh/id_rsa       -v /home/jenkins/opnfv-openrc.sh:/home/opnfv/functest/conf/env_file      -v /tmp/tmp.w0EcQpIRTt:/usr/lib/python2.7/site-packages/functest/opnfv_tests/openstack/tempest/custom_tests/tempest_conf.yaml  opnfv/functest-healthcheck:hunter /bin/bash -c 'run_tests -r -t all'
2019-08-23 02:47:16,567 - xtesting.ci.run_tests - INFO - Deployment description:

+--------------------------------------+----------------------------------------------------------+
|               ENV VAR                |                          VALUE                           |
+--------------------------------------+----------------------------------------------------------+
|              BUILD_TAG               |      jenkins-functest-fuel-virtual-daily-hunter-641      |
|             TEST_DB_URL              |     http://testresults.opnfv.org/test/api/v1/results     |
|     ENERGY_RECORDER_API_PASSWORD     |                                                          |
|               CI_LOOP                |                          daily                           |
|                DEBUG                 |                           true                           |
|            INSTALLER_TYPE            |                           fuel                           |
|       ENERGY_RECORDER_API_URL        |             http://energy.opnfv.fr/resources             |
|           DEPLOY_SCENARIO            |                     os-odl-ovs-noha                      |
|       ENERGY_RECORDER_API_USER       |                                                          |
|              NODE_NAME               |                    ericsson-virtual1                     |
+--------------------------------------+----------------------------------------------------------+

2019-08-23 02:47:16,573 - xtesting.ci.run_tests - INFO - Sourcing env file /var/lib/xtesting/conf/env_file


export OS_IDENTITY_API_VERSION=3
export OS_PROJECT_DOMAIN_NAME=Default
export OS_USER_DOMAIN_NAME=Default
export OS_PROJECT_NAME=admin
export OS_TENANT_NAME=admin
export OS_USERNAME=admin
export OS_PASSWORD=opnfv_secret
export OS_REGION_NAME=RegionOne
export OS_INTERFACE=internal
export OS_ENDPOINT_TYPE="internal"
export OS_CACERT="/etc/ssl/certs/ca-certificates.crt"
export SDN_CONTROLLER_USER=admin
export SDN_CONTROLLER_RESTCONFPORT=8282
export SDN_CONTROLLER_PASSWORD=admin
export SDN_CONTROLLER_WEBPORT=8282
export SDN_CONTROLLER_IP=10.16.0.107
export VOLUME_DEVICE_NAME=sdc
export OS_AUTH_URL=http://172.16.10.36:35357/v3

2019-08-23 02:47:16,574 - xtesting.ci.run_tests - INFO - TESTS TO BE EXECUTED:

+---------------------+---------------+-------------------------------------------------+------------------------------------------+
|        TIERS        |     ORDER     |                   DESCRIPTION                   |                TESTCASES                 |
+---------------------+---------------+-------------------------------------------------+------------------------------------------+
|     healthcheck     |       0       |     First tier to be executed to verify the     |     connection_check tenantnetwork1      |
|                     |               |           basic operations in the VIM.          |     tenantnetwork2 vmready1 vmready2     |
|                     |               |                                                 |      singlevm1 singlevm2 vping_ssh       |
|                     |               |                                                 |      vping_userdata cinder_test odl      |
|                     |               |                                                 |              tempest_smoke               |
+---------------------+---------------+-------------------------------------------------+------------------------------------------+

2019-08-23 02:47:16,605 - xtesting.ci.run_tests - INFO - Loading test case 'connection_check'...
2019-08-23 02:47:17,003 - xtesting.ci.run_tests - INFO - Running test case 'connection_check'...
2019-08-23 02:47:21,083 - xtesting.core.testcase - INFO - The results were successfully pushed to DB
2019-08-23 02:47:21,083 - xtesting.ci.run_tests - INFO - Test result:

+--------------------------+------------------+------------------+----------------+
|        TEST CASE         |     PROJECT      |     DURATION     |     RESULT     |
+--------------------------+------------------+------------------+----------------+
|     connection_check     |     functest     |      00:04       |      PASS      |
+--------------------------+------------------+------------------+----------------+

2019-08-23 02:47:21,111 - xtesting.ci.run_tests - INFO - Loading test case 'tenantnetwork1'...
2019-08-23 02:47:22,052 - xtesting.ci.run_tests - INFO - Running test case 'tenantnetwork1'...
2019-08-23 02:47:27,140 - xtesting.core.testcase - INFO - The results were successfully pushed to DB
2019-08-23 02:47:27,141 - xtesting.ci.run_tests - INFO - Test result:

+------------------------+------------------+------------------+----------------+
|       TEST CASE        |     PROJECT      |     DURATION     |     RESULT     |
+------------------------+------------------+------------------+----------------+
|     tenantnetwork1     |     functest     |      00:05       |      PASS      |
+------------------------+------------------+------------------+----------------+

2019-08-23 02:47:35,419 - xtesting.ci.run_tests - INFO - Loading test case 'tenantnetwork2'...
2019-08-23 02:47:37,212 - xtesting.ci.run_tests - INFO - Running test case 'tenantnetwork2'...
2019-08-23 02:47:43,367 - xtesting.core.testcase - INFO - The results were successfully pushed to DB
2019-08-23 02:47:43,368 - xtesting.ci.run_tests - INFO - Test result:

+------------------------+------------------+------------------+----------------+
|       TEST CASE        |     PROJECT      |     DURATION     |     RESULT     |
+------------------------+------------------+------------------+----------------+
|     tenantnetwork2     |     functest     |      00:06       |      PASS      |
+------------------------+------------------+------------------+----------------+

2019-08-23 02:47:52,878 - xtesting.ci.run_tests - INFO - Loading test case 'vmready1'...
2019-08-23 02:47:53,695 - xtesting.ci.run_tests - INFO - Running test case 'vmready1'...
2019-08-23 02:48:02,410 - xtesting.core.testcase - INFO - The results were successfully pushed to DB
2019-08-23 02:48:02,410 - xtesting.ci.run_tests - INFO - Test result:

+-------------------+------------------+------------------+----------------+
|     TEST CASE     |     PROJECT      |     DURATION     |     RESULT     |
+-------------------+------------------+------------------+----------------+
|      vmready1     |     functest     |      00:08       |      PASS      |
+-------------------+------------------+------------------+----------------+

2019-08-23 02:48:12,612 - xtesting.ci.run_tests - INFO - Loading test case 'vmready2'...
2019-08-23 02:48:14,403 - xtesting.ci.run_tests - INFO - Running test case 'vmready2'...
2019-08-23 02:48:22,291 - xtesting.core.testcase - INFO - The results were successfully pushed to DB
2019-08-23 02:48:22,291 - xtesting.ci.run_tests - INFO - Test result:

+-------------------+------------------+------------------+----------------+
|     TEST CASE     |     PROJECT      |     DURATION     |     RESULT     |
+-------------------+------------------+------------------+----------------+
|      vmready2     |     functest     |      00:08       |      PASS      |
+-------------------+------------------+------------------+----------------+

2019-08-23 02:48:31,470 - xtesting.ci.run_tests - INFO - Loading test case 'singlevm1'...
2019-08-23 02:48:32,278 - xtesting.ci.run_tests - INFO - Running test case 'singlevm1'...
2019-08-23 02:49:07,908 - xtesting.core.testcase - INFO - The results were successfully pushed to DB
2019-08-23 02:49:07,908 - xtesting.ci.run_tests - INFO - Test result:

+-------------------+------------------+------------------+----------------+
|     TEST CASE     |     PROJECT      |     DURATION     |     RESULT     |
+-------------------+------------------+------------------+----------------+
|     singlevm1     |     functest     |      00:35       |      PASS      |
+-------------------+------------------+------------------+----------------+

2019-08-23 02:49:20,312 - xtesting.ci.run_tests - INFO - Loading test case 'singlevm2'...
2019-08-23 02:49:21,968 - xtesting.ci.run_tests - INFO - Running test case 'singlevm2'...
2019-08-23 02:49:54,384 - xtesting.core.testcase - INFO - The results were successfully pushed to DB
2019-08-23 02:49:54,385 - xtesting.ci.run_tests - INFO - Test result:

+-------------------+------------------+------------------+----------------+
|     TEST CASE     |     PROJECT      |     DURATION     |     RESULT     |
+-------------------+------------------+------------------+----------------+
|     singlevm2     |     functest     |      00:32       |      PASS      |
+-------------------+------------------+------------------+----------------+

2019-08-23 02:50:08,350 - xtesting.ci.run_tests - INFO - Loading test case 'vping_ssh'...
2019-08-23 02:50:10,269 - xtesting.ci.run_tests - INFO - Running test case 'vping_ssh'...
2019-08-23 02:51:22,181 - xtesting.core.testcase - INFO - The results were successfully pushed to DB
2019-08-23 02:51:22,181 - xtesting.ci.run_tests - INFO - Test result:

+-------------------+------------------+------------------+----------------+
|     TEST CASE     |     PROJECT      |     DURATION     |     RESULT     |
+-------------------+------------------+------------------+----------------+
|     vping_ssh     |     functest     |      01:12       |      PASS      |
+-------------------+------------------+------------------+----------------+

2019-08-23 02:51:38,597 - xtesting.ci.run_tests - INFO - Loading test case 'vping_userdata'...
2019-08-23 02:51:40,301 - xtesting.ci.run_tests - INFO - Running test case 'vping_userdata'...
2019-08-23 02:52:15,467 - xtesting.core.testcase - INFO - The results were successfully pushed to DB
2019-08-23 02:52:15,467 - xtesting.ci.run_tests - INFO - Test result:

+------------------------+------------------+------------------+----------------+
|       TEST CASE        |     PROJECT      |     DURATION     |     RESULT     |
+------------------------+------------------+------------------+----------------+
|     vping_userdata     |     functest     |      00:35       |      PASS      |
+------------------------+------------------+------------------+----------------+

2019-08-23 02:52:30,006 - xtesting.ci.run_tests - INFO - Loading test case 'cinder_test'...
2019-08-23 02:52:31,893 - xtesting.ci.run_tests - INFO - Running test case 'cinder_test'...
2019-08-23 02:54:25,904 - xtesting.core.testcase - INFO - The results were successfully pushed to DB
2019-08-23 02:54:25,905 - xtesting.ci.run_tests - INFO - Test result:

+---------------------+------------------+------------------+----------------+
|      TEST CASE      |     PROJECT      |     DURATION     |     RESULT     |
+---------------------+------------------+------------------+----------------+
|     cinder_test     |     functest     |      01:54       |      PASS      |
+---------------------+------------------+------------------+----------------+

2019-08-23 02:54:45,675 - xtesting.ci.run_tests - INFO - Loading test case 'odl'...
2019-08-23 02:54:45,893 - xtesting.ci.run_tests - INFO - Running test case 'odl'...
[ WARN ] Deprecation Warning: Use Post Request in the future
2019-08-23 02:55:04,744 - xtesting.core.robotframework - INFO - 
==============================================================================
Basic & Neutron                                                               
==============================================================================
Basic & Neutron.Basic                                                         
==============================================================================
Basic & Neutron.Basic.Restconf Modules :: Test suite to verify Restconf is OK.
==============================================================================
Get Controller Modules :: Get the restconf modules, check 200 stat... | PASS |
------------------------------------------------------------------------------
Basic & Neutron.Basic.Restconf Modules :: Test suite to verify Res... | PASS |
1 critical test, 1 passed, 0 failed
1 test total, 1 passed, 0 failed
==============================================================================
Basic & Neutron.Basic                                                 | PASS |
1 critical test, 1 passed, 0 failed
1 test total, 1 passed, 0 failed
==============================================================================
Basic & Neutron.Neutron :: Test suite for Neutron Plugin                      
==============================================================================
Basic & Neutron.Neutron.Reachability                                          
==============================================================================
Get the complete list of networks :: Get the complete list of netw... | PASS |
------------------------------------------------------------------------------
Get the complete list of subnets :: Get the complete list of subnets  | PASS |
------------------------------------------------------------------------------
Get the complete list of ports :: Get the complete list of ports      | PASS |
------------------------------------------------------------------------------
Basic & Neutron.Neutron.Reachability                                  | PASS |
3 critical tests, 3 passed, 0 failed
3 tests total, 3 passed, 0 failed
==============================================================================
Basic & Neutron.Neutron.Networks :: Checking Network created in OpenStack a...
==============================================================================
Check OpenStack Networks :: Checking OpenStack Neutron for known n... | PASS |
------------------------------------------------------------------------------
Check OpenDaylight Networks :: Checking OpenDaylight Neutron API f... | PASS |
------------------------------------------------------------------------------
Create Network :: Create new network in OpenStack                     | PASS |
------------------------------------------------------------------------------
Check Network :: Check network created in OpenDaylight                | PASS |
------------------------------------------------------------------------------
Basic & Neutron.Neutron.Networks :: Checking Network created in Op... | PASS |
4 critical tests, 4 passed, 0 failed
4 tests total, 4 passed, 0 failed
==============================================================================
Basic & Neutron.Neutron.Subnets :: Checking Subnets created in OpenStack ar...
==============================================================================
Check OpenStack Subnets :: Checking OpenStack Neutron for known su... | PASS |
------------------------------------------------------------------------------
Check OpenDaylight subnets :: Checking OpenDaylight Neutron API fo... | PASS |
------------------------------------------------------------------------------
Create New subnet :: Create new subnet in OpenStack                   | PASS |
------------------------------------------------------------------------------
Check New subnet :: Check new subnet created in OpenDaylight          | PASS |
------------------------------------------------------------------------------
Basic & Neutron.Neutron.Subnets :: Checking Subnets created in Ope... | PASS |
4 critical tests, 4 passed, 0 failed
4 tests total, 4 passed, 0 failed
==============================================================================
Basic & Neutron.Neutron.Ports :: Checking Port created in OpenStack are pus...
==============================================================================
Check OpenStack ports :: Checking OpenStack Neutron for known ports   | PASS |
------------------------------------------------------------------------------
Check OpenDaylight ports :: Checking OpenDaylight Neutron API for ... | PASS |
------------------------------------------------------------------------------
Create New Port :: Create new port in OpenStack                       | PASS |
------------------------------------------------------------------------------
Check New Port :: Check new port created in OpenDaylight              | PASS |
------------------------------------------------------------------------------
Basic & Neutron.Neutron.Ports :: Checking Port created in OpenStac... | PASS |
4 critical tests, 4 passed, 0 failed
4 tests total, 4 passed, 0 failed
==============================================================================
Basic & Neutron.Neutron.Delete Ports :: Checking Port deleted in OpenStack ...
==============================================================================
Delete New Port :: Delete previously created port in OpenStack        | PASS |
------------------------------------------------------------------------------
Check Port Deleted :: Check port deleted in OpenDaylight              | PASS |
------------------------------------------------------------------------------
Basic & Neutron.Neutron.Delete Ports :: Checking Port deleted in O... | PASS |
2 critical tests, 2 passed, 0 failed
2 tests total, 2 passed, 0 failed
==============================================================================
Basic & Neutron.Neutron.Delete Subnets :: Checking Subnets deleted in OpenS...
==============================================================================
Delete New subnet :: Delete previously created subnet in OpenStack    | PASS |
------------------------------------------------------------------------------
Check New subnet deleted :: Check subnet deleted in OpenDaylight      | PASS |
------------------------------------------------------------------------------
Basic & Neutron.Neutron.Delete Subnets :: Checking Subnets deleted... | PASS |
2 critical tests, 2 passed, 0 failed
2 tests total, 2 passed, 0 failed
==============================================================================
Basic & Neutron.Neutron.Delete Networks :: Checking Network deleted in Open...
==============================================================================
Delete Network :: Delete network in OpenStack                         | PASS |
------------------------------------------------------------------------------
Check Network deleted :: Check network deleted in OpenDaylight        | PASS |
------------------------------------------------------------------------------
Basic & Neutron.Neutron.Delete Networks :: Checking Network delete... | PASS |
2 critical tests, 2 passed, 0 failed
2 tests total, 2 passed, 0 failed
==============================================================================
Basic & Neutron.Neutron :: Test suite for Neutron Plugin              | PASS |
21 critical tests, 21 passed, 0 failed
21 tests total, 21 passed, 0 failed
==============================================================================
Basic & Neutron                                                       | PASS |
22 critical tests, 22 passed, 0 failed
22 tests total, 22 passed, 0 failed
==============================================================================
Output:  /home/opnfv/functest/results/odl/output.xml

2019-08-23 02:55:04,767 - xtesting.core.robotframework - INFO - Results were successfully parsed
2019-08-23 02:55:04,886 - xtesting.core.robotframework - INFO - Results were successfully generated
2019-08-23 02:55:05,694 - xtesting.core.testcase - INFO - The results were successfully pushed to DB
2019-08-23 02:55:05,695 - xtesting.ci.run_tests - INFO - Test result:

+-------------------+------------------+------------------+----------------+
|     TEST CASE     |     PROJECT      |     DURATION     |     RESULT     |
+-------------------+------------------+------------------+----------------+
|        odl        |     functest     |      00:18       |      PASS      |
+-------------------+------------------+------------------+----------------+

2019-08-23 02:55:05,723 - xtesting.ci.run_tests - INFO - Loading test case 'tempest_smoke'...
2019-08-23 02:55:08,968 - xtesting.ci.run_tests - INFO - Running test case 'tempest_smoke'...
2019-08-23 02:59:50,907 - xtesting.core.testcase - INFO - The results were successfully pushed to DB
2019-08-23 02:59:50,907 - xtesting.ci.run_tests - INFO - Test result:

+-----------------------+------------------+------------------+----------------+
|       TEST CASE       |     PROJECT      |     DURATION     |     RESULT     |
+-----------------------+------------------+------------------+----------------+
|     tempest_smoke     |     functest     |      04:42       |      PASS      |
+-----------------------+------------------+------------------+----------------+

2019-08-23 03:00:00,460 - xtesting.ci.run_tests - INFO - Xtesting report:

+--------------------------+------------------+---------------------+------------------+----------------+
|        TEST CASE         |     PROJECT      |         TIER        |     DURATION     |     RESULT     |
+--------------------------+------------------+---------------------+------------------+----------------+
|     connection_check     |     functest     |     healthcheck     |      00:04       |      PASS      |
|      tenantnetwork1      |     functest     |     healthcheck     |      00:05       |      PASS      |
|      tenantnetwork2      |     functest     |     healthcheck     |      00:06       |      PASS      |
|         vmready1         |     functest     |     healthcheck     |      00:08       |      PASS      |
|         vmready2         |     functest     |     healthcheck     |      00:08       |      PASS      |
|        singlevm1         |     functest     |     healthcheck     |      00:35       |      PASS      |
|        singlevm2         |     functest     |     healthcheck     |      00:32       |      PASS      |
|        vping_ssh         |     functest     |     healthcheck     |      01:12       |      PASS      |
|      vping_userdata      |     functest     |     healthcheck     |      00:35       |      PASS      |
|       cinder_test        |     functest     |     healthcheck     |      01:54       |      PASS      |
|           odl            |     functest     |     healthcheck     |      00:18       |      PASS      |
|      tempest_smoke       |     functest     |     healthcheck     |      04:42       |      PASS      |
+--------------------------+------------------+---------------------+------------------+----------------+

2019-08-23 03:00:00,469 - xtesting.ci.run_tests - INFO - Execution exit value: Result.EX_OK
Functest: Pulling Functest Docker image opnfv/functest-smoke:hunter ...
Running Functest tier 'smoke'. CMD: docker run --rm  -e INSTALLER_TYPE=fuel -e INSTALLER_IP=10.20.0.2     -e NODE_NAME=ericsson-virtual1 -e DEPLOY_SCENARIO=os-odl-ovs-noha     -e BUILD_TAG=jenkins-functest-fuel-virtual-daily-hunter-641 -e DEPLOY_TYPE=virt -e CI_LOOP=daily     -e TEST_DB_URL=http://testresults.opnfv.org/test/api/v1/results -e ENERGY_RECORDER_API_URL=http://energy.opnfv.fr/resources     -e DEBUG=true -e POD_ARCH=x86_64 -e BLOCK_MIGRATION=false -e SDN_CONTROLLER_RESTCONFPORT=8080 -e IMAGE_PROPERTIES=hw_disk_bus:scsi,hw_scsi_model:virtio-scsi,hw_mem_page_size:large -e FLAVOR_EXTRA_SPECS=hw:mem_page_size:large -v /home/jenkins/opnfv/functest/images:/home/opnfv/functest/images -v /home/jenkins/opnfv/functest/results/hunter:/home/opnfv/functest/results -v /var/lib/opnfv/mcp.rsa:/root/.ssh/id_rsa       -v /home/jenkins/opnfv-openrc.sh:/home/opnfv/functest/conf/env_file      -v /tmp/tmp.w0EcQpIRTt:/usr/lib/python2.7/site-packages/functest/opnfv_tests/openstack/tempest/custom_tests/tempest_conf.yaml  opnfv/functest-smoke:hunter /bin/bash -c 'run_tests -r -t all'
2019-08-23 03:00:06,199 - xtesting.ci.run_tests - INFO - Deployment description:

+--------------------------------------+----------------------------------------------------------+
|               ENV VAR                |                          VALUE                           |
+--------------------------------------+----------------------------------------------------------+
|              BUILD_TAG               |      jenkins-functest-fuel-virtual-daily-hunter-641      |
|             TEST_DB_URL              |     http://testresults.opnfv.org/test/api/v1/results     |
|     ENERGY_RECORDER_API_PASSWORD     |                                                          |
|               CI_LOOP                |                          daily                           |
|                DEBUG                 |                           true                           |
|            INSTALLER_TYPE            |                           fuel                           |
|       ENERGY_RECORDER_API_URL        |             http://energy.opnfv.fr/resources             |
|           DEPLOY_SCENARIO            |                     os-odl-ovs-noha                      |
|       ENERGY_RECORDER_API_USER       |                                                          |
|              NODE_NAME               |                    ericsson-virtual1                     |
+--------------------------------------+----------------------------------------------------------+

2019-08-23 03:00:06,204 - xtesting.ci.run_tests - INFO - Sourcing env file /var/lib/xtesting/conf/env_file


export OS_IDENTITY_API_VERSION=3
export OS_PROJECT_DOMAIN_NAME=Default
export OS_USER_DOMAIN_NAME=Default
export OS_PROJECT_NAME=admin
export OS_TENANT_NAME=admin
export OS_USERNAME=admin
export OS_PASSWORD=opnfv_secret
export OS_REGION_NAME=RegionOne
export OS_INTERFACE=internal
export OS_ENDPOINT_TYPE="internal"
export OS_CACERT="/etc/ssl/certs/ca-certificates.crt"
export SDN_CONTROLLER_USER=admin
export SDN_CONTROLLER_RESTCONFPORT=8282
export SDN_CONTROLLER_PASSWORD=admin
export SDN_CONTROLLER_WEBPORT=8282
export SDN_CONTROLLER_IP=10.16.0.107
export VOLUME_DEVICE_NAME=sdc
export OS_AUTH_URL=http://172.16.10.36:35357/v3

2019-08-23 03:00:06,205 - xtesting.ci.run_tests - INFO - TESTS TO BE EXECUTED:

+---------------+---------------+------------------------------------------+-------------------------------------------------+
|     TIERS     |     ORDER     |               DESCRIPTION                |                    TESTCASES                    |
+---------------+---------------+------------------------------------------+-------------------------------------------------+
|     smoke     |       1       |     Set of basic Functional tests to     |     neutron-tempest-plugin-api rally_sanity     |
|               |               |      validate the OPNFV scenarios.       |          refstack_defcore tempest_full          |
|               |               |                                          |      tempest_scenario patrole neutron_trunk     |
|               |               |                                          |         networking-bgpvpn networking-sfc        |
|               |               |                                          |                     barbican                    |
+---------------+---------------+------------------------------------------+-------------------------------------------------+

2019-08-23 03:00:06,241 - xtesting.ci.run_tests - INFO - Loading test case 'neutron-tempest-plugin-api'...
2019-08-23 03:00:10,286 - xtesting.ci.run_tests - INFO - Running test case 'neutron-tempest-plugin-api'...
2019-08-23 03:11:48,170 - xtesting.core.testcase - INFO - The results were successfully pushed to DB
2019-08-23 03:11:48,170 - xtesting.ci.run_tests - INFO - Test result:

+------------------------------------+------------------+------------------+----------------+
|             TEST CASE              |     PROJECT      |     DURATION     |     RESULT     |
+------------------------------------+------------------+------------------+----------------+
|     neutron-tempest-plugin-api     |     functest     |      11:37       |      FAIL      |
+------------------------------------+------------------+------------------+----------------+

2019-08-23 03:11:58,482 - xtesting.ci.run_tests - ERROR - The test case 'neutron-tempest-plugin-api' failed.
2019-08-23 03:11:58,517 - xtesting.ci.run_tests - INFO - Loading test case 'rally_sanity'...
2019-08-23 03:12:00,897 - xtesting.ci.run_tests - INFO - Running test case 'rally_sanity'...
2019-08-23 03:30:33,162 - xtesting.core.testcase - INFO - The results were successfully pushed to DB
2019-08-23 03:30:33,163 - xtesting.ci.run_tests - INFO - Test result:

+----------------------+------------------+------------------+----------------+
|      TEST CASE       |     PROJECT      |     DURATION     |     RESULT     |
+----------------------+------------------+------------------+----------------+
|     rally_sanity     |     functest     |      18:32       |      FAIL      |
+----------------------+------------------+------------------+----------------+

2019-08-23 03:30:43,530 - xtesting.ci.run_tests - ERROR - The test case 'rally_sanity' failed.
2019-08-23 03:30:43,563 - xtesting.ci.run_tests - INFO - Loading test case 'refstack_defcore'...
2019-08-23 03:30:46,965 - xtesting.ci.run_tests - INFO - Running test case 'refstack_defcore'...
2019-08-23 03:38:59,084 - xtesting.core.testcase - INFO - The results were successfully pushed to DB
2019-08-23 03:38:59,084 - xtesting.ci.run_tests - INFO - Test result:

+--------------------------+------------------+------------------+----------------+
|        TEST CASE         |     PROJECT      |     DURATION     |     RESULT     |
+--------------------------+------------------+------------------+----------------+
|     refstack_defcore     |     functest     |      08:12       |      PASS      |
+--------------------------+------------------+------------------+----------------+

2019-08-23 03:39:09,226 - xtesting.ci.run_tests - INFO - Loading test case 'tempest_full'...
2019-08-23 03:39:12,552 - xtesting.ci.run_tests - INFO - Running test case 'tempest_full'...
2019-08-23 04:27:01,368 - xtesting.core.testcase - INFO - The results were successfully pushed to DB
2019-08-23 04:27:01,369 - xtesting.ci.run_tests - INFO - Test result:

+----------------------+------------------+------------------+----------------+
|      TEST CASE       |     PROJECT      |     DURATION     |     RESULT     |
+----------------------+------------------+------------------+----------------+
|     tempest_full     |     functest     |      47:48       |      FAIL      |
+----------------------+------------------+------------------+----------------+

2019-08-23 04:27:12,074 - xtesting.ci.run_tests - ERROR - The test case 'tempest_full' failed.
2019-08-23 04:27:12,111 - xtesting.ci.run_tests - INFO - Loading test case 'tempest_scenario'...
2019-08-23 04:27:15,431 - xtesting.ci.run_tests - INFO - Running test case 'tempest_scenario'...
2019-08-23 04:37:11,724 - xtesting.core.testcase - INFO - The results were successfully pushed to DB
2019-08-23 04:37:11,724 - xtesting.ci.run_tests - INFO - Test result:

+--------------------------+------------------+------------------+----------------+
|        TEST CASE         |     PROJECT      |     DURATION     |     RESULT     |
+--------------------------+------------------+------------------+----------------+
|     tempest_scenario     |     functest     |      09:56       |      PASS      |
+--------------------------+------------------+------------------+----------------+

2019-08-23 04:37:21,975 - xtesting.ci.run_tests - INFO - Loading test case 'patrole'...
2019-08-23 04:37:25,246 - xtesting.ci.run_tests - INFO - Running test case 'patrole'...
2019-08-23 04:40:33,802 - xtesting.core.testcase - INFO - The results were successfully pushed to DB
2019-08-23 04:40:33,802 - xtesting.ci.run_tests - INFO - Test result:

+-------------------+------------------+------------------+----------------+
|     TEST CASE     |     PROJECT      |     DURATION     |     RESULT     |
+-------------------+------------------+------------------+----------------+
|      patrole      |     functest     |      03:08       |      PASS      |
+-------------------+------------------+------------------+----------------+

2019-08-23 04:40:43,796 - xtesting.ci.run_tests - INFO - Loading test case 'neutron_trunk'...
2019-08-23 04:40:47,230 - xtesting.ci.run_tests - INFO - Running test case 'neutron_trunk'...
2019-08-23 04:43:28,378 - xtesting.core.testcase - INFO - The results were successfully pushed to DB
2019-08-23 04:43:28,378 - xtesting.ci.run_tests - INFO - Test result:

+-----------------------+------------------+------------------+----------------+
|       TEST CASE       |     PROJECT      |     DURATION     |     RESULT     |
+-----------------------+------------------+------------------+----------------+
|     neutron_trunk     |     functest     |      02:41       |      PASS      |
+-----------------------+------------------+------------------+----------------+

2019-08-23 04:43:38,487 - xtesting.ci.run_tests - INFO - Loading test case 'networking-bgpvpn'...
2019-08-23 04:43:41,768 - functest.opnfv_tests.openstack.tempest.tempest - WARNING - Cannot find Neutron extension: bgpvpn
2019-08-23 04:43:42,294 - xtesting.ci.run_tests - INFO - Skipping test case 'networking-bgpvpn'...
2019-08-23 04:43:42,294 - xtesting.ci.run_tests - INFO - Test result:

+---------------------------+------------------+------------------+----------------+
|         TEST CASE         |     PROJECT      |     DURATION     |     RESULT     |
+---------------------------+------------------+------------------+----------------+
|     networking-bgpvpn     |     functest     |      00:00       |      SKIP      |
+---------------------------+------------------+------------------+----------------+

2019-08-23 04:43:42,329 - xtesting.ci.run_tests - INFO - Loading test case 'networking-sfc'...
2019-08-23 04:43:45,560 - functest.opnfv_tests.openstack.tempest.tempest - WARNING - Cannot find Neutron extension: sfc
2019-08-23 04:43:46,102 - xtesting.ci.run_tests - INFO - Skipping test case 'networking-sfc'...
2019-08-23 04:43:46,102 - xtesting.ci.run_tests - INFO - Test result:

+------------------------+------------------+------------------+----------------+
|       TEST CASE        |     PROJECT      |     DURATION     |     RESULT     |
+------------------------+------------------+------------------+----------------+
|     networking-sfc     |     functest     |      00:00       |      SKIP      |
+------------------------+------------------+------------------+----------------+

2019-08-23 04:43:46,139 - xtesting.ci.run_tests - INFO - Loading test case 'barbican'...
2019-08-23 04:43:49,810 - xtesting.ci.run_tests - INFO - Running test case 'barbican'...
2019-08-23 04:46:33,208 - xtesting.core.testcase - INFO - The results were successfully pushed to DB
2019-08-23 04:46:33,208 - xtesting.ci.run_tests - INFO - Test result:

+-------------------+------------------+------------------+----------------+
|     TEST CASE     |     PROJECT      |     DURATION     |     RESULT     |
+-------------------+------------------+------------------+----------------+
|      barbican     |     functest     |      02:43       |      PASS      |
+-------------------+------------------+------------------+----------------+

2019-08-23 04:46:43,304 - xtesting.ci.run_tests - INFO - Xtesting report:

+------------------------------------+------------------+---------------+------------------+----------------+
|             TEST CASE              |     PROJECT      |      TIER     |     DURATION     |     RESULT     |
+------------------------------------+------------------+---------------+------------------+----------------+
|     neutron-tempest-plugin-api     |     functest     |     smoke     |      11:37       |      FAIL      |
|            rally_sanity            |     functest     |     smoke     |      18:32       |      FAIL      |
|          refstack_defcore          |     functest     |     smoke     |      08:12       |      PASS      |
|            tempest_full            |     functest     |     smoke     |      47:48       |      FAIL      |
|          tempest_scenario          |     functest     |     smoke     |      09:56       |      PASS      |
|              patrole               |     functest     |     smoke     |      03:08       |      PASS      |
|           neutron_trunk            |     functest     |     smoke     |      02:41       |      PASS      |
|         networking-bgpvpn          |     functest     |     smoke     |      00:00       |      SKIP      |
|           networking-sfc           |     functest     |     smoke     |      00:00       |      SKIP      |
|              barbican              |     functest     |     smoke     |      02:43       |      PASS      |
+------------------------------------+------------------+---------------+------------------+----------------+

2019-08-23 04:46:43,312 - xtesting.ci.run_tests - INFO - Execution exit value: Result.EX_ERROR
Functest: Pulling Functest Docker image opnfv/functest-benchmarking:hunter ...
Running Functest tier 'benchmarking'. CMD: docker run --rm  -e INSTALLER_TYPE=fuel -e INSTALLER_IP=10.20.0.2     -e NODE_NAME=ericsson-virtual1 -e DEPLOY_SCENARIO=os-odl-ovs-noha     -e BUILD_TAG=jenkins-functest-fuel-virtual-daily-hunter-641 -e DEPLOY_TYPE=virt -e CI_LOOP=daily     -e TEST_DB_URL=http://testresults.opnfv.org/test/api/v1/results -e ENERGY_RECORDER_API_URL=http://energy.opnfv.fr/resources     -e DEBUG=true -e POD_ARCH=x86_64 -e BLOCK_MIGRATION=false -e SDN_CONTROLLER_RESTCONFPORT=8080 -e IMAGE_PROPERTIES=hw_disk_bus:scsi,hw_scsi_model:virtio-scsi,hw_mem_page_size:large -e FLAVOR_EXTRA_SPECS=hw:mem_page_size:large -v /home/jenkins/opnfv/functest/images:/home/opnfv/functest/images -v /home/jenkins/opnfv/functest/results/hunter:/home/opnfv/functest/results -v /var/lib/opnfv/mcp.rsa:/root/.ssh/id_rsa       -v /home/jenkins/opnfv-openrc.sh:/home/opnfv/functest/conf/env_file      -v /tmp/tmp.w0EcQpIRTt:/usr/lib/python2.7/site-packages/functest/opnfv_tests/openstack/tempest/custom_tests/tempest_conf.yaml  opnfv/functest-benchmarking:hunter /bin/bash -c 'run_tests -r -t all'
2019-08-23 04:46:47,742 - xtesting.ci.run_tests - INFO - Deployment description:

+--------------------------------------+----------------------------------------------------------+
|               ENV VAR                |                          VALUE                           |
+--------------------------------------+----------------------------------------------------------+
|              BUILD_TAG               |      jenkins-functest-fuel-virtual-daily-hunter-641      |
|             TEST_DB_URL              |     http://testresults.opnfv.org/test/api/v1/results     |
|     ENERGY_RECORDER_API_PASSWORD     |                                                          |
|               CI_LOOP                |                          daily                           |
|                DEBUG                 |                           true                           |
|            INSTALLER_TYPE            |                           fuel                           |
|       ENERGY_RECORDER_API_URL        |             http://energy.opnfv.fr/resources             |
|           DEPLOY_SCENARIO            |                     os-odl-ovs-noha                      |
|       ENERGY_RECORDER_API_USER       |                                                          |
|              NODE_NAME               |                    ericsson-virtual1                     |
+--------------------------------------+----------------------------------------------------------+

2019-08-23 04:46:47,748 - xtesting.ci.run_tests - INFO - Sourcing env file /var/lib/xtesting/conf/env_file


export OS_IDENTITY_API_VERSION=3
export OS_PROJECT_DOMAIN_NAME=Default
export OS_USER_DOMAIN_NAME=Default
export OS_PROJECT_NAME=admin
export OS_TENANT_NAME=admin
export OS_USERNAME=admin
export OS_PASSWORD=opnfv_secret
export OS_REGION_NAME=RegionOne
export OS_INTERFACE=internal
export OS_ENDPOINT_TYPE="internal"
export OS_CACERT="/etc/ssl/certs/ca-certificates.crt"
export SDN_CONTROLLER_USER=admin
export SDN_CONTROLLER_RESTCONFPORT=8282
export SDN_CONTROLLER_PASSWORD=admin
export SDN_CONTROLLER_WEBPORT=8282
export SDN_CONTROLLER_IP=10.16.0.107
export VOLUME_DEVICE_NAME=sdc
export OS_AUTH_URL=http://172.16.10.36:35357/v3

2019-08-23 04:46:47,749 - xtesting.ci.run_tests - INFO - TESTS TO BE EXECUTED:

+----------------------+---------------+-------------------------------------------------+-------------------------------------------+
|        TIERS         |     ORDER     |                   DESCRIPTION                   |                 TESTCASES                 |
+----------------------+---------------+-------------------------------------------------+-------------------------------------------+
|     benchmarking     |       2       |     Run several OpenStack performance tools     |     rally_full rally_jobs vmtp shaker     |
|                      |               |     https://docs.openstack.org/performance-     |                                           |
|                      |               |       docs/latest/methodologies/tools.html      |                                           |
+----------------------+---------------+-------------------------------------------------+-------------------------------------------+

2019-08-23 04:46:47,762 - xtesting.ci.run_tests - INFO - Loading test case 'rally_full'...
2019-08-23 04:46:50,377 - xtesting.ci.run_tests - INFO - Running test case 'rally_full'...
2019-08-23 06:32:11,411 - xtesting.core.testcase - INFO - The results were successfully pushed to DB
2019-08-23 06:32:11,411 - xtesting.ci.run_tests - INFO - Test result:

+--------------------+------------------+------------------+----------------+
|     TEST CASE      |     PROJECT      |     DURATION     |     RESULT     |
+--------------------+------------------+------------------+----------------+
|     rally_full     |     functest     |      105:21      |      FAIL      |
+--------------------+------------------+------------------+----------------+

2019-08-23 06:32:22,629 - xtesting.ci.run_tests - ERROR - The test case 'rally_full' failed.
2019-08-23 06:32:22,642 - xtesting.ci.run_tests - INFO - Loading test case 'rally_jobs'...
2019-08-23 06:32:24,713 - xtesting.ci.run_tests - INFO - Running test case 'rally_jobs'...
2019-08-23 07:24:12,995 - xtesting.core.testcase - INFO - The results were successfully pushed to DB
2019-08-23 07:24:12,996 - xtesting.ci.run_tests - INFO - Test result:

+--------------------+------------------+------------------+----------------+
|     TEST CASE      |     PROJECT      |     DURATION     |     RESULT     |
+--------------------+------------------+------------------+----------------+
|     rally_jobs     |     functest     |      51:48       |      PASS      |
+--------------------+------------------+------------------+----------------+

2019-08-23 07:24:24,960 - xtesting.ci.run_tests - INFO - Loading test case 'vmtp'...
2019-08-23 07:24:27,568 - xtesting.ci.run_tests - INFO - Running test case 'vmtp'...
2019-08-23 07:42:11,558 - xtesting.core.testcase - INFO - The results were successfully pushed to DB
2019-08-23 07:42:11,559 - xtesting.ci.run_tests - INFO - Test result:

+-------------------+------------------+------------------+----------------+
|     TEST CASE     |     PROJECT      |     DURATION     |     RESULT     |
+-------------------+------------------+------------------+----------------+
|        vmtp       |     functest     |      17:44       |      PASS      |
+-------------------+------------------+------------------+----------------+

2019-08-23 07:42:15,770 - xtesting.ci.run_tests - INFO - Loading test case 'shaker'...
2019-08-23 07:42:17,955 - xtesting.ci.run_tests - INFO - Running test case 'shaker'...
2019-08-23 08:44:04,646 - functest.opnfv_tests.openstack.shaker.shaker - ERROR - cannot get report files
Traceback (most recent call last):
  File "/usr/lib/python2.7/site-packages/functest/opnfv_tests/openstack/shaker/shaker.py", line 125, in execute
    scpc.get('report.json', self.res_dir)
  File "/usr/lib/python2.7/site-packages/scp.py", line 217, in get
    self._recv_all()
  File "/usr/lib/python2.7/site-packages/scp.py", line 367, in _recv_all
    raise SCPException(asunicode(msg[1:]))
SCPException: scp: report.json: No such file or directory
2019-08-23 08:44:04,931 - xtesting.core.testcase - INFO - The results were successfully pushed to DB
2019-08-23 08:44:04,931 - xtesting.ci.run_tests - INFO - Test result:

+-------------------+------------------+------------------+----------------+
|     TEST CASE     |     PROJECT      |     DURATION     |     RESULT     |
+-------------------+------------------+------------------+----------------+
|       shaker      |     functest     |      61:47       |      FAIL      |
+-------------------+------------------+------------------+----------------+

2019-08-23 08:44:22,392 - xtesting.ci.run_tests - ERROR - The test case 'shaker' failed.
2019-08-23 08:44:22,392 - xtesting.ci.run_tests - INFO - Xtesting report:

+--------------------+------------------+----------------------+------------------+----------------+
|     TEST CASE      |     PROJECT      |         TIER         |     DURATION     |     RESULT     |
+--------------------+------------------+----------------------+------------------+----------------+
|     rally_full     |     functest     |     benchmarking     |      105:21      |      FAIL      |
|     rally_jobs     |     functest     |     benchmarking     |      51:48       |      PASS      |
|        vmtp        |     functest     |     benchmarking     |      17:44       |      PASS      |
|       shaker       |     functest     |     benchmarking     |      61:47       |      FAIL      |
+--------------------+------------------+----------------------+------------------+----------------+

2019-08-23 08:44:22,397 - xtesting.ci.run_tests - INFO - Execution exit value: Result.EX_ERROR
Functest: Pulling Functest Docker image opnfv/functest-features:hunter ...
Running Functest tier 'features'. CMD: docker run --rm  -e INSTALLER_TYPE=fuel -e INSTALLER_IP=10.20.0.2     -e NODE_NAME=ericsson-virtual1 -e DEPLOY_SCENARIO=os-odl-ovs-noha     -e BUILD_TAG=jenkins-functest-fuel-virtual-daily-hunter-641 -e DEPLOY_TYPE=virt -e CI_LOOP=daily     -e TEST_DB_URL=http://testresults.opnfv.org/test/api/v1/results -e ENERGY_RECORDER_API_URL=http://energy.opnfv.fr/resources     -e DEBUG=true -e POD_ARCH=x86_64 -e BLOCK_MIGRATION=false -e SDN_CONTROLLER_RESTCONFPORT=8080 -e IMAGE_PROPERTIES=hw_disk_bus:scsi,hw_scsi_model:virtio-scsi,hw_mem_page_size:large -e FLAVOR_EXTRA_SPECS=hw:mem_page_size:large -v /home/jenkins/opnfv/functest/images:/home/opnfv/functest/images -v /home/jenkins/opnfv/functest/results/hunter:/home/opnfv/functest/results -v /var/lib/opnfv/mcp.rsa:/root/.ssh/id_rsa       -v /home/jenkins/opnfv-openrc.sh:/home/opnfv/functest/conf/env_file      -v /tmp/tmp.w0EcQpIRTt:/usr/lib/python2.7/site-packages/functest/opnfv_tests/openstack/tempest/custom_tests/tempest_conf.yaml  opnfv/functest-features:hunter /bin/bash -c 'run_tests -r -t all'
2019-08-23 08:44:26,696 - xtesting.ci.run_tests - INFO - Deployment description:

+--------------------------------------+----------------------------------------------------------+
|               ENV VAR                |                          VALUE                           |
+--------------------------------------+----------------------------------------------------------+
|              BUILD_TAG               |      jenkins-functest-fuel-virtual-daily-hunter-641      |
|             TEST_DB_URL              |     http://testresults.opnfv.org/test/api/v1/results     |
|     ENERGY_RECORDER_API_PASSWORD     |                                                          |
|               CI_LOOP                |                          daily                           |
|                DEBUG                 |                           true                           |
|            INSTALLER_TYPE            |                           fuel                           |
|       ENERGY_RECORDER_API_URL        |             http://energy.opnfv.fr/resources             |
|           DEPLOY_SCENARIO            |                     os-odl-ovs-noha                      |
|       ENERGY_RECORDER_API_USER       |                                                          |
|              NODE_NAME               |                    ericsson-virtual1                     |
+--------------------------------------+----------------------------------------------------------+

2019-08-23 08:44:26,701 - xtesting.ci.run_tests - INFO - Sourcing env file /var/lib/xtesting/conf/env_file


export OS_IDENTITY_API_VERSION=3
export OS_PROJECT_DOMAIN_NAME=Default
export OS_USER_DOMAIN_NAME=Default
export OS_PROJECT_NAME=admin
export OS_TENANT_NAME=admin
export OS_USERNAME=admin
export OS_PASSWORD=opnfv_secret
export OS_REGION_NAME=RegionOne
export OS_INTERFACE=internal
export OS_ENDPOINT_TYPE="internal"
export OS_CACERT="/etc/ssl/certs/ca-certificates.crt"
export SDN_CONTROLLER_USER=admin
export SDN_CONTROLLER_RESTCONFPORT=8282
export SDN_CONTROLLER_PASSWORD=admin
export SDN_CONTROLLER_WEBPORT=8282
export SDN_CONTROLLER_IP=10.16.0.107
export VOLUME_DEVICE_NAME=sdc
export OS_AUTH_URL=http://172.16.10.36:35357/v3

2019-08-23 08:44:26,703 - xtesting.ci.run_tests - INFO - TESTS TO BE EXECUTED:

+------------------+---------------+-------------------------------------------+-----------------------------+
|      TIERS       |     ORDER     |                DESCRIPTION                |          TESTCASES          |
+------------------+---------------+-------------------------------------------+-----------------------------+
|     features     |       3       |     Test suites from feature projects     |     doctor-notification     |
|                  |               |           integrated in functest          |                             |
+------------------+---------------+-------------------------------------------+-----------------------------+

2019-08-23 08:44:26,719 - xtesting.ci.run_tests - INFO - Loading test case 'doctor-notification'...
2019-08-23 08:44:26,794 - xtesting.ci.run_tests - INFO - Running test case 'doctor-notification'...
2019-08-23 08:44:26,795 - xtesting.core.feature - INFO - Calling doctor-test
2019-08-23 08:48:55,111 - xtesting.core.testcase - INFO - The results were successfully pushed to DB
2019-08-23 08:48:55,111 - xtesting.ci.run_tests - INFO - Test result:

+-----------------------------+-----------------+------------------+----------------+
|          TEST CASE          |     PROJECT     |     DURATION     |     RESULT     |
+-----------------------------+-----------------+------------------+----------------+
|     doctor-notification     |      doctor     |      04:28       |      PASS      |
+-----------------------------+-----------------+------------------+----------------+

2019-08-23 08:48:55,113 - xtesting.ci.run_tests - INFO - Xtesting report:

+-----------------------------+-------------------+------------------+------------------+----------------+
|          TEST CASE          |      PROJECT      |       TIER       |     DURATION     |     RESULT     |
+-----------------------------+-------------------+------------------+------------------+----------------+
|     doctor-notification     |       doctor      |     features     |      04:28       |      PASS      |
|       functest-odl-sfc      |        sfc        |     features     |      00:00       |      SKIP      |
|      barometercollectd      |     barometer     |     features     |      00:00       |      SKIP      |
|             vgpu            |      functest     |     features     |      00:00       |      SKIP      |
|         stor4nfv_os         |      stor4nfv     |     features     |      00:00       |      SKIP      |
+-----------------------------+-------------------+------------------+------------------+----------------+

2019-08-23 08:48:55,117 - xtesting.ci.run_tests - INFO - Execution exit value: Result.EX_OK
Functest: Pulling Functest Docker image opnfv/functest-vnf:hunter ...
Running Functest tier 'vnf'. CMD: docker run --rm  -e INSTALLER_TYPE=fuel -e INSTALLER_IP=10.20.0.2     -e NODE_NAME=ericsson-virtual1 -e DEPLOY_SCENARIO=os-odl-ovs-noha     -e BUILD_TAG=jenkins-functest-fuel-virtual-daily-hunter-641 -e DEPLOY_TYPE=virt -e CI_LOOP=daily     -e TEST_DB_URL=http://testresults.opnfv.org/test/api/v1/results -e ENERGY_RECORDER_API_URL=http://energy.opnfv.fr/resources     -e DEBUG=true -e POD_ARCH=x86_64 -e BLOCK_MIGRATION=false -e SDN_CONTROLLER_RESTCONFPORT=8080 -e IMAGE_PROPERTIES=hw_disk_bus:scsi,hw_scsi_model:virtio-scsi,hw_mem_page_size:large -e FLAVOR_EXTRA_SPECS=hw:mem_page_size:large -v /home/jenkins/opnfv/functest/images:/home/opnfv/functest/images -v /home/jenkins/opnfv/functest/results/hunter:/home/opnfv/functest/results -v /var/lib/opnfv/mcp.rsa:/root/.ssh/id_rsa       -v /home/jenkins/opnfv-openrc.sh:/home/opnfv/functest/conf/env_file      -v /tmp/tmp.w0EcQpIRTt:/usr/lib/python2.7/site-packages/functest/opnfv_tests/openstack/tempest/custom_tests/tempest_conf.yaml  opnfv/functest-vnf:hunter /bin/bash -c 'run_tests -r -t all'
2019-08-23 08:48:58,655 - xtesting.ci.run_tests - INFO - Deployment description:

+--------------------------------------+----------------------------------------------------------+
|               ENV VAR                |                          VALUE                           |
+--------------------------------------+----------------------------------------------------------+
|              BUILD_TAG               |      jenkins-functest-fuel-virtual-daily-hunter-641      |
|             TEST_DB_URL              |     http://testresults.opnfv.org/test/api/v1/results     |
|     ENERGY_RECORDER_API_PASSWORD     |                                                          |
|               CI_LOOP                |                          daily                           |
|                DEBUG                 |                           true                           |
|            INSTALLER_TYPE            |                           fuel                           |
|       ENERGY_RECORDER_API_URL        |             http://energy.opnfv.fr/resources             |
|           DEPLOY_SCENARIO            |                     os-odl-ovs-noha                      |
|       ENERGY_RECORDER_API_USER       |                                                          |
|              NODE_NAME               |                    ericsson-virtual1                     |
+--------------------------------------+----------------------------------------------------------+

2019-08-23 08:48:58,659 - xtesting.ci.run_tests - INFO - Sourcing env file /var/lib/xtesting/conf/env_file


export OS_IDENTITY_API_VERSION=3
export OS_PROJECT_DOMAIN_NAME=Default
export OS_USER_DOMAIN_NAME=Default
export OS_PROJECT_NAME=admin
export OS_TENANT_NAME=admin
export OS_USERNAME=admin
export OS_PASSWORD=opnfv_secret
export OS_REGION_NAME=RegionOne
export OS_INTERFACE=internal
export OS_ENDPOINT_TYPE="internal"
export OS_CACERT="/etc/ssl/certs/ca-certificates.crt"
export SDN_CONTROLLER_USER=admin
export SDN_CONTROLLER_RESTCONFPORT=8282
export SDN_CONTROLLER_PASSWORD=admin
export SDN_CONTROLLER_WEBPORT=8282
export SDN_CONTROLLER_IP=10.16.0.107
export VOLUME_DEVICE_NAME=sdc
export OS_AUTH_URL=http://172.16.10.36:35357/v3

2019-08-23 08:48:58,660 - xtesting.ci.run_tests - INFO - TESTS TO BE EXECUTED:

+---------------+---------------+---------------------------------------+----------------------------------------+
|     TIERS     |     ORDER     |              DESCRIPTION              |               TESTCASES                |
+---------------+---------------+---------------------------------------+----------------------------------------+
|      vnf      |       4       |     Collection of VNF test cases.     |     cloudify cloudify_ims heat_ims     |
|               |               |                                       |         vyos_vrouter juju_epc          |
+---------------+---------------+---------------------------------------+----------------------------------------+

2019-08-23 08:48:58,671 - xtesting.ci.run_tests - INFO - Loading test case 'cloudify'...
2019-08-23 08:49:00,717 - xtesting.ci.run_tests - INFO - Running test case 'cloudify'...
2019-08-23 08:55:13,568 - functest.core.cloudify - INFO - Attemps running status of the Manager
2019-08-23 08:55:44,121 - functest.core.cloudify - INFO - The current manager status is running
2019-08-23 08:55:44,618 - functest.core.cloudify - INFO - Secrets API successfully reached
2019-08-23 08:55:44,619 - functest.core.cloudify - INFO - Cloudify Manager is up and running
2019-08-23 08:55:44,915 - xtesting.core.testcase - INFO - The results were successfully pushed to DB
2019-08-23 08:55:44,916 - xtesting.ci.run_tests - INFO - Test result:

+-------------------+------------------+------------------+----------------+
|     TEST CASE     |     PROJECT      |     DURATION     |     RESULT     |
+-------------------+------------------+------------------+----------------+
|      cloudify     |     functest     |      06:44       |      PASS      |
+-------------------+------------------+------------------+----------------+

2019-08-23 08:56:03,030 - xtesting.ci.run_tests - INFO - Loading test case 'cloudify_ims'...
2019-08-23 08:56:05,345 - xtesting.ci.run_tests - INFO - Running test case 'cloudify_ims'...
2019-08-23 09:02:59,714 - functest.core.cloudify - INFO - Attemps running status of the Manager
2019-08-23 09:03:30,286 - functest.core.cloudify - INFO - The current manager status is running
2019-08-23 09:03:30,756 - functest.core.cloudify - INFO - Secrets API successfully reached
2019-08-23 09:03:30,756 - functest.core.cloudify - INFO - Cloudify Manager is up and running
2019-08-23 09:03:32,321 - functest.core.cloudify - INFO - Put private keypair in manager
2019-08-23 09:07:28,431 - functest.core.singlevm - ERROR - Cannot run cloudify_ims
Traceback (most recent call last):
  File "/usr/lib/python2.7/site-packages/functest/core/singlevm.py", line 468, in run
    if not self.execute():
  File "/usr/lib/python2.7/site-packages/functest/opnfv_tests/vnf/ims/cloudify_ims.py", line 166, in execute
    if self.deploy_vnf() and self.test_vnf():
  File "/usr/lib/python2.7/site-packages/functest/opnfv_tests/vnf/ims/cloudify_ims.py", line 217, in deploy_vnf
    self.cfy_client, execution, self.__logger, timeout=3600)
  File "/usr/lib/python2.7/site-packages/functest/core/cloudify.py", line 182, in wait_for_execution
    sort='@timestamp').items
  File "/usr/lib/python2.7/site-packages/cloudify_rest_client/events.py", line 77, in list
    response = self.api.get(uri, _include=_include, params=params)
  File "/usr/lib/python2.7/site-packages/cloudify_rest_client/client.py", line 252, in get
    timeout=timeout)
  File "/usr/lib/python2.7/site-packages/cloudify_rest_client/client.py", line 233, in do_request
    'SSL, but the client does'.format(e)
ConnectionError: HTTPConnectionPool(host='10.16.0.123', port=80): Max retries exceeded with url: /api/v3.1/events?_offset=438&type=cloudify_event&type=cloudify_log&execution_id=6feeac0c-3de5-4613-8c2e-c66f3ebfe71c&_sort=%40timestamp&_size=50 (Caused by NewConnectionError('<urllib3.connection.HTTPConnection object at 0x7f0a7e820810>: Failed to establish a new connection: [Errno 110] Operation timed out',))
This can happen when the manager is not working with SSL, but the client does
2019-08-23 09:07:28,710 - xtesting.core.testcase - INFO - The results were successfully pushed to DB
2019-08-23 09:07:28,710 - xtesting.ci.run_tests - INFO - Test result:

+----------------------+------------------+------------------+----------------+
|      TEST CASE       |     PROJECT      |     DURATION     |     RESULT     |
+----------------------+------------------+------------------+----------------+
|     cloudify_ims     |     functest     |      11:23       |      FAIL      |
+----------------------+------------------+------------------+----------------+

2019-08-23 09:07:28,714 - functest.core.cloudify - INFO - Deleting the current deployment
2019-08-23 09:09:39,503 - functest.core.cloudify - ERROR - Some issue during the undeployment ..
Traceback (most recent call last):
  File "/usr/lib/python2.7/site-packages/functest/core/cloudify.py", line 143, in kill_existing_execution
    exec_list = self.cfy_client.executions.list()
  File "/usr/lib/python2.7/site-packages/cloudify_rest_client/executions.py", line 139, in list
    _include=_include)
  File "/usr/lib/python2.7/site-packages/cloudify_rest_client/client.py", line 252, in get
    timeout=timeout)
  File "/usr/lib/python2.7/site-packages/cloudify_rest_client/client.py", line 233, in do_request
    'SSL, but the client does'.format(e)
ConnectionError: HTTPConnectionPool(host='10.16.0.123', port=80): Max retries exceeded with url: /api/v3.1/executions?_include_system_workflows=False (Caused by NewConnectionError('<urllib3.connection.HTTPConnection object at 0x7f0a7e833350>: Failed to establish a new connection: [Errno 110] Operation timed out',))
This can happen when the manager is not working with SSL, but the client does
2019-08-23 09:09:51,714 - functest.core.tenantnetwork - ERROR - cannot clean all resources
Traceback (most recent call last):
  File "/usr/lib/python2.7/site-packages/functest/core/tenantnetwork.py", line 284, in clean
    self.cloud.delete_subnet(self.subnet.id)
  File "/usr/lib/python2.7/site-packages/shade/openstackcloud.py", line 7680, in delete_subnet
    "/subnets/{subnet_id}.json".format(subnet_id=subnet['id']))
  File "/usr/lib/python2.7/site-packages/keystoneauth1/adapter.py", line 343, in delete
    return self.request(url, 'DELETE', **kwargs)
  File "/usr/lib/python2.7/site-packages/openstack/_adapter.py", line 164, in request
    return _json_response(response, error_message=error_message)
  File "/usr/lib/python2.7/site-packages/openstack/_adapter.py", line 95, in _json_response
    exceptions.raise_from_response(response, error_message=error_message)
  File "/usr/lib/python2.7/site-packages/openstack/exceptions.py", line 229, in raise_from_response
    http_status=http_status, request_id=request_id
ConflictException: ConflictException: 409: Client Error for url: http://172.16.10.36:9696/v2.0/subnets/4009a86a-1980-461f-90d6-f3489dea7568.json, Unable to complete operation on subnet 4009a86a-1980-461f-90d6-f3489dea7568: One or more ports have an IP allocation from this subnet.
2019-08-23 09:09:53,814 - functest.core.tenantnetwork - ERROR - Cannot clean all resources
Traceback (most recent call last):
  File "/usr/lib/python2.7/site-packages/functest/core/tenantnetwork.py", line 129, in clean
    self.orig_cloud.delete_security_group(sec_id)
  File "/usr/lib/python2.7/site-packages/shade/openstackcloud.py", line 7987, in delete_security_group
    name_or_id)
  File "/usr/lib/python2.7/site-packages/keystoneauth1/adapter.py", line 343, in delete
    return self.request(url, 'DELETE', **kwargs)
  File "/usr/lib/python2.7/site-packages/openstack/_adapter.py", line 164, in request
    return _json_response(response, error_message=error_message)
  File "/usr/lib/python2.7/site-packages/openstack/_adapter.py", line 95, in _json_response
    exceptions.raise_from_response(response, error_message=error_message)
  File "/usr/lib/python2.7/site-packages/openstack/exceptions.py", line 229, in raise_from_response
    http_status=http_status, request_id=request_id
ConflictException: Error deleting security group fc81e3cf-22b7-4ce9-9c6f-9001f509b6c0: Client Error for url: http://172.16.10.36:9696/v2.0/security-groups/fc81e3cf-22b7-4ce9-9c6f-9001f509b6c0.json, Security Group fc81e3cf-22b7-4ce9-9c6f-9001f509b6c0 in use.
2019-08-23 09:09:53,815 - xtesting.ci.run_tests - ERROR - The test case 'cloudify_ims' failed.
2019-08-23 09:09:53,827 - xtesting.ci.run_tests - INFO - Loading test case 'heat_ims'...
2019-08-23 09:09:55,736 - xtesting.ci.run_tests - INFO - Running test case 'heat_ims'...
2019-08-23 09:36:56,308 - functest.opnfv_tests.vnf.ims.heat_ims - ERROR - Cannot run heat_ims
Traceback (most recent call last):
  File "/usr/lib/python2.7/site-packages/functest/opnfv_tests/vnf/ims/heat_ims.py", line 143, in run
    if not self.execute():
  File "/usr/lib/python2.7/site-packages/functest/opnfv_tests/vnf/ims/heat_ims.py", line 120, in execute
    if self.deploy_vnf() and self.test_vnf():
  File "/usr/lib/python2.7/site-packages/functest/opnfv_tests/vnf/ims/heat_ims.py", line 188, in deploy_vnf
    self._monit()
  File "/usr/lib/python2.7/site-packages/functest/opnfv_tests/vnf/ims/heat_ims.py", line 163, in _monit
    key_filename=self.key_filename, timeout=timeout)
  File "/usr/lib/python2.7/site-packages/paramiko/client.py", line 329, in connect
    to_try = list(self._families_and_addresses(hostname, port))
  File "/usr/lib/python2.7/site-packages/paramiko/client.py", line 200, in _families_and_addresses
    hostname, port, socket.AF_UNSPEC, socket.SOCK_STREAM)
gaierror: [Errno -2] Name does not resolve
2019-08-23 09:36:56,585 - xtesting.core.testcase - INFO - The results were successfully pushed to DB
2019-08-23 09:36:56,585 - xtesting.ci.run_tests - INFO - Test result:

+-------------------+------------------+------------------+----------------+
|     TEST CASE     |     PROJECT      |     DURATION     |     RESULT     |
+-------------------+------------------+------------------+----------------+
|      heat_ims     |     functest     |      27:01       |      FAIL      |
+-------------------+------------------+------------------+----------------+

2019-08-23 09:38:13,878 - xtesting.ci.run_tests - ERROR - The test case 'heat_ims' failed.
2019-08-23 09:38:13,889 - xtesting.ci.run_tests - INFO - Loading test case 'vyos_vrouter'...
2019-08-23 09:38:16,086 - xtesting.ci.run_tests - INFO - Running test case 'vyos_vrouter'...
2019-08-23 09:44:37,080 - functest.core.cloudify - INFO - Attemps running status of the Manager
2019-08-23 09:45:07,691 - functest.core.cloudify - INFO - The current manager status is running
2019-08-23 09:45:08,286 - functest.core.cloudify - INFO - Secrets API successfully reached
2019-08-23 09:45:08,286 - functest.core.cloudify - INFO - Cloudify Manager is up and running
2019-08-23 09:45:08,286 - functest.core.cloudify - INFO - Put private keypair in manager
2019-08-23 09:55:42,397 - xtesting.core.testcase - INFO - The results were successfully pushed to DB
2019-08-23 09:55:42,398 - xtesting.ci.run_tests - INFO - Test result:

+----------------------+------------------+------------------+----------------+
|      TEST CASE       |     PROJECT      |     DURATION     |     RESULT     |
+----------------------+------------------+------------------+----------------+
|     vyos_vrouter     |     functest     |      17:26       |      PASS      |
+----------------------+------------------+------------------+----------------+

2019-08-23 09:55:42,403 - functest.core.cloudify - INFO - Deleting the current deployment
2019-08-23 09:57:21,129 - xtesting.ci.run_tests - INFO - Loading test case 'juju_epc'...
2019-08-23 09:57:23,801 - xtesting.ci.run_tests - INFO - Running test case 'juju_epc'...
2019-08-23 11:20:09,448 - functest.opnfv_tests.vnf.epc.juju_epc - ERROR - Exception with Juju VNF Deployment: ['timeout', '-t', '4800', 'juju-wait']

2019-08-23 11:20:09,729 - xtesting.core.testcase - INFO - The results were successfully pushed to DB
2019-08-23 11:20:09,729 - xtesting.ci.run_tests - INFO - Test result:

+-------------------+------------------+------------------+----------------+
|     TEST CASE     |     PROJECT      |     DURATION     |     RESULT     |
+-------------------+------------------+------------------+----------------+
|      juju_epc     |     functest     |      82:46       |      FAIL      |
+-------------------+------------------+------------------+----------------+

2019-08-23 11:20:53,010 - xtesting.ci.run_tests - ERROR - The test case 'juju_epc' failed.
2019-08-23 11:20:53,011 - xtesting.ci.run_tests - INFO - Xtesting report:

+----------------------+------------------+--------------+------------------+----------------+
|      TEST CASE       |     PROJECT      |     TIER     |     DURATION     |     RESULT     |
+----------------------+------------------+--------------+------------------+----------------+
|       cloudify       |     functest     |     vnf      |      06:44       |      PASS      |
|     cloudify_ims     |     functest     |     vnf      |      11:23       |      FAIL      |
|       heat_ims       |     functest     |     vnf      |      27:01       |      FAIL      |
|     vyos_vrouter     |     functest     |     vnf      |      17:26       |      PASS      |
|       juju_epc       |     functest     |     vnf      |      82:46       |      FAIL      |
+----------------------+------------------+--------------+------------------+----------------+

2019-08-23 11:20:53,014 - xtesting.ci.run_tests - INFO - Execution exit value: Result.EX_ERROR
Regular expression run condition: Expression=[k8-.*], Label=[os-odl-ovs-noha]
Run condition [Regular expression match] preventing perform for step [Execute shell]
[functest-fuel-virtual-daily-hunter] $ /bin/bash /tmp/jenkins2317638378701172986.sh
Uploading logs to artifact logs/functest/ericsson-virtual1/hunter/2019-08-23_11-20-54
Logs can be found in https://artifacts.opnfv.org/logs_functest_ericsson-virtual1.html
https://artifacts.opnfv.org/logs/functest/ericsson-virtual1/hunter/2019-08-23_11-20-54/return_value
https://artifacts.opnfv.org/logs/functest/ericsson-virtual1/hunter/2019-08-23_11-20-54/functest.debug.log
https://artifacts.opnfv.org/logs/functest/ericsson-virtual1/hunter/2019-08-23_11-20-54/odl
https://artifacts.opnfv.org/logs/functest/ericsson-virtual1/hunter/2019-08-23_11-20-54/odl/report.html
https://artifacts.opnfv.org/logs/functest/ericsson-virtual1/hunter/2019-08-23_11-20-54/odl/log.html
https://artifacts.opnfv.org/logs/functest/ericsson-virtual1/hunter/2019-08-23_11-20-54/odl/output.xml
https://artifacts.opnfv.org/logs/functest/ericsson-virtual1/hunter/2019-08-23_11-20-54/odl/xunit.xml
https://artifacts.opnfv.org/logs/functest/ericsson-virtual1/hunter/2019-08-23_11-20-54/shaker
https://artifacts.opnfv.org/logs/functest/ericsson-virtual1/hunter/2019-08-23_11-20-54/rally_jobs
https://artifacts.opnfv.org/logs/functest/ericsson-virtual1/hunter/2019-08-23_11-20-54/rally_jobs/rally_jobs.html
https://artifacts.opnfv.org/logs/functest/ericsson-virtual1/hunter/2019-08-23_11-20-54/rally_jobs/rally.log
https://artifacts.opnfv.org/logs/functest/ericsson-virtual1/hunter/2019-08-23_11-20-54/rally_jobs/neutron.json
https://artifacts.opnfv.org/logs/functest/ericsson-virtual1/hunter/2019-08-23_11-20-54/rally_jobs/rally_jobs.xml
https://artifacts.opnfv.org/logs/functest/ericsson-virtual1/hunter/2019-08-23_11-20-54/tempest_smoke
https://artifacts.opnfv.org/logs/functest/ericsson-virtual1/hunter/2019-08-23_11-20-54/tempest_smoke/tempest-report.html
https://artifacts.opnfv.org/logs/functest/ericsson-virtual1/hunter/2019-08-23_11-20-54/tempest_smoke/rally.conf
https://artifacts.opnfv.org/logs/functest/ericsson-virtual1/hunter/2019-08-23_11-20-54/tempest_smoke/tempest-report.xml
https://artifacts.opnfv.org/logs/functest/ericsson-virtual1/hunter/2019-08-23_11-20-54/tempest_smoke/tempest.debug.log
https://artifacts.opnfv.org/logs/functest/ericsson-virtual1/hunter/2019-08-23_11-20-54/tempest_smoke/tempest.log
https://artifacts.opnfv.org/logs/functest/ericsson-virtual1/hunter/2019-08-23_11-20-54/tempest_smoke/rally.log
https://artifacts.opnfv.org/logs/functest/ericsson-virtual1/hunter/2019-08-23_11-20-54/tempest_smoke/tempest.conf
https://artifacts.opnfv.org/logs/functest/ericsson-virtual1/hunter/2019-08-23_11-20-54/tempest_smoke/test_raw_list.txt
https://artifacts.opnfv.org/logs/functest/ericsson-virtual1/hunter/2019-08-23_11-20-54/tempest_smoke/test_list.txt
https://artifacts.opnfv.org/logs/functest/ericsson-virtual1/hunter/2019-08-23_11-20-54/barbican
https://artifacts.opnfv.org/logs/functest/ericsson-virtual1/hunter/2019-08-23_11-20-54/barbican/tempest-report.html
https://artifacts.opnfv.org/logs/functest/ericsson-virtual1/hunter/2019-08-23_11-20-54/barbican/rally.conf
https://artifacts.opnfv.org/logs/functest/ericsson-virtual1/hunter/2019-08-23_11-20-54/barbican/tempest-report.xml
https://artifacts.opnfv.org/logs/functest/ericsson-virtual1/hunter/2019-08-23_11-20-54/barbican/tempest.debug.log
https://artifacts.opnfv.org/logs/functest/ericsson-virtual1/hunter/2019-08-23_11-20-54/barbican/tempest.log
https://artifacts.opnfv.org/logs/functest/ericsson-virtual1/hunter/2019-08-23_11-20-54/barbican/rally.log
https://artifacts.opnfv.org/logs/functest/ericsson-virtual1/hunter/2019-08-23_11-20-54/barbican/tempest.conf
https://artifacts.opnfv.org/logs/functest/ericsson-virtual1/hunter/2019-08-23_11-20-54/barbican/test_raw_list.txt
https://artifacts.opnfv.org/logs/functest/ericsson-virtual1/hunter/2019-08-23_11-20-54/barbican/test_list.txt
https://artifacts.opnfv.org/logs/functest/ericsson-virtual1/hunter/2019-08-23_11-20-54/doctor-notification
https://artifacts.opnfv.org/logs/functest/ericsson-virtual1/hunter/2019-08-23_11-20-54/doctor-notification/doctor-notification.log
https://artifacts.opnfv.org/logs/functest/ericsson-virtual1/hunter/2019-08-23_11-20-54/vmtp
https://artifacts.opnfv.org/logs/functest/ericsson-virtual1/hunter/2019-08-23_11-20-54/vmtp/vmtp.json
https://artifacts.opnfv.org/logs/functest/ericsson-virtual1/hunter/2019-08-23_11-20-54/vmtp/vmtp.html
https://artifacts.opnfv.org/logs/functest/ericsson-virtual1/hunter/2019-08-23_11-20-54/vmtp/vmtp.conf
https://artifacts.opnfv.org/logs/functest/ericsson-virtual1/hunter/2019-08-23_11-20-54/refstack_defcore
https://artifacts.opnfv.org/logs/functest/ericsson-virtual1/hunter/2019-08-23_11-20-54/refstack_defcore/tempest-report.html
https://artifacts.opnfv.org/logs/functest/ericsson-virtual1/hunter/2019-08-23_11-20-54/refstack_defcore/rally.conf
https://artifacts.opnfv.org/logs/functest/ericsson-virtual1/hunter/2019-08-23_11-20-54/refstack_defcore/tempest-report.xml
https://artifacts.opnfv.org/logs/functest/ericsson-virtual1/hunter/2019-08-23_11-20-54/refstack_defcore/tempest.debug.log
https://artifacts.opnfv.org/logs/functest/ericsson-virtual1/hunter/2019-08-23_11-20-54/refstack_defcore/tempest.log
https://artifacts.opnfv.org/logs/functest/ericsson-virtual1/hunter/2019-08-23_11-20-54/refstack_defcore/rally.log
https://artifacts.opnfv.org/logs/functest/ericsson-virtual1/hunter/2019-08-23_11-20-54/refstack_defcore/tempest.conf
https://artifacts.opnfv.org/logs/functest/ericsson-virtual1/hunter/2019-08-23_11-20-54/refstack_defcore/test_raw_list.txt
https://artifacts.opnfv.org/logs/functest/ericsson-virtual1/hunter/2019-08-23_11-20-54/refstack_defcore/test_list.txt
https://artifacts.opnfv.org/logs/functest/ericsson-virtual1/hunter/2019-08-23_11-20-54/neutron_trunk
https://artifacts.opnfv.org/logs/functest/ericsson-virtual1/hunter/2019-08-23_11-20-54/neutron_trunk/tempest-report.html
https://artifacts.opnfv.org/logs/functest/ericsson-virtual1/hunter/2019-08-23_11-20-54/neutron_trunk/rally.conf
https://artifacts.opnfv.org/logs/functest/ericsson-virtual1/hunter/2019-08-23_11-20-54/neutron_trunk/tempest-report.xml
https://artifacts.opnfv.org/logs/functest/ericsson-virtual1/hunter/2019-08-23_11-20-54/neutron_trunk/tempest.debug.log
https://artifacts.opnfv.org/logs/functest/ericsson-virtual1/hunter/2019-08-23_11-20-54/neutron_trunk/tempest.log
https://artifacts.opnfv.org/logs/functest/ericsson-virtual1/hunter/2019-08-23_11-20-54/neutron_trunk/rally.log
https://artifacts.opnfv.org/logs/functest/ericsson-virtual1/hunter/2019-08-23_11-20-54/neutron_trunk/tempest.conf
https://artifacts.opnfv.org/logs/functest/ericsson-virtual1/hunter/2019-08-23_11-20-54/neutron_trunk/test_raw_list.txt
https://artifacts.opnfv.org/logs/functest/ericsson-virtual1/hunter/2019-08-23_11-20-54/neutron_trunk/test_list.txt
https://artifacts.opnfv.org/logs/functest/ericsson-virtual1/hunter/2019-08-23_11-20-54/tempest_full
https://artifacts.opnfv.org/logs/functest/ericsson-virtual1/hunter/2019-08-23_11-20-54/tempest_full/tempest-report.html
https://artifacts.opnfv.org/logs/functest/ericsson-virtual1/hunter/2019-08-23_11-20-54/tempest_full/rally.conf
https://artifacts.opnfv.org/logs/functest/ericsson-virtual1/hunter/2019-08-23_11-20-54/tempest_full/tempest-report.xml
https://artifacts.opnfv.org/logs/functest/ericsson-virtual1/hunter/2019-08-23_11-20-54/tempest_full/tempest.debug.log
https://artifacts.opnfv.org/logs/functest/ericsson-virtual1/hunter/2019-08-23_11-20-54/tempest_full/tempest.log
https://artifacts.opnfv.org/logs/functest/ericsson-virtual1/hunter/2019-08-23_11-20-54/tempest_full/rally.log
https://artifacts.opnfv.org/logs/functest/ericsson-virtual1/hunter/2019-08-23_11-20-54/tempest_full/tempest.conf
https://artifacts.opnfv.org/logs/functest/ericsson-virtual1/hunter/2019-08-23_11-20-54/tempest_full/test_raw_list.txt
https://artifacts.opnfv.org/logs/functest/ericsson-virtual1/hunter/2019-08-23_11-20-54/tempest_full/test_list.txt
https://artifacts.opnfv.org/logs/functest/ericsson-virtual1/hunter/2019-08-23_11-20-54/functest.log
https://artifacts.opnfv.org/logs/functest/ericsson-virtual1/hunter/2019-08-23_11-20-54/patrole
https://artifacts.opnfv.org/logs/functest/ericsson-virtual1/hunter/2019-08-23_11-20-54/patrole/tempest-report.html
https://artifacts.opnfv.org/logs/functest/ericsson-virtual1/hunter/2019-08-23_11-20-54/patrole/rally.conf
https://artifacts.opnfv.org/logs/functest/ericsson-virtual1/hunter/2019-08-23_11-20-54/patrole/tempest-report.xml
https://artifacts.opnfv.org/logs/functest/ericsson-virtual1/hunter/2019-08-23_11-20-54/patrole/tempest.debug.log
https://artifacts.opnfv.org/logs/functest/ericsson-virtual1/hunter/2019-08-23_11-20-54/patrole/tempest.log
https://artifacts.opnfv.org/logs/functest/ericsson-virtual1/hunter/2019-08-23_11-20-54/patrole/rally.log
https://artifacts.opnfv.org/logs/functest/ericsson-virtual1/hunter/2019-08-23_11-20-54/patrole/tempest.conf
https://artifacts.opnfv.org/logs/functest/ericsson-virtual1/hunter/2019-08-23_11-20-54/patrole/test_raw_list.txt
https://artifacts.opnfv.org/logs/functest/ericsson-virtual1/hunter/2019-08-23_11-20-54/patrole/test_list.txt
https://artifacts.opnfv.org/logs/functest/ericsson-virtual1/hunter/2019-08-23_11-20-54/rally_full
https://artifacts.opnfv.org/logs/functest/ericsson-virtual1/hunter/2019-08-23_11-20-54/rally_full/cinder.json
https://artifacts.opnfv.org/logs/functest/ericsson-virtual1/hunter/2019-08-23_11-20-54/rally_full/gnocchi.json
https://artifacts.opnfv.org/logs/functest/ericsson-virtual1/hunter/2019-08-23_11-20-54/rally_full/rally_full.html
https://artifacts.opnfv.org/logs/functest/ericsson-virtual1/hunter/2019-08-23_11-20-54/rally_full/quotas.json
https://artifacts.opnfv.org/logs/functest/ericsson-virtual1/hunter/2019-08-23_11-20-54/rally_full/glance.json
https://artifacts.opnfv.org/logs/functest/ericsson-virtual1/hunter/2019-08-23_11-20-54/rally_full/rally_full.xml
https://artifacts.opnfv.org/logs/functest/ericsson-virtual1/hunter/2019-08-23_11-20-54/rally_full/rally.log
https://artifacts.opnfv.org/logs/functest/ericsson-virtual1/hunter/2019-08-23_11-20-54/rally_full/neutron.json
https://artifacts.opnfv.org/logs/functest/ericsson-virtual1/hunter/2019-08-23_11-20-54/rally_full/heat.json
https://artifacts.opnfv.org/logs/functest/ericsson-virtual1/hunter/2019-08-23_11-20-54/rally_full/nova.json
https://artifacts.opnfv.org/logs/functest/ericsson-virtual1/hunter/2019-08-23_11-20-54/rally_full/keystone.json
https://artifacts.opnfv.org/logs/functest/ericsson-virtual1/hunter/2019-08-23_11-20-54/rally_full/authenticate.json
https://artifacts.opnfv.org/logs/functest/ericsson-virtual1/hunter/2019-08-23_11-20-54/neutron-tempest-plugin-api
https://artifacts.opnfv.org/logs/functest/ericsson-virtual1/hunter/2019-08-23_11-20-54/neutron-tempest-plugin-api/tempest-report.html
https://artifacts.opnfv.org/logs/functest/ericsson-virtual1/hunter/2019-08-23_11-20-54/neutron-tempest-plugin-api/rally.conf
https://artifacts.opnfv.org/logs/functest/ericsson-virtual1/hunter/2019-08-23_11-20-54/neutron-tempest-plugin-api/tempest-report.xml
https://artifacts.opnfv.org/logs/functest/ericsson-virtual1/hunter/2019-08-23_11-20-54/neutron-tempest-plugin-api/tempest.debug.log
https://artifacts.opnfv.org/logs/functest/ericsson-virtual1/hunter/2019-08-23_11-20-54/neutron-tempest-plugin-api/tempest.log
https://artifacts.opnfv.org/logs/functest/ericsson-virtual1/hunter/2019-08-23_11-20-54/neutron-tempest-plugin-api/rally.log
https://artifacts.opnfv.org/logs/functest/ericsson-virtual1/hunter/2019-08-23_11-20-54/neutron-tempest-plugin-api/tempest.conf
https://artifacts.opnfv.org/logs/functest/ericsson-virtual1/hunter/2019-08-23_11-20-54/neutron-tempest-plugin-api/test_raw_list.txt
https://artifacts.opnfv.org/logs/functest/ericsson-virtual1/hunter/2019-08-23_11-20-54/neutron-tempest-plugin-api/test_list.txt
https://artifacts.opnfv.org/logs/functest/ericsson-virtual1/hunter/2019-08-23_11-20-54/tempest_scenario
https://artifacts.opnfv.org/logs/functest/ericsson-virtual1/hunter/2019-08-23_11-20-54/tempest_scenario/tempest-report.html
https://artifacts.opnfv.org/logs/functest/ericsson-virtual1/hunter/2019-08-23_11-20-54/tempest_scenario/rally.conf
https://artifacts.opnfv.org/logs/functest/ericsson-virtual1/hunter/2019-08-23_11-20-54/tempest_scenario/tempest-report.xml
https://artifacts.opnfv.org/logs/functest/ericsson-virtual1/hunter/2019-08-23_11-20-54/tempest_scenario/tempest.debug.log
https://artifacts.opnfv.org/logs/functest/ericsson-virtual1/hunter/2019-08-23_11-20-54/tempest_scenario/tempest.log
https://artifacts.opnfv.org/logs/functest/ericsson-virtual1/hunter/2019-08-23_11-20-54/tempest_scenario/rally.log
https://artifacts.opnfv.org/logs/functest/ericsson-virtual1/hunter/2019-08-23_11-20-54/tempest_scenario/tempest.conf
https://artifacts.opnfv.org/logs/functest/ericsson-virtual1/hunter/2019-08-23_11-20-54/tempest_scenario/test_raw_list.txt
https://artifacts.opnfv.org/logs/functest/ericsson-virtual1/hunter/2019-08-23_11-20-54/tempest_scenario/test_list.txt
https://artifacts.opnfv.org/logs/functest/ericsson-virtual1/hunter/2019-08-23_11-20-54/rally_sanity
https://artifacts.opnfv.org/logs/functest/ericsson-virtual1/hunter/2019-08-23_11-20-54/rally_sanity/rally_sanity.html
https://artifacts.opnfv.org/logs/functest/ericsson-virtual1/hunter/2019-08-23_11-20-54/rally_sanity/cinder.json
https://artifacts.opnfv.org/logs/functest/ericsson-virtual1/hunter/2019-08-23_11-20-54/rally_sanity/gnocchi.json
https://artifacts.opnfv.org/logs/functest/ericsson-virtual1/hunter/2019-08-23_11-20-54/rally_sanity/quotas.json
https://artifacts.opnfv.org/logs/functest/ericsson-virtual1/hunter/2019-08-23_11-20-54/rally_sanity/glance.json
https://artifacts.opnfv.org/logs/functest/ericsson-virtual1/hunter/2019-08-23_11-20-54/rally_sanity/rally_sanity.xml
https://artifacts.opnfv.org/logs/functest/ericsson-virtual1/hunter/2019-08-23_11-20-54/rally_sanity/rally.log
https://artifacts.opnfv.org/logs/functest/ericsson-virtual1/hunter/2019-08-23_11-20-54/rally_sanity/neutron.json
https://artifacts.opnfv.org/logs/functest/ericsson-virtual1/hunter/2019-08-23_11-20-54/rally_sanity/heat.json
https://artifacts.opnfv.org/logs/functest/ericsson-virtual1/hunter/2019-08-23_11-20-54/rally_sanity/nova.json
https://artifacts.opnfv.org/logs/functest/ericsson-virtual1/hunter/2019-08-23_11-20-54/rally_sanity/keystone.json
https://artifacts.opnfv.org/logs/functest/ericsson-virtual1/hunter/2019-08-23_11-20-54/rally_sanity/authenticate.json
https://artifacts.opnfv.org/logs/functest/ericsson-virtual1/hunter/2019-08-23_11-20-54/juju_epc
https://artifacts.opnfv.org/logs/functest/ericsson-virtual1/hunter/2019-08-23_11-20-54/juju_epc/credentials.yaml
https://artifacts.opnfv.org/logs/functest/ericsson-virtual1/hunter/2019-08-23_11-20-54/juju_epc/clouds.yaml
[functest-fuel-virtual-daily-hunter] $ /bin/bash /tmp/jenkins1729844580353202608.sh
Build step 'Execute shell' marked build as failure
New run name is '641 Suite: daily Scenario: os-odl-ovs-noha'
Email was triggered for: Failure - Any
Sending email for trigger: Failure - Any
Request made to compress build log
Sending email to: tbramwell@linuxfoundation.org agardner@linuxfoundation.org rgrigar@linuxfoundation.org
Finished: FAILURE