FailedConsole Output

Started by upstream project "fuel-os-odl-nofeature-noha-virtual-daily-hunter" build number 122
originally caused by:
 Started by timer
Running as SYSTEM
[EnvInject] - Loading node environment variables.
Building remotely on ericsson-virtual3 (fuel-virtual ci-resource opnfv-sysinfo) in workspace /home/jenkins/opnfv/slave_root/workspace/functest-fuel-virtual-daily-hunter
using credential d42411ac011ad6f3dd2e1fa34eaa5d87f910eb2e
Wiping out workspace first.
Cloning the remote Git repository
Cloning repository https://gerrit.opnfv.org/gerrit/functest
 > git init /home/jenkins/opnfv/slave_root/workspace/functest-fuel-virtual-daily-hunter # timeout=10
Fetching upstream changes from https://gerrit.opnfv.org/gerrit/functest
 > git --version # timeout=10
using GIT_SSH to set credentials Jenkins Master SSH
 > git fetch --tags --progress https://gerrit.opnfv.org/gerrit/functest +refs/heads/*:refs/remotes/origin/* # timeout=15
 > git config remote.origin.url https://gerrit.opnfv.org/gerrit/functest # timeout=10
 > git config --add remote.origin.fetch +refs/heads/*:refs/remotes/origin/* # timeout=10
 > git config remote.origin.url https://gerrit.opnfv.org/gerrit/functest # timeout=10
Fetching upstream changes from https://gerrit.opnfv.org/gerrit/functest
using GIT_SSH to set credentials Jenkins Master SSH
 > git fetch --tags --progress https://gerrit.opnfv.org/gerrit/functest +refs/heads/*:refs/remotes/origin/* # timeout=15
 > git rev-parse refs/remotes/origin/stable/hunter^{commit} # timeout=10
 > git rev-parse refs/remotes/origin/origin/stable/hunter^{commit} # timeout=10
Checking out Revision f8800b23d406c8acad7acc62035d5425d7358338 (refs/remotes/origin/stable/hunter)
 > git config core.sparsecheckout # timeout=10
 > git checkout -f f8800b23d406c8acad7acc62035d5425d7358338 # timeout=15
Commit message: "Clean orphan security groups"
 > git rev-list --no-walk f8800b23d406c8acad7acc62035d5425d7358338 # timeout=10
Run condition [Regular expression match] enabling prebuild for step [Execute shell]
Run condition [Regular expression match] enabling prebuild for step [Execute shell]
No emails were triggered.
New run name is '639 Suite: daily Scenario: os-odl-nofeature-noha'
[description-setter] Description set: Built on ericsson-virtual3
[functest-fuel-virtual-daily-hunter] $ /bin/bash /tmp/jenkins6997416116906485270.sh
Cleaning up docker containers/images...
Regular expression run condition: Expression=[os-.*], Label=[os-odl-nofeature-noha]
Run condition [Regular expression match] enabling perform for step [Execute shell]
[functest-fuel-virtual-daily-hunter] $ /usr/bin/env bash /tmp/jenkins5133634233232978710.sh
Map mcp ssh_key
<13>Aug 22 23:07:19 fetch_os_creds.info: Fetching rc file...
<13>Aug 22 23:07:19 fetch_os_creds.info: Verifying connectivity to 10.20.0.2...
<13>Aug 22 23:07:19 fetch_os_creds.info: 10.20.0.2 is reachable!
<13>Aug 22 23:07:19 fetch_os_creds.info: ... from controller 172.16.10.36 ...
Warning: Permanently added '172.16.10.36' (ECDSA) to the list of known hosts.
-------- Credentials: --------

export OS_IDENTITY_API_VERSION=3
export OS_PROJECT_DOMAIN_NAME=Default
export OS_USER_DOMAIN_NAME=Default
export OS_PROJECT_NAME=admin
export OS_TENANT_NAME=admin
export OS_USERNAME=admin
export OS_PASSWORD=opnfv_secret
export OS_REGION_NAME=RegionOne
export OS_INTERFACE=internal
export OS_ENDPOINT_TYPE="internal"
export OS_CACERT="/etc/ssl/certs/ca-certificates.crt"
export SDN_CONTROLLER_USER=admin
export SDN_CONTROLLER_RESTCONFPORT=8282
export SDN_CONTROLLER_PASSWORD=admin
export SDN_CONTROLLER_WEBPORT=8282
export SDN_CONTROLLER_IP=10.16.0.107
export VOLUME_DEVICE_NAME=sdc
export OS_AUTH_URL=http://172.16.10.36:35357/v3
Functest: Start Docker and prepare environment
Functest: Download images that will be used by test cases
+ wget_opts='-N --tries=1 --connect-timeout=30'
+ '[' -t 1 ']'
+ wget_opts='-N --tries=1 --connect-timeout=30 --progress=dot:giga'
+ cat
+ wget -N --tries=1 --connect-timeout=30 --progress=dot:giga -i - -P /home/jenkins/opnfv/functest/images
--2019-08-22 23:07:20--  http://download.cirros-cloud.net/0.4.0/cirros-0.4.0-x86_64-disk.img
Resolving download.cirros-cloud.net (download.cirros-cloud.net)... 64.90.42.85, 2607:f298:6:a036::bd6:a72a
Connecting to download.cirros-cloud.net (download.cirros-cloud.net)|64.90.42.85|:80... connected.
HTTP request sent, awaiting response... 304 Not Modified
File ‘/home/jenkins/opnfv/functest/images/cirros-0.4.0-x86_64-disk.img’ not modified on server. Omitting download.

--2019-08-22 23:07:20--  https://cloud-images.ubuntu.com/releases/14.04/release/ubuntu-14.04-server-cloudimg-amd64-disk1.img
Resolving cloud-images.ubuntu.com (cloud-images.ubuntu.com)... 91.189.88.89, 2001:67c:1560:8001::8001
Connecting to cloud-images.ubuntu.com (cloud-images.ubuntu.com)|91.189.88.89|:443... connected.
HTTP request sent, awaiting response... 302 Found
Location: https://cloud-images.ubuntu.com/releases/trusty/release/ubuntu-14.04-server-cloudimg-amd64-disk1.img [following]
--2019-08-22 23:07:20--  https://cloud-images.ubuntu.com/releases/trusty/release/ubuntu-14.04-server-cloudimg-amd64-disk1.img
Reusing existing connection to cloud-images.ubuntu.com:443.
HTTP request sent, awaiting response... 304 Not Modified
File ‘/home/jenkins/opnfv/functest/images/ubuntu-14.04-server-cloudimg-amd64-disk1.img’ not modified on server. Omitting download.

--2019-08-22 23:07:20--  https://cloud-images.ubuntu.com/releases/16.04/release/ubuntu-16.04-server-cloudimg-amd64-disk1.img
Reusing existing connection to cloud-images.ubuntu.com:443.
HTTP request sent, awaiting response... 302 Found
Location: https://cloud-images.ubuntu.com/releases/xenial/release/ubuntu-16.04-server-cloudimg-amd64-disk1.img [following]
--2019-08-22 23:07:20--  https://cloud-images.ubuntu.com/releases/xenial/release/ubuntu-16.04-server-cloudimg-amd64-disk1.img
Reusing existing connection to cloud-images.ubuntu.com:443.
HTTP request sent, awaiting response... 304 Not Modified
File ‘/home/jenkins/opnfv/functest/images/ubuntu-16.04-server-cloudimg-amd64-disk1.img’ not modified on server. Omitting download.

--2019-08-22 23:07:20--  http://download.cirros-cloud.net/0.4.0/cirros-0.4.0-aarch64-disk.img
Connecting to download.cirros-cloud.net (download.cirros-cloud.net)|64.90.42.85|:80... connected.
HTTP request sent, awaiting response... 304 Not Modified
File ‘/home/jenkins/opnfv/functest/images/cirros-0.4.0-aarch64-disk.img’ not modified on server. Omitting download.

--2019-08-22 23:07:21--  https://cloud-images.ubuntu.com/releases/14.04/release/ubuntu-14.04-server-cloudimg-arm64-uefi1.img
Connecting to cloud-images.ubuntu.com (cloud-images.ubuntu.com)|91.189.88.89|:443... connected.
HTTP request sent, awaiting response... 302 Found
Location: https://cloud-images.ubuntu.com/releases/trusty/release/ubuntu-14.04-server-cloudimg-arm64-uefi1.img [following]
--2019-08-22 23:07:21--  https://cloud-images.ubuntu.com/releases/trusty/release/ubuntu-14.04-server-cloudimg-arm64-uefi1.img
Reusing existing connection to cloud-images.ubuntu.com:443.
HTTP request sent, awaiting response... 304 Not Modified
File ‘/home/jenkins/opnfv/functest/images/ubuntu-14.04-server-cloudimg-arm64-uefi1.img’ not modified on server. Omitting download.

--2019-08-22 23:07:21--  http://repository.cloudifysource.org/cloudify/19.01.24/community-release/cloudify-docker-manager-community-19.01.24.tar
Resolving repository.cloudifysource.org (repository.cloudifysource.org)... 54.192.98.108, 54.192.98.97, 54.192.98.186, ...
Connecting to repository.cloudifysource.org (repository.cloudifysource.org)|54.192.98.108|:80... connected.
HTTP request sent, awaiting response... 304 Not Modified
File ‘/home/jenkins/opnfv/functest/images/cloudify-docker-manager-community-19.01.24.tar’ not modified on server. Omitting download.

--2019-08-22 23:07:21--  http://testresults.opnfv.org/functest/vyos-1.1.8-amd64.qcow2
Resolving testresults.opnfv.org (testresults.opnfv.org)... 104.154.71.112
Connecting to testresults.opnfv.org (testresults.opnfv.org)|104.154.71.112|:80... connected.
HTTP request sent, awaiting response... 304 Not Modified
File ‘/home/jenkins/opnfv/functest/images/vyos-1.1.8-amd64.qcow2’ not modified on server. Omitting download.

--2019-08-22 23:07:21--  http://testresults.opnfv.org/functest/shaker-image.qcow2
Reusing existing connection to testresults.opnfv.org:80.
HTTP request sent, awaiting response... 304 Not Modified
File ‘/home/jenkins/opnfv/functest/images/shaker-image.qcow2’ not modified on server. Omitting download.

--2019-08-22 23:07:21--  http://testresults.opnfv.org/functest/shaker-image-arm64.qcow2
Reusing existing connection to testresults.opnfv.org:80.
HTTP request sent, awaiting response... 304 Not Modified
File ‘/home/jenkins/opnfv/functest/images/shaker-image-arm64.qcow2’ not modified on server. Omitting download.

Warning: Permanently added '10.20.0.2' (ECDSA) to the list of known hosts.
tempest_conf.yaml:
---
compute-feature-enabled:
    shelve: false
    vnc_console: false
    spice_console: true
identity-feature-enabled:
    api_v2: false
    api_v2_admin: false
image-feature-enabled:
    api_v2: true
    api_v1: false
volume:
    storage_protocol: iSCSI
volume-feature-enabled:
    backup: false
compute:
    max_microversion: 2.65
Functest: Pulling Functest Docker image opnfv/functest-healthcheck:hunter ...
Running Functest tier 'healthcheck'. CMD: docker run --rm  -e INSTALLER_TYPE=fuel -e INSTALLER_IP=10.20.0.2     -e NODE_NAME=ericsson-virtual3 -e DEPLOY_SCENARIO=os-odl-nofeature-noha     -e BUILD_TAG=jenkins-functest-fuel-virtual-daily-hunter-639 -e DEPLOY_TYPE=virt -e CI_LOOP=daily     -e TEST_DB_URL=http://testresults.opnfv.org/test/api/v1/results -e ENERGY_RECORDER_API_URL=http://energy.opnfv.fr/resources     -e DEBUG=true -e POD_ARCH=x86_64 -e BLOCK_MIGRATION=false -e SDN_CONTROLLER_RESTCONFPORT=8080 -e IMAGE_PROPERTIES=hw_disk_bus:scsi,hw_scsi_model:virtio-scsi -e FLAVOR_EXTRA_SPECS= -v /home/jenkins/opnfv/functest/images:/home/opnfv/functest/images -v /home/jenkins/opnfv/functest/results/hunter:/home/opnfv/functest/results -v /var/lib/opnfv/mcp.rsa:/root/.ssh/id_rsa       -v /home/jenkins/opnfv-openrc.sh:/home/opnfv/functest/conf/env_file      -v /tmp/tmp.UshPF8zGoJ:/usr/lib/python2.7/site-packages/functest/opnfv_tests/openstack/tempest/custom_tests/tempest_conf.yaml  opnfv/functest-healthcheck:hunter /bin/bash -c 'run_tests -r -t all'
2019-08-22 21:07:26,026 - xtesting.ci.run_tests - INFO - Deployment description:

+--------------------------------------+----------------------------------------------------------+
|               ENV VAR                |                          VALUE                           |
+--------------------------------------+----------------------------------------------------------+
|              BUILD_TAG               |      jenkins-functest-fuel-virtual-daily-hunter-639      |
|             TEST_DB_URL              |     http://testresults.opnfv.org/test/api/v1/results     |
|     ENERGY_RECORDER_API_PASSWORD     |                                                          |
|               CI_LOOP                |                          daily                           |
|                DEBUG                 |                           true                           |
|            INSTALLER_TYPE            |                           fuel                           |
|       ENERGY_RECORDER_API_URL        |             http://energy.opnfv.fr/resources             |
|           DEPLOY_SCENARIO            |                  os-odl-nofeature-noha                   |
|       ENERGY_RECORDER_API_USER       |                                                          |
|              NODE_NAME               |                    ericsson-virtual3                     |
+--------------------------------------+----------------------------------------------------------+

2019-08-22 21:07:26,031 - xtesting.ci.run_tests - INFO - Sourcing env file /var/lib/xtesting/conf/env_file


export OS_IDENTITY_API_VERSION=3
export OS_PROJECT_DOMAIN_NAME=Default
export OS_USER_DOMAIN_NAME=Default
export OS_PROJECT_NAME=admin
export OS_TENANT_NAME=admin
export OS_USERNAME=admin
export OS_PASSWORD=opnfv_secret
export OS_REGION_NAME=RegionOne
export OS_INTERFACE=internal
export OS_ENDPOINT_TYPE="internal"
export OS_CACERT="/etc/ssl/certs/ca-certificates.crt"
export SDN_CONTROLLER_USER=admin
export SDN_CONTROLLER_RESTCONFPORT=8282
export SDN_CONTROLLER_PASSWORD=admin
export SDN_CONTROLLER_WEBPORT=8282
export SDN_CONTROLLER_IP=10.16.0.107
export VOLUME_DEVICE_NAME=sdc
export OS_AUTH_URL=http://172.16.10.36:35357/v3

2019-08-22 21:07:26,033 - xtesting.ci.run_tests - INFO - TESTS TO BE EXECUTED:

+---------------------+---------------+-------------------------------------------------+------------------------------------------+
|        TIERS        |     ORDER     |                   DESCRIPTION                   |                TESTCASES                 |
+---------------------+---------------+-------------------------------------------------+------------------------------------------+
|     healthcheck     |       0       |     First tier to be executed to verify the     |     connection_check tenantnetwork1      |
|                     |               |           basic operations in the VIM.          |     tenantnetwork2 vmready1 vmready2     |
|                     |               |                                                 |      singlevm1 singlevm2 vping_ssh       |
|                     |               |                                                 |      vping_userdata cinder_test odl      |
|                     |               |                                                 |              tempest_smoke               |
+---------------------+---------------+-------------------------------------------------+------------------------------------------+

2019-08-22 21:07:26,064 - xtesting.ci.run_tests - INFO - Loading test case 'connection_check'...
2019-08-22 21:07:26,376 - xtesting.ci.run_tests - INFO - Running test case 'connection_check'...
2019-08-22 21:07:29,928 - xtesting.core.testcase - INFO - The results were successfully pushed to DB
2019-08-22 21:07:29,929 - xtesting.ci.run_tests - INFO - Test result:

+--------------------------+------------------+------------------+----------------+
|        TEST CASE         |     PROJECT      |     DURATION     |     RESULT     |
+--------------------------+------------------+------------------+----------------+
|     connection_check     |     functest     |      00:03       |      PASS      |
+--------------------------+------------------+------------------+----------------+

2019-08-22 21:07:29,965 - xtesting.ci.run_tests - INFO - Loading test case 'tenantnetwork1'...
2019-08-22 21:07:30,825 - xtesting.ci.run_tests - INFO - Running test case 'tenantnetwork1'...
2019-08-22 21:07:35,980 - xtesting.core.testcase - INFO - The results were successfully pushed to DB
2019-08-22 21:07:35,980 - xtesting.ci.run_tests - INFO - Test result:

+------------------------+------------------+------------------+----------------+
|       TEST CASE        |     PROJECT      |     DURATION     |     RESULT     |
+------------------------+------------------+------------------+----------------+
|     tenantnetwork1     |     functest     |      00:05       |      PASS      |
+------------------------+------------------+------------------+----------------+

2019-08-22 21:07:44,137 - xtesting.ci.run_tests - INFO - Loading test case 'tenantnetwork2'...
2019-08-22 21:07:46,744 - xtesting.ci.run_tests - INFO - Running test case 'tenantnetwork2'...
2019-08-22 21:07:53,956 - xtesting.core.testcase - INFO - The results were successfully pushed to DB
2019-08-22 21:07:53,957 - xtesting.ci.run_tests - INFO - Test result:

+------------------------+------------------+------------------+----------------+
|       TEST CASE        |     PROJECT      |     DURATION     |     RESULT     |
+------------------------+------------------+------------------+----------------+
|     tenantnetwork2     |     functest     |      00:07       |      PASS      |
+------------------------+------------------+------------------+----------------+

2019-08-22 21:08:03,338 - xtesting.ci.run_tests - INFO - Loading test case 'vmready1'...
2019-08-22 21:08:04,183 - xtesting.ci.run_tests - INFO - Running test case 'vmready1'...
2019-08-22 21:08:11,286 - xtesting.core.testcase - INFO - The results were successfully pushed to DB
2019-08-22 21:08:11,286 - xtesting.ci.run_tests - INFO - Test result:

+-------------------+------------------+------------------+----------------+
|     TEST CASE     |     PROJECT      |     DURATION     |     RESULT     |
+-------------------+------------------+------------------+----------------+
|      vmready1     |     functest     |      00:07       |      PASS      |
+-------------------+------------------+------------------+----------------+

2019-08-22 21:08:19,474 - xtesting.ci.run_tests - INFO - Loading test case 'vmready2'...
2019-08-22 21:08:21,583 - xtesting.ci.run_tests - INFO - Running test case 'vmready2'...
2019-08-22 21:08:28,978 - xtesting.core.testcase - INFO - The results were successfully pushed to DB
2019-08-22 21:08:28,979 - xtesting.ci.run_tests - INFO - Test result:

+-------------------+------------------+------------------+----------------+
|     TEST CASE     |     PROJECT      |     DURATION     |     RESULT     |
+-------------------+------------------+------------------+----------------+
|      vmready2     |     functest     |      00:07       |      PASS      |
+-------------------+------------------+------------------+----------------+

2019-08-22 21:08:38,735 - xtesting.ci.run_tests - INFO - Loading test case 'singlevm1'...
2019-08-22 21:08:39,570 - xtesting.ci.run_tests - INFO - Running test case 'singlevm1'...
2019-08-22 21:09:12,946 - xtesting.core.testcase - INFO - The results were successfully pushed to DB
2019-08-22 21:09:12,946 - xtesting.ci.run_tests - INFO - Test result:

+-------------------+------------------+------------------+----------------+
|     TEST CASE     |     PROJECT      |     DURATION     |     RESULT     |
+-------------------+------------------+------------------+----------------+
|     singlevm1     |     functest     |      00:33       |      PASS      |
+-------------------+------------------+------------------+----------------+

2019-08-22 21:09:26,174 - xtesting.ci.run_tests - INFO - Loading test case 'singlevm2'...
2019-08-22 21:09:28,113 - xtesting.ci.run_tests - INFO - Running test case 'singlevm2'...
2019-08-22 21:10:00,385 - xtesting.core.testcase - INFO - The results were successfully pushed to DB
2019-08-22 21:10:00,385 - xtesting.ci.run_tests - INFO - Test result:

+-------------------+------------------+------------------+----------------+
|     TEST CASE     |     PROJECT      |     DURATION     |     RESULT     |
+-------------------+------------------+------------------+----------------+
|     singlevm2     |     functest     |      00:32       |      PASS      |
+-------------------+------------------+------------------+----------------+

2019-08-22 21:10:14,863 - xtesting.ci.run_tests - INFO - Loading test case 'vping_ssh'...
2019-08-22 21:10:17,005 - xtesting.ci.run_tests - INFO - Running test case 'vping_ssh'...
2019-08-22 21:11:03,126 - xtesting.core.testcase - INFO - The results were successfully pushed to DB
2019-08-22 21:11:03,127 - xtesting.ci.run_tests - INFO - Test result:

+-------------------+------------------+------------------+----------------+
|     TEST CASE     |     PROJECT      |     DURATION     |     RESULT     |
+-------------------+------------------+------------------+----------------+
|     vping_ssh     |     functest     |      00:46       |      PASS      |
+-------------------+------------------+------------------+----------------+

2019-08-22 21:11:19,872 - xtesting.ci.run_tests - INFO - Loading test case 'vping_userdata'...
2019-08-22 21:11:21,911 - xtesting.ci.run_tests - INFO - Running test case 'vping_userdata'...
2019-08-22 21:11:56,876 - xtesting.core.testcase - INFO - The results were successfully pushed to DB
2019-08-22 21:11:56,877 - xtesting.ci.run_tests - INFO - Test result:

+------------------------+------------------+------------------+----------------+
|       TEST CASE        |     PROJECT      |     DURATION     |     RESULT     |
+------------------------+------------------+------------------+----------------+
|     vping_userdata     |     functest     |      00:35       |      PASS      |
+------------------------+------------------+------------------+----------------+

2019-08-22 21:12:11,574 - xtesting.ci.run_tests - INFO - Loading test case 'cinder_test'...
2019-08-22 21:12:13,542 - xtesting.ci.run_tests - INFO - Running test case 'cinder_test'...
2019-08-22 21:13:55,005 - xtesting.core.testcase - INFO - The results were successfully pushed to DB
2019-08-22 21:13:55,005 - xtesting.ci.run_tests - INFO - Test result:

+---------------------+------------------+------------------+----------------+
|      TEST CASE      |     PROJECT      |     DURATION     |     RESULT     |
+---------------------+------------------+------------------+----------------+
|     cinder_test     |     functest     |      01:41       |      PASS      |
+---------------------+------------------+------------------+----------------+

2019-08-22 21:14:15,202 - xtesting.ci.run_tests - INFO - Loading test case 'odl'...
2019-08-22 21:14:15,351 - xtesting.ci.run_tests - INFO - Running test case 'odl'...
[ WARN ] Deprecation Warning: Use Post Request in the future
2019-08-22 21:14:34,300 - xtesting.core.robotframework - INFO - 
==============================================================================
Basic & Neutron                                                               
==============================================================================
Basic & Neutron.Basic                                                         
==============================================================================
Basic & Neutron.Basic.Restconf Modules :: Test suite to verify Restconf is OK.
==============================================================================
Get Controller Modules :: Get the restconf modules, check 200 stat... | PASS |
------------------------------------------------------------------------------
Basic & Neutron.Basic.Restconf Modules :: Test suite to verify Res... | PASS |
1 critical test, 1 passed, 0 failed
1 test total, 1 passed, 0 failed
==============================================================================
Basic & Neutron.Basic                                                 | PASS |
1 critical test, 1 passed, 0 failed
1 test total, 1 passed, 0 failed
==============================================================================
Basic & Neutron.Neutron :: Test suite for Neutron Plugin                      
==============================================================================
Basic & Neutron.Neutron.Reachability                                          
==============================================================================
Get the complete list of networks :: Get the complete list of netw... | PASS |
------------------------------------------------------------------------------
Get the complete list of subnets :: Get the complete list of subnets  | PASS |
------------------------------------------------------------------------------
Get the complete list of ports :: Get the complete list of ports      | PASS |
------------------------------------------------------------------------------
Basic & Neutron.Neutron.Reachability                                  | PASS |
3 critical tests, 3 passed, 0 failed
3 tests total, 3 passed, 0 failed
==============================================================================
Basic & Neutron.Neutron.Networks :: Checking Network created in OpenStack a...
==============================================================================
Check OpenStack Networks :: Checking OpenStack Neutron for known n... | PASS |
------------------------------------------------------------------------------
Check OpenDaylight Networks :: Checking OpenDaylight Neutron API f... | PASS |
------------------------------------------------------------------------------
Create Network :: Create new network in OpenStack                     | PASS |
------------------------------------------------------------------------------
Check Network :: Check network created in OpenDaylight                | PASS |
------------------------------------------------------------------------------
Basic & Neutron.Neutron.Networks :: Checking Network created in Op... | PASS |
4 critical tests, 4 passed, 0 failed
4 tests total, 4 passed, 0 failed
==============================================================================
Basic & Neutron.Neutron.Subnets :: Checking Subnets created in OpenStack ar...
==============================================================================
Check OpenStack Subnets :: Checking OpenStack Neutron for known su... | PASS |
------------------------------------------------------------------------------
Check OpenDaylight subnets :: Checking OpenDaylight Neutron API fo... | PASS |
------------------------------------------------------------------------------
Create New subnet :: Create new subnet in OpenStack                   | PASS |
------------------------------------------------------------------------------
Check New subnet :: Check new subnet created in OpenDaylight          | PASS |
------------------------------------------------------------------------------
Basic & Neutron.Neutron.Subnets :: Checking Subnets created in Ope... | PASS |
4 critical tests, 4 passed, 0 failed
4 tests total, 4 passed, 0 failed
==============================================================================
Basic & Neutron.Neutron.Ports :: Checking Port created in OpenStack are pus...
==============================================================================
Check OpenStack ports :: Checking OpenStack Neutron for known ports   | PASS |
------------------------------------------------------------------------------
Check OpenDaylight ports :: Checking OpenDaylight Neutron API for ... | PASS |
------------------------------------------------------------------------------
Create New Port :: Create new port in OpenStack                       | PASS |
------------------------------------------------------------------------------
Check New Port :: Check new port created in OpenDaylight              | PASS |
------------------------------------------------------------------------------
Basic & Neutron.Neutron.Ports :: Checking Port created in OpenStac... | PASS |
4 critical tests, 4 passed, 0 failed
4 tests total, 4 passed, 0 failed
==============================================================================
Basic & Neutron.Neutron.Delete Ports :: Checking Port deleted in OpenStack ...
==============================================================================
Delete New Port :: Delete previously created port in OpenStack        | PASS |
------------------------------------------------------------------------------
Check Port Deleted :: Check port deleted in OpenDaylight              | PASS |
------------------------------------------------------------------------------
Basic & Neutron.Neutron.Delete Ports :: Checking Port deleted in O... | PASS |
2 critical tests, 2 passed, 0 failed
2 tests total, 2 passed, 0 failed
==============================================================================
Basic & Neutron.Neutron.Delete Subnets :: Checking Subnets deleted in OpenS...
==============================================================================
Delete New subnet :: Delete previously created subnet in OpenStack    | PASS |
------------------------------------------------------------------------------
Check New subnet deleted :: Check subnet deleted in OpenDaylight      | PASS |
------------------------------------------------------------------------------
Basic & Neutron.Neutron.Delete Subnets :: Checking Subnets deleted... | PASS |
2 critical tests, 2 passed, 0 failed
2 tests total, 2 passed, 0 failed
==============================================================================
Basic & Neutron.Neutron.Delete Networks :: Checking Network deleted in Open...
==============================================================================
Delete Network :: Delete network in OpenStack                         | PASS |
------------------------------------------------------------------------------
Check Network deleted :: Check network deleted in OpenDaylight        | PASS |
------------------------------------------------------------------------------
Basic & Neutron.Neutron.Delete Networks :: Checking Network delete... | PASS |
2 critical tests, 2 passed, 0 failed
2 tests total, 2 passed, 0 failed
==============================================================================
Basic & Neutron.Neutron :: Test suite for Neutron Plugin              | PASS |
21 critical tests, 21 passed, 0 failed
21 tests total, 21 passed, 0 failed
==============================================================================
Basic & Neutron                                                       | PASS |
22 critical tests, 22 passed, 0 failed
22 tests total, 22 passed, 0 failed
==============================================================================
Output:  /home/opnfv/functest/results/odl/output.xml

2019-08-22 21:14:34,345 - xtesting.core.robotframework - INFO - Results were successfully parsed
2019-08-22 21:14:34,497 - xtesting.core.robotframework - INFO - Results were successfully generated
2019-08-22 21:14:34,777 - xtesting.core.testcase - INFO - The results were successfully pushed to DB
2019-08-22 21:14:34,777 - xtesting.ci.run_tests - INFO - Test result:

+-------------------+------------------+------------------+----------------+
|     TEST CASE     |     PROJECT      |     DURATION     |     RESULT     |
+-------------------+------------------+------------------+----------------+
|        odl        |     functest     |      00:18       |      PASS      |
+-------------------+------------------+------------------+----------------+

2019-08-22 21:14:34,838 - xtesting.ci.run_tests - INFO - Loading test case 'tempest_smoke'...
2019-08-22 21:14:38,238 - xtesting.ci.run_tests - INFO - Running test case 'tempest_smoke'...
2019-08-22 21:19:07,575 - xtesting.core.testcase - INFO - The results were successfully pushed to DB
2019-08-22 21:19:07,576 - xtesting.ci.run_tests - INFO - Test result:

+-----------------------+------------------+------------------+----------------+
|       TEST CASE       |     PROJECT      |     DURATION     |     RESULT     |
+-----------------------+------------------+------------------+----------------+
|     tempest_smoke     |     functest     |      04:29       |      PASS      |
+-----------------------+------------------+------------------+----------------+

2019-08-22 21:19:17,843 - xtesting.ci.run_tests - INFO - Xtesting report:

+--------------------------+------------------+---------------------+------------------+----------------+
|        TEST CASE         |     PROJECT      |         TIER        |     DURATION     |     RESULT     |
+--------------------------+------------------+---------------------+------------------+----------------+
|     connection_check     |     functest     |     healthcheck     |      00:03       |      PASS      |
|      tenantnetwork1      |     functest     |     healthcheck     |      00:05       |      PASS      |
|      tenantnetwork2      |     functest     |     healthcheck     |      00:07       |      PASS      |
|         vmready1         |     functest     |     healthcheck     |      00:07       |      PASS      |
|         vmready2         |     functest     |     healthcheck     |      00:07       |      PASS      |
|        singlevm1         |     functest     |     healthcheck     |      00:33       |      PASS      |
|        singlevm2         |     functest     |     healthcheck     |      00:32       |      PASS      |
|        vping_ssh         |     functest     |     healthcheck     |      00:46       |      PASS      |
|      vping_userdata      |     functest     |     healthcheck     |      00:35       |      PASS      |
|       cinder_test        |     functest     |     healthcheck     |      01:41       |      PASS      |
|           odl            |     functest     |     healthcheck     |      00:18       |      PASS      |
|      tempest_smoke       |     functest     |     healthcheck     |      04:29       |      PASS      |
+--------------------------+------------------+---------------------+------------------+----------------+

2019-08-22 21:19:17,857 - xtesting.ci.run_tests - INFO - Execution exit value: Result.EX_OK
Functest: Pulling Functest Docker image opnfv/functest-smoke:hunter ...
Running Functest tier 'smoke'. CMD: docker run --rm  -e INSTALLER_TYPE=fuel -e INSTALLER_IP=10.20.0.2     -e NODE_NAME=ericsson-virtual3 -e DEPLOY_SCENARIO=os-odl-nofeature-noha     -e BUILD_TAG=jenkins-functest-fuel-virtual-daily-hunter-639 -e DEPLOY_TYPE=virt -e CI_LOOP=daily     -e TEST_DB_URL=http://testresults.opnfv.org/test/api/v1/results -e ENERGY_RECORDER_API_URL=http://energy.opnfv.fr/resources     -e DEBUG=true -e POD_ARCH=x86_64 -e BLOCK_MIGRATION=false -e SDN_CONTROLLER_RESTCONFPORT=8080 -e IMAGE_PROPERTIES=hw_disk_bus:scsi,hw_scsi_model:virtio-scsi -e FLAVOR_EXTRA_SPECS= -v /home/jenkins/opnfv/functest/images:/home/opnfv/functest/images -v /home/jenkins/opnfv/functest/results/hunter:/home/opnfv/functest/results -v /var/lib/opnfv/mcp.rsa:/root/.ssh/id_rsa       -v /home/jenkins/opnfv-openrc.sh:/home/opnfv/functest/conf/env_file      -v /tmp/tmp.UshPF8zGoJ:/usr/lib/python2.7/site-packages/functest/opnfv_tests/openstack/tempest/custom_tests/tempest_conf.yaml  opnfv/functest-smoke:hunter /bin/bash -c 'run_tests -r -t all'
2019-08-22 21:19:22,278 - xtesting.ci.run_tests - INFO - Deployment description:

+--------------------------------------+----------------------------------------------------------+
|               ENV VAR                |                          VALUE                           |
+--------------------------------------+----------------------------------------------------------+
|              BUILD_TAG               |      jenkins-functest-fuel-virtual-daily-hunter-639      |
|             TEST_DB_URL              |     http://testresults.opnfv.org/test/api/v1/results     |
|     ENERGY_RECORDER_API_PASSWORD     |                                                          |
|               CI_LOOP                |                          daily                           |
|                DEBUG                 |                           true                           |
|            INSTALLER_TYPE            |                           fuel                           |
|       ENERGY_RECORDER_API_URL        |             http://energy.opnfv.fr/resources             |
|           DEPLOY_SCENARIO            |                  os-odl-nofeature-noha                   |
|       ENERGY_RECORDER_API_USER       |                                                          |
|              NODE_NAME               |                    ericsson-virtual3                     |
+--------------------------------------+----------------------------------------------------------+

2019-08-22 21:19:22,284 - xtesting.ci.run_tests - INFO - Sourcing env file /var/lib/xtesting/conf/env_file


export OS_IDENTITY_API_VERSION=3
export OS_PROJECT_DOMAIN_NAME=Default
export OS_USER_DOMAIN_NAME=Default
export OS_PROJECT_NAME=admin
export OS_TENANT_NAME=admin
export OS_USERNAME=admin
export OS_PASSWORD=opnfv_secret
export OS_REGION_NAME=RegionOne
export OS_INTERFACE=internal
export OS_ENDPOINT_TYPE="internal"
export OS_CACERT="/etc/ssl/certs/ca-certificates.crt"
export SDN_CONTROLLER_USER=admin
export SDN_CONTROLLER_RESTCONFPORT=8282
export SDN_CONTROLLER_PASSWORD=admin
export SDN_CONTROLLER_WEBPORT=8282
export SDN_CONTROLLER_IP=10.16.0.107
export VOLUME_DEVICE_NAME=sdc
export OS_AUTH_URL=http://172.16.10.36:35357/v3

2019-08-22 21:19:22,285 - xtesting.ci.run_tests - INFO - TESTS TO BE EXECUTED:

+---------------+---------------+------------------------------------------+-------------------------------------------------+
|     TIERS     |     ORDER     |               DESCRIPTION                |                    TESTCASES                    |
+---------------+---------------+------------------------------------------+-------------------------------------------------+
|     smoke     |       1       |     Set of basic Functional tests to     |     neutron-tempest-plugin-api rally_sanity     |
|               |               |      validate the OPNFV scenarios.       |          refstack_defcore tempest_full          |
|               |               |                                          |      tempest_scenario patrole neutron_trunk     |
|               |               |                                          |         networking-bgpvpn networking-sfc        |
|               |               |                                          |                     barbican                    |
+---------------+---------------+------------------------------------------+-------------------------------------------------+

2019-08-22 21:19:22,321 - xtesting.ci.run_tests - INFO - Loading test case 'neutron-tempest-plugin-api'...
2019-08-22 21:19:26,227 - xtesting.ci.run_tests - INFO - Running test case 'neutron-tempest-plugin-api'...
2019-08-22 21:30:21,984 - xtesting.core.testcase - INFO - The results were successfully pushed to DB
2019-08-22 21:30:21,986 - xtesting.ci.run_tests - INFO - Test result:

+------------------------------------+------------------+------------------+----------------+
|             TEST CASE              |     PROJECT      |     DURATION     |     RESULT     |
+------------------------------------+------------------+------------------+----------------+
|     neutron-tempest-plugin-api     |     functest     |      10:55       |      FAIL      |
+------------------------------------+------------------+------------------+----------------+

2019-08-22 21:30:31,913 - xtesting.ci.run_tests - ERROR - The test case 'neutron-tempest-plugin-api' failed.
2019-08-22 21:30:31,948 - xtesting.ci.run_tests - INFO - Loading test case 'rally_sanity'...
2019-08-22 21:30:34,324 - xtesting.ci.run_tests - INFO - Running test case 'rally_sanity'...
2019-08-22 22:00:44,900 - xtesting.core.testcase - INFO - The results were successfully pushed to DB
2019-08-22 22:00:44,901 - xtesting.ci.run_tests - INFO - Test result:

+----------------------+------------------+------------------+----------------+
|      TEST CASE       |     PROJECT      |     DURATION     |     RESULT     |
+----------------------+------------------+------------------+----------------+
|     rally_sanity     |     functest     |      30:10       |      PASS      |
+----------------------+------------------+------------------+----------------+

2019-08-22 22:00:55,849 - xtesting.ci.run_tests - INFO - Loading test case 'refstack_defcore'...
2019-08-22 22:00:59,758 - xtesting.ci.run_tests - INFO - Running test case 'refstack_defcore'...
2019-08-22 22:08:56,539 - xtesting.core.testcase - INFO - The results were successfully pushed to DB
2019-08-22 22:08:56,540 - xtesting.ci.run_tests - INFO - Test result:

+--------------------------+------------------+------------------+----------------+
|        TEST CASE         |     PROJECT      |     DURATION     |     RESULT     |
+--------------------------+------------------+------------------+----------------+
|     refstack_defcore     |     functest     |      07:56       |      PASS      |
+--------------------------+------------------+------------------+----------------+

2019-08-22 22:09:07,550 - xtesting.ci.run_tests - INFO - Loading test case 'tempest_full'...
2019-08-22 22:09:10,925 - xtesting.ci.run_tests - INFO - Running test case 'tempest_full'...
2019-08-22 22:53:38,712 - xtesting.core.testcase - INFO - The results were successfully pushed to DB
2019-08-22 22:53:38,713 - xtesting.ci.run_tests - INFO - Test result:

+----------------------+------------------+------------------+----------------+
|      TEST CASE       |     PROJECT      |     DURATION     |     RESULT     |
+----------------------+------------------+------------------+----------------+
|     tempest_full     |     functest     |      44:27       |      PASS      |
+----------------------+------------------+------------------+----------------+

2019-08-22 22:53:48,992 - xtesting.ci.run_tests - INFO - Loading test case 'tempest_scenario'...
2019-08-22 22:53:53,062 - xtesting.ci.run_tests - INFO - Running test case 'tempest_scenario'...
2019-08-22 23:04:25,583 - xtesting.core.testcase - INFO - The results were successfully pushed to DB
2019-08-22 23:04:25,583 - xtesting.ci.run_tests - INFO - Test result:

+--------------------------+------------------+------------------+----------------+
|        TEST CASE         |     PROJECT      |     DURATION     |     RESULT     |
+--------------------------+------------------+------------------+----------------+
|     tempest_scenario     |     functest     |      10:32       |      PASS      |
+--------------------------+------------------+------------------+----------------+

2019-08-22 23:04:36,914 - xtesting.ci.run_tests - INFO - Loading test case 'patrole'...
2019-08-22 23:04:41,001 - xtesting.ci.run_tests - INFO - Running test case 'patrole'...
2019-08-22 23:07:44,964 - xtesting.core.testcase - INFO - The results were successfully pushed to DB
2019-08-22 23:07:44,965 - xtesting.ci.run_tests - INFO - Test result:

+-------------------+------------------+------------------+----------------+
|     TEST CASE     |     PROJECT      |     DURATION     |     RESULT     |
+-------------------+------------------+------------------+----------------+
|      patrole      |     functest     |      03:04       |      PASS      |
+-------------------+------------------+------------------+----------------+

2019-08-22 23:07:55,027 - xtesting.ci.run_tests - INFO - Loading test case 'neutron_trunk'...
2019-08-22 23:07:58,533 - xtesting.ci.run_tests - INFO - Running test case 'neutron_trunk'...
2019-08-22 23:10:32,584 - xtesting.core.testcase - INFO - The results were successfully pushed to DB
2019-08-22 23:10:32,585 - xtesting.ci.run_tests - INFO - Test result:

+-----------------------+------------------+------------------+----------------+
|       TEST CASE       |     PROJECT      |     DURATION     |     RESULT     |
+-----------------------+------------------+------------------+----------------+
|     neutron_trunk     |     functest     |      02:34       |      PASS      |
+-----------------------+------------------+------------------+----------------+

2019-08-22 23:10:42,785 - xtesting.ci.run_tests - INFO - Loading test case 'networking-bgpvpn'...
2019-08-22 23:10:46,547 - functest.opnfv_tests.openstack.tempest.tempest - WARNING - Cannot find Neutron extension: bgpvpn
2019-08-22 23:10:47,094 - xtesting.ci.run_tests - INFO - Skipping test case 'networking-bgpvpn'...
2019-08-22 23:10:47,094 - xtesting.ci.run_tests - INFO - Test result:

+---------------------------+------------------+------------------+----------------+
|         TEST CASE         |     PROJECT      |     DURATION     |     RESULT     |
+---------------------------+------------------+------------------+----------------+
|     networking-bgpvpn     |     functest     |      00:00       |      SKIP      |
+---------------------------+------------------+------------------+----------------+

2019-08-22 23:10:47,148 - xtesting.ci.run_tests - INFO - Loading test case 'networking-sfc'...
2019-08-22 23:10:51,137 - functest.opnfv_tests.openstack.tempest.tempest - WARNING - Cannot find Neutron extension: sfc
2019-08-22 23:10:51,724 - xtesting.ci.run_tests - INFO - Skipping test case 'networking-sfc'...
2019-08-22 23:10:51,724 - xtesting.ci.run_tests - INFO - Test result:

+------------------------+------------------+------------------+----------------+
|       TEST CASE        |     PROJECT      |     DURATION     |     RESULT     |
+------------------------+------------------+------------------+----------------+
|     networking-sfc     |     functest     |      00:00       |      SKIP      |
+------------------------+------------------+------------------+----------------+

2019-08-22 23:10:51,763 - xtesting.ci.run_tests - INFO - Loading test case 'barbican'...
2019-08-22 23:10:55,447 - xtesting.ci.run_tests - INFO - Running test case 'barbican'...
2019-08-22 23:13:36,617 - xtesting.core.testcase - INFO - The results were successfully pushed to DB
2019-08-22 23:13:36,617 - xtesting.ci.run_tests - INFO - Test result:

+-------------------+------------------+------------------+----------------+
|     TEST CASE     |     PROJECT      |     DURATION     |     RESULT     |
+-------------------+------------------+------------------+----------------+
|      barbican     |     functest     |      02:41       |      PASS      |
+-------------------+------------------+------------------+----------------+

2019-08-22 23:13:46,892 - xtesting.ci.run_tests - INFO - Xtesting report:

+------------------------------------+------------------+---------------+------------------+----------------+
|             TEST CASE              |     PROJECT      |      TIER     |     DURATION     |     RESULT     |
+------------------------------------+------------------+---------------+------------------+----------------+
|     neutron-tempest-plugin-api     |     functest     |     smoke     |      10:55       |      FAIL      |
|            rally_sanity            |     functest     |     smoke     |      30:10       |      PASS      |
|          refstack_defcore          |     functest     |     smoke     |      07:56       |      PASS      |
|            tempest_full            |     functest     |     smoke     |      44:27       |      PASS      |
|          tempest_scenario          |     functest     |     smoke     |      10:32       |      PASS      |
|              patrole               |     functest     |     smoke     |      03:04       |      PASS      |
|           neutron_trunk            |     functest     |     smoke     |      02:34       |      PASS      |
|         networking-bgpvpn          |     functest     |     smoke     |      00:00       |      SKIP      |
|           networking-sfc           |     functest     |     smoke     |      00:00       |      SKIP      |
|              barbican              |     functest     |     smoke     |      02:41       |      PASS      |
+------------------------------------+------------------+---------------+------------------+----------------+

2019-08-22 23:13:46,900 - xtesting.ci.run_tests - INFO - Execution exit value: Result.EX_ERROR
Functest: Pulling Functest Docker image opnfv/functest-benchmarking:hunter ...
Running Functest tier 'benchmarking'. CMD: docker run --rm  -e INSTALLER_TYPE=fuel -e INSTALLER_IP=10.20.0.2     -e NODE_NAME=ericsson-virtual3 -e DEPLOY_SCENARIO=os-odl-nofeature-noha     -e BUILD_TAG=jenkins-functest-fuel-virtual-daily-hunter-639 -e DEPLOY_TYPE=virt -e CI_LOOP=daily     -e TEST_DB_URL=http://testresults.opnfv.org/test/api/v1/results -e ENERGY_RECORDER_API_URL=http://energy.opnfv.fr/resources     -e DEBUG=true -e POD_ARCH=x86_64 -e BLOCK_MIGRATION=false -e SDN_CONTROLLER_RESTCONFPORT=8080 -e IMAGE_PROPERTIES=hw_disk_bus:scsi,hw_scsi_model:virtio-scsi -e FLAVOR_EXTRA_SPECS= -v /home/jenkins/opnfv/functest/images:/home/opnfv/functest/images -v /home/jenkins/opnfv/functest/results/hunter:/home/opnfv/functest/results -v /var/lib/opnfv/mcp.rsa:/root/.ssh/id_rsa       -v /home/jenkins/opnfv-openrc.sh:/home/opnfv/functest/conf/env_file      -v /tmp/tmp.UshPF8zGoJ:/usr/lib/python2.7/site-packages/functest/opnfv_tests/openstack/tempest/custom_tests/tempest_conf.yaml  opnfv/functest-benchmarking:hunter /bin/bash -c 'run_tests -r -t all'
2019-08-22 23:13:50,913 - xtesting.ci.run_tests - INFO - Deployment description:

+--------------------------------------+----------------------------------------------------------+
|               ENV VAR                |                          VALUE                           |
+--------------------------------------+----------------------------------------------------------+
|              BUILD_TAG               |      jenkins-functest-fuel-virtual-daily-hunter-639      |
|             TEST_DB_URL              |     http://testresults.opnfv.org/test/api/v1/results     |
|     ENERGY_RECORDER_API_PASSWORD     |                                                          |
|               CI_LOOP                |                          daily                           |
|                DEBUG                 |                           true                           |
|            INSTALLER_TYPE            |                           fuel                           |
|       ENERGY_RECORDER_API_URL        |             http://energy.opnfv.fr/resources             |
|           DEPLOY_SCENARIO            |                  os-odl-nofeature-noha                   |
|       ENERGY_RECORDER_API_USER       |                                                          |
|              NODE_NAME               |                    ericsson-virtual3                     |
+--------------------------------------+----------------------------------------------------------+

2019-08-22 23:13:50,918 - xtesting.ci.run_tests - INFO - Sourcing env file /var/lib/xtesting/conf/env_file


export OS_IDENTITY_API_VERSION=3
export OS_PROJECT_DOMAIN_NAME=Default
export OS_USER_DOMAIN_NAME=Default
export OS_PROJECT_NAME=admin
export OS_TENANT_NAME=admin
export OS_USERNAME=admin
export OS_PASSWORD=opnfv_secret
export OS_REGION_NAME=RegionOne
export OS_INTERFACE=internal
export OS_ENDPOINT_TYPE="internal"
export OS_CACERT="/etc/ssl/certs/ca-certificates.crt"
export SDN_CONTROLLER_USER=admin
export SDN_CONTROLLER_RESTCONFPORT=8282
export SDN_CONTROLLER_PASSWORD=admin
export SDN_CONTROLLER_WEBPORT=8282
export SDN_CONTROLLER_IP=10.16.0.107
export VOLUME_DEVICE_NAME=sdc
export OS_AUTH_URL=http://172.16.10.36:35357/v3

2019-08-22 23:13:50,919 - xtesting.ci.run_tests - INFO - TESTS TO BE EXECUTED:

+----------------------+---------------+-------------------------------------------------+-------------------------------------------+
|        TIERS         |     ORDER     |                   DESCRIPTION                   |                 TESTCASES                 |
+----------------------+---------------+-------------------------------------------------+-------------------------------------------+
|     benchmarking     |       2       |     Run several OpenStack performance tools     |     rally_full rally_jobs vmtp shaker     |
|                      |               |     https://docs.openstack.org/performance-     |                                           |
|                      |               |       docs/latest/methodologies/tools.html      |                                           |
+----------------------+---------------+-------------------------------------------------+-------------------------------------------+

2019-08-22 23:13:50,932 - xtesting.ci.run_tests - INFO - Loading test case 'rally_full'...
2019-08-22 23:13:53,678 - xtesting.ci.run_tests - INFO - Running test case 'rally_full'...
2019-08-23 00:47:14,754 - xtesting.core.testcase - INFO - The results were successfully pushed to DB
2019-08-23 00:47:14,754 - xtesting.ci.run_tests - INFO - Test result:

+--------------------+------------------+------------------+----------------+
|     TEST CASE      |     PROJECT      |     DURATION     |     RESULT     |
+--------------------+------------------+------------------+----------------+
|     rally_full     |     functest     |      93:21       |      FAIL      |
+--------------------+------------------+------------------+----------------+

2019-08-23 00:47:26,536 - xtesting.ci.run_tests - ERROR - The test case 'rally_full' failed.
2019-08-23 00:47:26,552 - xtesting.ci.run_tests - INFO - Loading test case 'rally_jobs'...
2019-08-23 00:47:28,908 - xtesting.ci.run_tests - INFO - Running test case 'rally_jobs'...
2019-08-23 01:31:54,398 - xtesting.core.testcase - INFO - The results were successfully pushed to DB
2019-08-23 01:31:54,398 - xtesting.ci.run_tests - INFO - Test result:

+--------------------+------------------+------------------+----------------+
|     TEST CASE      |     PROJECT      |     DURATION     |     RESULT     |
+--------------------+------------------+------------------+----------------+
|     rally_jobs     |     functest     |      44:25       |      PASS      |
+--------------------+------------------+------------------+----------------+

2019-08-23 01:32:06,602 - xtesting.ci.run_tests - INFO - Loading test case 'vmtp'...
2019-08-23 01:32:09,485 - xtesting.ci.run_tests - INFO - Running test case 'vmtp'...
2019-08-23 02:07:18,168 - functest.opnfv_tests.openstack.vmtp.vmtp - ERROR - Exception when calling ['vmtp_genchart', '-c', '/home/opnfv/functest/results/vmtp/vmtp.html', '/home/opnfv/functest/results/vmtp/vmtp.json']
Error: No such file %s: /home/opnfv/functest/results/vmtp/vmtp.json

2019-08-23 02:07:18,496 - xtesting.core.testcase - INFO - The results were successfully pushed to DB
2019-08-23 02:07:18,496 - xtesting.ci.run_tests - INFO - Test result:

+-------------------+------------------+------------------+----------------+
|     TEST CASE     |     PROJECT      |     DURATION     |     RESULT     |
+-------------------+------------------+------------------+----------------+
|        vmtp       |     functest     |      35:09       |      FAIL      |
+-------------------+------------------+------------------+----------------+

2019-08-23 02:07:20,200 - functest.core.tenantnetwork - ERROR - cannot clean all resources
Traceback (most recent call last):
  File "/usr/lib/python2.7/site-packages/functest/core/tenantnetwork.py", line 282, in clean
    self.cloud.delete_router(self.router.id)
  File "/usr/lib/python2.7/site-packages/shade/openstackcloud.py", line 4156, in delete_router
    error_message="Error deleting router {0}".format(name_or_id))
  File "/usr/lib/python2.7/site-packages/keystoneauth1/adapter.py", line 343, in delete
    return self.request(url, 'DELETE', **kwargs)
  File "/usr/lib/python2.7/site-packages/openstack/_adapter.py", line 164, in request
    return _json_response(response, error_message=error_message)
  File "/usr/lib/python2.7/site-packages/openstack/_adapter.py", line 95, in _json_response
    exceptions.raise_from_response(response, error_message=error_message)
  File "/usr/lib/python2.7/site-packages/openstack/exceptions.py", line 229, in raise_from_response
    http_status=http_status, request_id=request_id
ConflictException: Error deleting router 1f664430-d6bd-48a3-a47e-292c53b74ad9: Client Error for url: http://172.16.10.36:9696/v2.0/routers/1f664430-d6bd-48a3-a47e-292c53b74ad9.json, Router 1f664430-d6bd-48a3-a47e-292c53b74ad9 still has ports
2019-08-23 02:07:22,570 - xtesting.ci.run_tests - ERROR - The test case 'vmtp' failed.
2019-08-23 02:07:22,584 - xtesting.ci.run_tests - INFO - Loading test case 'shaker'...
2019-08-23 02:07:25,001 - xtesting.ci.run_tests - INFO - Running test case 'shaker'...
2019-08-23 03:08:54,437 - functest.opnfv_tests.openstack.shaker.shaker - ERROR - cannot get report files
Traceback (most recent call last):
  File "/usr/lib/python2.7/site-packages/functest/opnfv_tests/openstack/shaker/shaker.py", line 125, in execute
    scpc.get('report.json', self.res_dir)
  File "/usr/lib/python2.7/site-packages/scp.py", line 217, in get
    self._recv_all()
  File "/usr/lib/python2.7/site-packages/scp.py", line 367, in _recv_all
    raise SCPException(asunicode(msg[1:]))
SCPException: scp: report.json: No such file or directory
2019-08-23 03:08:54,755 - xtesting.core.testcase - INFO - The results were successfully pushed to DB
2019-08-23 03:08:54,755 - xtesting.ci.run_tests - INFO - Test result:

+-------------------+------------------+------------------+----------------+
|     TEST CASE     |     PROJECT      |     DURATION     |     RESULT     |
+-------------------+------------------+------------------+----------------+
|       shaker      |     functest     |      61:29       |      FAIL      |
+-------------------+------------------+------------------+----------------+

2019-08-23 03:09:13,921 - xtesting.ci.run_tests - ERROR - The test case 'shaker' failed.
2019-08-23 03:09:13,923 - xtesting.ci.run_tests - INFO - Xtesting report:

+--------------------+------------------+----------------------+------------------+----------------+
|     TEST CASE      |     PROJECT      |         TIER         |     DURATION     |     RESULT     |
+--------------------+------------------+----------------------+------------------+----------------+
|     rally_full     |     functest     |     benchmarking     |      93:21       |      FAIL      |
|     rally_jobs     |     functest     |     benchmarking     |      44:25       |      PASS      |
|        vmtp        |     functest     |     benchmarking     |      35:09       |      FAIL      |
|       shaker       |     functest     |     benchmarking     |      61:29       |      FAIL      |
+--------------------+------------------+----------------------+------------------+----------------+

2019-08-23 03:09:13,927 - xtesting.ci.run_tests - INFO - Execution exit value: Result.EX_ERROR
Functest: Pulling Functest Docker image opnfv/functest-features:hunter ...
Running Functest tier 'features'. CMD: docker run --rm  -e INSTALLER_TYPE=fuel -e INSTALLER_IP=10.20.0.2     -e NODE_NAME=ericsson-virtual3 -e DEPLOY_SCENARIO=os-odl-nofeature-noha     -e BUILD_TAG=jenkins-functest-fuel-virtual-daily-hunter-639 -e DEPLOY_TYPE=virt -e CI_LOOP=daily     -e TEST_DB_URL=http://testresults.opnfv.org/test/api/v1/results -e ENERGY_RECORDER_API_URL=http://energy.opnfv.fr/resources     -e DEBUG=true -e POD_ARCH=x86_64 -e BLOCK_MIGRATION=false -e SDN_CONTROLLER_RESTCONFPORT=8080 -e IMAGE_PROPERTIES=hw_disk_bus:scsi,hw_scsi_model:virtio-scsi -e FLAVOR_EXTRA_SPECS= -v /home/jenkins/opnfv/functest/images:/home/opnfv/functest/images -v /home/jenkins/opnfv/functest/results/hunter:/home/opnfv/functest/results -v /var/lib/opnfv/mcp.rsa:/root/.ssh/id_rsa       -v /home/jenkins/opnfv-openrc.sh:/home/opnfv/functest/conf/env_file      -v /tmp/tmp.UshPF8zGoJ:/usr/lib/python2.7/site-packages/functest/opnfv_tests/openstack/tempest/custom_tests/tempest_conf.yaml  opnfv/functest-features:hunter /bin/bash -c 'run_tests -r -t all'
2019-08-23 03:09:17,818 - xtesting.ci.run_tests - INFO - Deployment description:

+--------------------------------------+----------------------------------------------------------+
|               ENV VAR                |                          VALUE                           |
+--------------------------------------+----------------------------------------------------------+
|              BUILD_TAG               |      jenkins-functest-fuel-virtual-daily-hunter-639      |
|             TEST_DB_URL              |     http://testresults.opnfv.org/test/api/v1/results     |
|     ENERGY_RECORDER_API_PASSWORD     |                                                          |
|               CI_LOOP                |                          daily                           |
|                DEBUG                 |                           true                           |
|            INSTALLER_TYPE            |                           fuel                           |
|       ENERGY_RECORDER_API_URL        |             http://energy.opnfv.fr/resources             |
|           DEPLOY_SCENARIO            |                  os-odl-nofeature-noha                   |
|       ENERGY_RECORDER_API_USER       |                                                          |
|              NODE_NAME               |                    ericsson-virtual3                     |
+--------------------------------------+----------------------------------------------------------+

2019-08-23 03:09:17,823 - xtesting.ci.run_tests - INFO - Sourcing env file /var/lib/xtesting/conf/env_file


export OS_IDENTITY_API_VERSION=3
export OS_PROJECT_DOMAIN_NAME=Default
export OS_USER_DOMAIN_NAME=Default
export OS_PROJECT_NAME=admin
export OS_TENANT_NAME=admin
export OS_USERNAME=admin
export OS_PASSWORD=opnfv_secret
export OS_REGION_NAME=RegionOne
export OS_INTERFACE=internal
export OS_ENDPOINT_TYPE="internal"
export OS_CACERT="/etc/ssl/certs/ca-certificates.crt"
export SDN_CONTROLLER_USER=admin
export SDN_CONTROLLER_RESTCONFPORT=8282
export SDN_CONTROLLER_PASSWORD=admin
export SDN_CONTROLLER_WEBPORT=8282
export SDN_CONTROLLER_IP=10.16.0.107
export VOLUME_DEVICE_NAME=sdc
export OS_AUTH_URL=http://172.16.10.36:35357/v3

2019-08-23 03:09:17,824 - xtesting.ci.run_tests - INFO - TESTS TO BE EXECUTED:

+---------------+---------------+---------------------+-------------------+
|     TIERS     |     ORDER     |     DESCRIPTION     |     TESTCASES     |
+---------------+---------------+---------------------+-------------------+
+---------------+---------------+---------------------+-------------------+

2019-08-23 03:09:17,824 - xtesting.ci.run_tests - INFO - Xtesting report:

+-----------------------------+-------------------+------------------+------------------+----------------+
|          TEST CASE          |      PROJECT      |       TIER       |     DURATION     |     RESULT     |
+-----------------------------+-------------------+------------------+------------------+----------------+
|     doctor-notification     |       doctor      |     features     |      00:00       |      SKIP      |
|       functest-odl-sfc      |        sfc        |     features     |      00:00       |      SKIP      |
|      barometercollectd      |     barometer     |     features     |      00:00       |      SKIP      |
|             vgpu            |      functest     |     features     |      00:00       |      SKIP      |
|         stor4nfv_os         |      stor4nfv     |     features     |      00:00       |      SKIP      |
+-----------------------------+-------------------+------------------+------------------+----------------+

2019-08-23 03:09:17,828 - xtesting.ci.run_tests - INFO - Execution exit value: Result.EX_OK
Functest: Pulling Functest Docker image opnfv/functest-vnf:hunter ...
Running Functest tier 'vnf'. CMD: docker run --rm  -e INSTALLER_TYPE=fuel -e INSTALLER_IP=10.20.0.2     -e NODE_NAME=ericsson-virtual3 -e DEPLOY_SCENARIO=os-odl-nofeature-noha     -e BUILD_TAG=jenkins-functest-fuel-virtual-daily-hunter-639 -e DEPLOY_TYPE=virt -e CI_LOOP=daily     -e TEST_DB_URL=http://testresults.opnfv.org/test/api/v1/results -e ENERGY_RECORDER_API_URL=http://energy.opnfv.fr/resources     -e DEBUG=true -e POD_ARCH=x86_64 -e BLOCK_MIGRATION=false -e SDN_CONTROLLER_RESTCONFPORT=8080 -e IMAGE_PROPERTIES=hw_disk_bus:scsi,hw_scsi_model:virtio-scsi -e FLAVOR_EXTRA_SPECS= -v /home/jenkins/opnfv/functest/images:/home/opnfv/functest/images -v /home/jenkins/opnfv/functest/results/hunter:/home/opnfv/functest/results -v /var/lib/opnfv/mcp.rsa:/root/.ssh/id_rsa       -v /home/jenkins/opnfv-openrc.sh:/home/opnfv/functest/conf/env_file      -v /tmp/tmp.UshPF8zGoJ:/usr/lib/python2.7/site-packages/functest/opnfv_tests/openstack/tempest/custom_tests/tempest_conf.yaml  opnfv/functest-vnf:hunter /bin/bash -c 'run_tests -r -t all'
2019-08-23 03:09:21,758 - xtesting.ci.run_tests - INFO - Deployment description:

+--------------------------------------+----------------------------------------------------------+
|               ENV VAR                |                          VALUE                           |
+--------------------------------------+----------------------------------------------------------+
|              BUILD_TAG               |      jenkins-functest-fuel-virtual-daily-hunter-639      |
|             TEST_DB_URL              |     http://testresults.opnfv.org/test/api/v1/results     |
|     ENERGY_RECORDER_API_PASSWORD     |                                                          |
|               CI_LOOP                |                          daily                           |
|                DEBUG                 |                           true                           |
|            INSTALLER_TYPE            |                           fuel                           |
|       ENERGY_RECORDER_API_URL        |             http://energy.opnfv.fr/resources             |
|           DEPLOY_SCENARIO            |                  os-odl-nofeature-noha                   |
|       ENERGY_RECORDER_API_USER       |                                                          |
|              NODE_NAME               |                    ericsson-virtual3                     |
+--------------------------------------+----------------------------------------------------------+

2019-08-23 03:09:21,763 - xtesting.ci.run_tests - INFO - Sourcing env file /var/lib/xtesting/conf/env_file


export OS_IDENTITY_API_VERSION=3
export OS_PROJECT_DOMAIN_NAME=Default
export OS_USER_DOMAIN_NAME=Default
export OS_PROJECT_NAME=admin
export OS_TENANT_NAME=admin
export OS_USERNAME=admin
export OS_PASSWORD=opnfv_secret
export OS_REGION_NAME=RegionOne
export OS_INTERFACE=internal
export OS_ENDPOINT_TYPE="internal"
export OS_CACERT="/etc/ssl/certs/ca-certificates.crt"
export SDN_CONTROLLER_USER=admin
export SDN_CONTROLLER_RESTCONFPORT=8282
export SDN_CONTROLLER_PASSWORD=admin
export SDN_CONTROLLER_WEBPORT=8282
export SDN_CONTROLLER_IP=10.16.0.107
export VOLUME_DEVICE_NAME=sdc
export OS_AUTH_URL=http://172.16.10.36:35357/v3

2019-08-23 03:09:21,764 - xtesting.ci.run_tests - INFO - TESTS TO BE EXECUTED:

+---------------+---------------+---------------------------------------+----------------------------------------+
|     TIERS     |     ORDER     |              DESCRIPTION              |               TESTCASES                |
+---------------+---------------+---------------------------------------+----------------------------------------+
|      vnf      |       4       |     Collection of VNF test cases.     |     cloudify cloudify_ims heat_ims     |
|               |               |                                       |         vyos_vrouter juju_epc          |
+---------------+---------------+---------------------------------------+----------------------------------------+

2019-08-23 03:09:21,776 - xtesting.ci.run_tests - INFO - Loading test case 'cloudify'...
2019-08-23 03:09:24,085 - xtesting.ci.run_tests - INFO - Running test case 'cloudify'...
2019-08-23 03:12:56,648 - functest.core.cloudify - INFO - Attemps running status of the Manager
2019-08-23 03:13:27,204 - functest.core.cloudify - INFO - The current manager status is running
2019-08-23 03:13:27,792 - functest.core.cloudify - INFO - Secrets API successfully reached
2019-08-23 03:13:27,792 - functest.core.cloudify - INFO - Cloudify Manager is up and running
2019-08-23 03:13:28,062 - xtesting.core.testcase - INFO - The results were successfully pushed to DB
2019-08-23 03:13:28,062 - xtesting.ci.run_tests - INFO - Test result:

+-------------------+------------------+------------------+----------------+
|     TEST CASE     |     PROJECT      |     DURATION     |     RESULT     |
+-------------------+------------------+------------------+----------------+
|      cloudify     |     functest     |      04:04       |      PASS      |
+-------------------+------------------+------------------+----------------+

2019-08-23 03:13:45,424 - xtesting.ci.run_tests - INFO - Loading test case 'cloudify_ims'...
2019-08-23 03:13:47,556 - xtesting.ci.run_tests - INFO - Running test case 'cloudify_ims'...
2019-08-23 03:17:09,293 - functest.core.cloudify - INFO - Attemps running status of the Manager
2019-08-23 03:17:39,860 - functest.core.cloudify - INFO - The current manager status is running
2019-08-23 03:17:40,346 - functest.core.cloudify - INFO - Secrets API successfully reached
2019-08-23 03:17:40,346 - functest.core.cloudify - INFO - Cloudify Manager is up and running
2019-08-23 03:17:41,834 - functest.core.cloudify - INFO - Put private keypair in manager
2019-08-23 03:24:36,018 - functest.core.singlevm - ERROR - Cannot run cloudify_ims
Traceback (most recent call last):
  File "/usr/lib/python2.7/site-packages/functest/core/singlevm.py", line 468, in run
    if not self.execute():
  File "/usr/lib/python2.7/site-packages/functest/opnfv_tests/vnf/ims/cloudify_ims.py", line 166, in execute
    if self.deploy_vnf() and self.test_vnf():
  File "/usr/lib/python2.7/site-packages/functest/opnfv_tests/vnf/ims/cloudify_ims.py", line 217, in deploy_vnf
    self.cfy_client, execution, self.__logger, timeout=3600)
  File "/usr/lib/python2.7/site-packages/functest/core/cloudify.py", line 182, in wait_for_execution
    sort='@timestamp').items
  File "/usr/lib/python2.7/site-packages/cloudify_rest_client/events.py", line 77, in list
    response = self.api.get(uri, _include=_include, params=params)
  File "/usr/lib/python2.7/site-packages/cloudify_rest_client/client.py", line 252, in get
    timeout=timeout)
  File "/usr/lib/python2.7/site-packages/cloudify_rest_client/client.py", line 233, in do_request
    'SSL, but the client does'.format(e)
ConnectionError: HTTPConnectionPool(host='10.16.0.115', port=80): Max retries exceeded with url: /api/v3.1/events?_offset=2270&type=cloudify_event&type=cloudify_log&execution_id=b2f07139-f68f-4935-aa11-32d259f7f102&_sort=%40timestamp&_size=50 (Caused by NewConnectionError('<urllib3.connection.HTTPConnection object at 0x7f2e0bdd2550>: Failed to establish a new connection: [Errno 113] Host is unreachable',))
This can happen when the manager is not working with SSL, but the client does
2019-08-23 03:24:36,327 - xtesting.core.testcase - INFO - The results were successfully pushed to DB
2019-08-23 03:24:36,327 - xtesting.ci.run_tests - INFO - Test result:

+----------------------+------------------+------------------+----------------+
|      TEST CASE       |     PROJECT      |     DURATION     |     RESULT     |
+----------------------+------------------+------------------+----------------+
|     cloudify_ims     |     functest     |      10:48       |      FAIL      |
+----------------------+------------------+------------------+----------------+

2019-08-23 03:24:36,330 - functest.core.cloudify - INFO - Deleting the current deployment
2019-08-23 03:24:39,410 - functest.core.cloudify - ERROR - Some issue during the undeployment ..
Traceback (most recent call last):
  File "/usr/lib/python2.7/site-packages/functest/core/cloudify.py", line 143, in kill_existing_execution
    exec_list = self.cfy_client.executions.list()
  File "/usr/lib/python2.7/site-packages/cloudify_rest_client/executions.py", line 139, in list
    _include=_include)
  File "/usr/lib/python2.7/site-packages/cloudify_rest_client/client.py", line 252, in get
    timeout=timeout)
  File "/usr/lib/python2.7/site-packages/cloudify_rest_client/client.py", line 233, in do_request
    'SSL, but the client does'.format(e)
ConnectionError: HTTPConnectionPool(host='10.16.0.115', port=80): Max retries exceeded with url: /api/v3.1/executions?_include_system_workflows=False (Caused by NewConnectionError('<urllib3.connection.HTTPConnection object at 0x7f2e0bdda050>: Failed to establish a new connection: [Errno 113] Host is unreachable',))
This can happen when the manager is not working with SSL, but the client does
2019-08-23 03:24:46,217 - functest.core.tenantnetwork - ERROR - cannot clean all resources
Traceback (most recent call last):
  File "/usr/lib/python2.7/site-packages/functest/core/tenantnetwork.py", line 281, in clean
    self.router, self.subnet.id)
  File "/usr/lib/python2.7/site-packages/shade/openstackcloud.py", line 3998, in remove_router_interface
    router['id']))
  File "/usr/lib/python2.7/site-packages/keystoneauth1/adapter.py", line 337, in put
    return self.request(url, 'PUT', **kwargs)
  File "/usr/lib/python2.7/site-packages/openstack/_adapter.py", line 164, in request
    return _json_response(response, error_message=error_message)
  File "/usr/lib/python2.7/site-packages/openstack/_adapter.py", line 95, in _json_response
    exceptions.raise_from_response(response, error_message=error_message)
  File "/usr/lib/python2.7/site-packages/openstack/exceptions.py", line 229, in raise_from_response
    http_status=http_status, request_id=request_id
ConflictException: Error detaching interface from router cdb12577-5e38-49e4-af84-5d766b86050e: Client Error for url: http://172.16.10.36:9696/v2.0/routers/cdb12577-5e38-49e4-af84-5d766b86050e/remove_router_interface.json, Router interface for subnet e937a6bf-e989-4097-9269-85ac5ff122c5 on router cdb12577-5e38-49e4-af84-5d766b86050e cannot be deleted, as it is required by one or more floating IPs.
2019-08-23 03:24:48,566 - functest.core.tenantnetwork - ERROR - Cannot clean all resources
Traceback (most recent call last):
  File "/usr/lib/python2.7/site-packages/functest/core/tenantnetwork.py", line 129, in clean
    self.orig_cloud.delete_security_group(sec_id)
  File "/usr/lib/python2.7/site-packages/shade/openstackcloud.py", line 7987, in delete_security_group
    name_or_id)
  File "/usr/lib/python2.7/site-packages/keystoneauth1/adapter.py", line 343, in delete
    return self.request(url, 'DELETE', **kwargs)
  File "/usr/lib/python2.7/site-packages/openstack/_adapter.py", line 164, in request
    return _json_response(response, error_message=error_message)
  File "/usr/lib/python2.7/site-packages/openstack/_adapter.py", line 95, in _json_response
    exceptions.raise_from_response(response, error_message=error_message)
  File "/usr/lib/python2.7/site-packages/openstack/exceptions.py", line 229, in raise_from_response
    http_status=http_status, request_id=request_id
ConflictException: Error deleting security group df230092-3de7-4a50-b14a-c0c8eb5b4fa7: Client Error for url: http://172.16.10.36:9696/v2.0/security-groups/df230092-3de7-4a50-b14a-c0c8eb5b4fa7.json, Security Group df230092-3de7-4a50-b14a-c0c8eb5b4fa7 in use.
2019-08-23 03:24:48,566 - xtesting.ci.run_tests - ERROR - The test case 'cloudify_ims' failed.
2019-08-23 03:24:48,580 - xtesting.ci.run_tests - INFO - Loading test case 'heat_ims'...
2019-08-23 03:24:50,727 - xtesting.ci.run_tests - INFO - Running test case 'heat_ims'...
2019-08-23 04:09:07,122 - functest.opnfv_tests.vnf.ims.heat_ims - ERROR - Cannot run heat_ims
Traceback (most recent call last):
  File "/usr/lib/python2.7/site-packages/functest/opnfv_tests/vnf/ims/heat_ims.py", line 143, in run
    if not self.execute():
  File "/usr/lib/python2.7/site-packages/functest/opnfv_tests/vnf/ims/heat_ims.py", line 120, in execute
    if self.deploy_vnf() and self.test_vnf():
  File "/usr/lib/python2.7/site-packages/functest/opnfv_tests/vnf/ims/heat_ims.py", line 188, in deploy_vnf
    self._monit()
  File "/usr/lib/python2.7/site-packages/functest/opnfv_tests/vnf/ims/heat_ims.py", line 163, in _monit
    key_filename=self.key_filename, timeout=timeout)
  File "/usr/lib/python2.7/site-packages/paramiko/client.py", line 357, in connect
    raise NoValidConnectionsError(errors)
NoValidConnectionsError: [Errno None] Unable to connect to port 22 on 10.16.0.134
2019-08-23 04:09:07,388 - xtesting.core.testcase - INFO - The results were successfully pushed to DB
2019-08-23 04:09:07,388 - xtesting.ci.run_tests - INFO - Test result:

+-------------------+------------------+------------------+----------------+
|     TEST CASE     |     PROJECT      |     DURATION     |     RESULT     |
+-------------------+------------------+------------------+----------------+
|      heat_ims     |     functest     |      44:16       |      FAIL      |
+-------------------+------------------+------------------+----------------+

2019-08-23 04:09:56,057 - xtesting.ci.run_tests - ERROR - The test case 'heat_ims' failed.
2019-08-23 04:09:56,071 - xtesting.ci.run_tests - INFO - Loading test case 'vyos_vrouter'...
2019-08-23 04:09:58,672 - xtesting.ci.run_tests - INFO - Running test case 'vyos_vrouter'...
2019-08-23 04:10:43,587 - functest.core.singlevm - ERROR - Cannot run vyos_vrouter
Traceback (most recent call last):
  File "/usr/lib/python2.7/site-packages/functest/core/singlevm.py", line 466, in run
    key_name=self.keypair.id, security_groups=[self.sec.id])
  File "/usr/lib/python2.7/site-packages/functest/core/singlevm.py", line 216, in boot_vm
    timeout=self.create_server_timeout, wait=True, **kwargs)
  File "<decorator-gen-108>", line 2, in create_server
  File "/usr/lib/python2.7/site-packages/openstack/cloud/_utils.py", line 377, in func_wrapper
    return func(*args, **kwargs)
  File "/usr/lib/python2.7/site-packages/shade/openstackcloud.py", line 6654, in create_server
    nat_destination=nat_destination,
  File "/usr/lib/python2.7/site-packages/shade/openstackcloud.py", line 6697, in wait_for_server
    nat_destination=nat_destination)
  File "/usr/lib/python2.7/site-packages/shade/openstackcloud.py", line 6714, in get_active_server
    "Error in creating the server", extra_data=dict(server=server))
SDKException: Error in creating the server
2019-08-23 04:10:43,866 - xtesting.core.testcase - INFO - The results were successfully pushed to DB
2019-08-23 04:10:43,866 - xtesting.ci.run_tests - INFO - Test result:

+----------------------+------------------+------------------+----------------+
|      TEST CASE       |     PROJECT      |     DURATION     |     RESULT     |
+----------------------+------------------+------------------+----------------+
|     vyos_vrouter     |     functest     |      00:45       |      FAIL      |
+----------------------+------------------+------------------+----------------+

2019-08-23 04:10:43,870 - functest.core.cloudify - INFO - Deleting the current deployment
2019-08-23 04:10:43,870 - functest.core.cloudify - ERROR - Some issue during the undeployment ..
Traceback (most recent call last):
  File "/usr/lib/python2.7/site-packages/functest/core/cloudify.py", line 143, in kill_existing_execution
    exec_list = self.cfy_client.executions.list()
AttributeError: 'NoneType' object has no attribute 'executions'
2019-08-23 04:11:00,602 - xtesting.ci.run_tests - ERROR - The test case 'vyos_vrouter' failed.
2019-08-23 04:11:00,614 - xtesting.ci.run_tests - INFO - Loading test case 'juju_epc'...
2019-08-23 04:11:02,952 - xtesting.ci.run_tests - INFO - Running test case 'juju_epc'...
2019-08-23 04:33:47,618 - functest.opnfv_tests.vnf.epc.juju_epc - ERROR - Exception with Juju VNF Deployment: ['timeout', '-t', '4800', 'juju-wait']
ERROR:root:ERROR dial tcp 192.168.120.11:17070: i/o timeout

ERROR:root:juju status --format=json failed: 1

2019-08-23 04:33:47,901 - xtesting.core.testcase - INFO - The results were successfully pushed to DB
2019-08-23 04:33:47,904 - xtesting.ci.run_tests - INFO - Test result:

+-------------------+------------------+------------------+----------------+
|     TEST CASE     |     PROJECT      |     DURATION     |     RESULT     |
+-------------------+------------------+------------------+----------------+
|      juju_epc     |     functest     |      22:45       |      FAIL      |
+-------------------+------------------+------------------+----------------+

2019-08-23 04:43:48,052 - functest.opnfv_tests.vnf.epc.juju_epc - ERROR - Exception with Juju Cleanup: ['juju', 'debug-log', '--replay', '--no-tail']
ERROR dial tcp 252.11.0.1:17070: i/o timeout

2019-08-23 04:43:59,163 - functest.core.tenantnetwork - ERROR - cannot clean all resources
Traceback (most recent call last):
  File "/usr/lib/python2.7/site-packages/functest/core/tenantnetwork.py", line 284, in clean
    self.cloud.delete_subnet(self.subnet.id)
  File "/usr/lib/python2.7/site-packages/shade/openstackcloud.py", line 7680, in delete_subnet
    "/subnets/{subnet_id}.json".format(subnet_id=subnet['id']))
  File "/usr/lib/python2.7/site-packages/keystoneauth1/adapter.py", line 343, in delete
    return self.request(url, 'DELETE', **kwargs)
  File "/usr/lib/python2.7/site-packages/openstack/_adapter.py", line 164, in request
    return _json_response(response, error_message=error_message)
  File "/usr/lib/python2.7/site-packages/openstack/_adapter.py", line 95, in _json_response
    exceptions.raise_from_response(response, error_message=error_message)
  File "/usr/lib/python2.7/site-packages/openstack/exceptions.py", line 229, in raise_from_response
    http_status=http_status, request_id=request_id
ConflictException: ConflictException: 409: Client Error for url: http://172.16.10.36:9696/v2.0/subnets/64be30e8-cf5d-4566-bc68-c0c95af3d8f1.json, Unable to complete operation on subnet 64be30e8-cf5d-4566-bc68-c0c95af3d8f1: One or more ports have an IP allocation from this subnet.
2019-08-23 04:44:07,356 - functest.core.tenantnetwork - ERROR - Cannot clean all resources
Traceback (most recent call last):
  File "/usr/lib/python2.7/site-packages/functest/core/tenantnetwork.py", line 129, in clean
    self.orig_cloud.delete_security_group(sec_id)
  File "/usr/lib/python2.7/site-packages/shade/openstackcloud.py", line 7987, in delete_security_group
    name_or_id)
  File "/usr/lib/python2.7/site-packages/keystoneauth1/adapter.py", line 343, in delete
    return self.request(url, 'DELETE', **kwargs)
  File "/usr/lib/python2.7/site-packages/openstack/_adapter.py", line 164, in request
    return _json_response(response, error_message=error_message)
  File "/usr/lib/python2.7/site-packages/openstack/_adapter.py", line 95, in _json_response
    exceptions.raise_from_response(response, error_message=error_message)
  File "/usr/lib/python2.7/site-packages/openstack/exceptions.py", line 229, in raise_from_response
    http_status=http_status, request_id=request_id
ConflictException: Error deleting security group 523f658e-af8a-4659-bb4b-0a70f077007e: Client Error for url: http://172.16.10.36:9696/v2.0/security-groups/523f658e-af8a-4659-bb4b-0a70f077007e.json, Security Group 523f658e-af8a-4659-bb4b-0a70f077007e in use.
2019-08-23 04:44:07,357 - xtesting.ci.run_tests - ERROR - The test case 'juju_epc' failed.
2019-08-23 04:44:07,358 - xtesting.ci.run_tests - INFO - Xtesting report:

+----------------------+------------------+--------------+------------------+----------------+
|      TEST CASE       |     PROJECT      |     TIER     |     DURATION     |     RESULT     |
+----------------------+------------------+--------------+------------------+----------------+
|       cloudify       |     functest     |     vnf      |      04:04       |      PASS      |
|     cloudify_ims     |     functest     |     vnf      |      10:48       |      FAIL      |
|       heat_ims       |     functest     |     vnf      |      44:16       |      FAIL      |
|     vyos_vrouter     |     functest     |     vnf      |      00:45       |      FAIL      |
|       juju_epc       |     functest     |     vnf      |      22:45       |      FAIL      |
+----------------------+------------------+--------------+------------------+----------------+

2019-08-23 04:44:07,362 - xtesting.ci.run_tests - INFO - Execution exit value: Result.EX_ERROR
Regular expression run condition: Expression=[k8-.*], Label=[os-odl-nofeature-noha]
Run condition [Regular expression match] preventing perform for step [Execute shell]
[functest-fuel-virtual-daily-hunter] $ /bin/bash /tmp/jenkins6469723349998981810.sh
Uploading logs to artifact logs/functest/ericsson-virtual3/hunter/2019-08-23_04-44-08
Logs can be found in https://artifacts.opnfv.org/logs_functest_ericsson-virtual3.html
https://artifacts.opnfv.org/logs/functest/ericsson-virtual3/hunter/2019-08-23_04-44-08/rally_jobs
https://artifacts.opnfv.org/logs/functest/ericsson-virtual3/hunter/2019-08-23_04-44-08/rally_jobs/rally_jobs.xml
https://artifacts.opnfv.org/logs/functest/ericsson-virtual3/hunter/2019-08-23_04-44-08/rally_jobs/rally.log
https://artifacts.opnfv.org/logs/functest/ericsson-virtual3/hunter/2019-08-23_04-44-08/rally_jobs/rally_jobs.html
https://artifacts.opnfv.org/logs/functest/ericsson-virtual3/hunter/2019-08-23_04-44-08/rally_jobs/neutron.json
https://artifacts.opnfv.org/logs/functest/ericsson-virtual3/hunter/2019-08-23_04-44-08/neutron_trunk
https://artifacts.opnfv.org/logs/functest/ericsson-virtual3/hunter/2019-08-23_04-44-08/neutron_trunk/rally.conf
https://artifacts.opnfv.org/logs/functest/ericsson-virtual3/hunter/2019-08-23_04-44-08/neutron_trunk/tempest.debug.log
https://artifacts.opnfv.org/logs/functest/ericsson-virtual3/hunter/2019-08-23_04-44-08/neutron_trunk/rally.log
https://artifacts.opnfv.org/logs/functest/ericsson-virtual3/hunter/2019-08-23_04-44-08/neutron_trunk/tempest-report.html
https://artifacts.opnfv.org/logs/functest/ericsson-virtual3/hunter/2019-08-23_04-44-08/neutron_trunk/tempest-report.xml
https://artifacts.opnfv.org/logs/functest/ericsson-virtual3/hunter/2019-08-23_04-44-08/neutron_trunk/test_list.txt
https://artifacts.opnfv.org/logs/functest/ericsson-virtual3/hunter/2019-08-23_04-44-08/neutron_trunk/tempest.log
https://artifacts.opnfv.org/logs/functest/ericsson-virtual3/hunter/2019-08-23_04-44-08/neutron_trunk/test_raw_list.txt
https://artifacts.opnfv.org/logs/functest/ericsson-virtual3/hunter/2019-08-23_04-44-08/neutron_trunk/tempest.conf
https://artifacts.opnfv.org/logs/functest/ericsson-virtual3/hunter/2019-08-23_04-44-08/vmtp
https://artifacts.opnfv.org/logs/functest/ericsson-virtual3/hunter/2019-08-23_04-44-08/vmtp/vmtp.conf
https://artifacts.opnfv.org/logs/functest/ericsson-virtual3/hunter/2019-08-23_04-44-08/tempest_full
https://artifacts.opnfv.org/logs/functest/ericsson-virtual3/hunter/2019-08-23_04-44-08/tempest_full/rally.conf
https://artifacts.opnfv.org/logs/functest/ericsson-virtual3/hunter/2019-08-23_04-44-08/tempest_full/tempest.debug.log
https://artifacts.opnfv.org/logs/functest/ericsson-virtual3/hunter/2019-08-23_04-44-08/tempest_full/rally.log
https://artifacts.opnfv.org/logs/functest/ericsson-virtual3/hunter/2019-08-23_04-44-08/tempest_full/tempest-report.html
https://artifacts.opnfv.org/logs/functest/ericsson-virtual3/hunter/2019-08-23_04-44-08/tempest_full/tempest-report.xml
https://artifacts.opnfv.org/logs/functest/ericsson-virtual3/hunter/2019-08-23_04-44-08/tempest_full/test_list.txt
https://artifacts.opnfv.org/logs/functest/ericsson-virtual3/hunter/2019-08-23_04-44-08/tempest_full/tempest.log
https://artifacts.opnfv.org/logs/functest/ericsson-virtual3/hunter/2019-08-23_04-44-08/tempest_full/test_raw_list.txt
https://artifacts.opnfv.org/logs/functest/ericsson-virtual3/hunter/2019-08-23_04-44-08/tempest_full/tempest.conf
https://artifacts.opnfv.org/logs/functest/ericsson-virtual3/hunter/2019-08-23_04-44-08/functest.log
https://artifacts.opnfv.org/logs/functest/ericsson-virtual3/hunter/2019-08-23_04-44-08/patrole
https://artifacts.opnfv.org/logs/functest/ericsson-virtual3/hunter/2019-08-23_04-44-08/patrole/rally.conf
https://artifacts.opnfv.org/logs/functest/ericsson-virtual3/hunter/2019-08-23_04-44-08/patrole/tempest.debug.log
https://artifacts.opnfv.org/logs/functest/ericsson-virtual3/hunter/2019-08-23_04-44-08/patrole/rally.log
https://artifacts.opnfv.org/logs/functest/ericsson-virtual3/hunter/2019-08-23_04-44-08/patrole/tempest-report.html
https://artifacts.opnfv.org/logs/functest/ericsson-virtual3/hunter/2019-08-23_04-44-08/patrole/tempest-report.xml
https://artifacts.opnfv.org/logs/functest/ericsson-virtual3/hunter/2019-08-23_04-44-08/patrole/test_list.txt
https://artifacts.opnfv.org/logs/functest/ericsson-virtual3/hunter/2019-08-23_04-44-08/patrole/tempest.log
https://artifacts.opnfv.org/logs/functest/ericsson-virtual3/hunter/2019-08-23_04-44-08/patrole/test_raw_list.txt
https://artifacts.opnfv.org/logs/functest/ericsson-virtual3/hunter/2019-08-23_04-44-08/patrole/tempest.conf
https://artifacts.opnfv.org/logs/functest/ericsson-virtual3/hunter/2019-08-23_04-44-08/functest.debug.log
https://artifacts.opnfv.org/logs/functest/ericsson-virtual3/hunter/2019-08-23_04-44-08/tempest_smoke
https://artifacts.opnfv.org/logs/functest/ericsson-virtual3/hunter/2019-08-23_04-44-08/tempest_smoke/rally.conf
https://artifacts.opnfv.org/logs/functest/ericsson-virtual3/hunter/2019-08-23_04-44-08/tempest_smoke/tempest.debug.log
https://artifacts.opnfv.org/logs/functest/ericsson-virtual3/hunter/2019-08-23_04-44-08/tempest_smoke/rally.log
https://artifacts.opnfv.org/logs/functest/ericsson-virtual3/hunter/2019-08-23_04-44-08/tempest_smoke/tempest-report.html
https://artifacts.opnfv.org/logs/functest/ericsson-virtual3/hunter/2019-08-23_04-44-08/tempest_smoke/tempest-report.xml
https://artifacts.opnfv.org/logs/functest/ericsson-virtual3/hunter/2019-08-23_04-44-08/tempest_smoke/test_list.txt
https://artifacts.opnfv.org/logs/functest/ericsson-virtual3/hunter/2019-08-23_04-44-08/tempest_smoke/tempest.log
https://artifacts.opnfv.org/logs/functest/ericsson-virtual3/hunter/2019-08-23_04-44-08/tempest_smoke/test_raw_list.txt
https://artifacts.opnfv.org/logs/functest/ericsson-virtual3/hunter/2019-08-23_04-44-08/tempest_smoke/tempest.conf
https://artifacts.opnfv.org/logs/functest/ericsson-virtual3/hunter/2019-08-23_04-44-08/rally_full
https://artifacts.opnfv.org/logs/functest/ericsson-virtual3/hunter/2019-08-23_04-44-08/rally_full/rally_full.xml
https://artifacts.opnfv.org/logs/functest/ericsson-virtual3/hunter/2019-08-23_04-44-08/rally_full/nova.json
https://artifacts.opnfv.org/logs/functest/ericsson-virtual3/hunter/2019-08-23_04-44-08/rally_full/rally.log
https://artifacts.opnfv.org/logs/functest/ericsson-virtual3/hunter/2019-08-23_04-44-08/rally_full/keystone.json
https://artifacts.opnfv.org/logs/functest/ericsson-virtual3/hunter/2019-08-23_04-44-08/rally_full/authenticate.json
https://artifacts.opnfv.org/logs/functest/ericsson-virtual3/hunter/2019-08-23_04-44-08/rally_full/gnocchi.json
https://artifacts.opnfv.org/logs/functest/ericsson-virtual3/hunter/2019-08-23_04-44-08/rally_full/heat.json
https://artifacts.opnfv.org/logs/functest/ericsson-virtual3/hunter/2019-08-23_04-44-08/rally_full/quotas.json
https://artifacts.opnfv.org/logs/functest/ericsson-virtual3/hunter/2019-08-23_04-44-08/rally_full/neutron.json
https://artifacts.opnfv.org/logs/functest/ericsson-virtual3/hunter/2019-08-23_04-44-08/rally_full/cinder.json
https://artifacts.opnfv.org/logs/functest/ericsson-virtual3/hunter/2019-08-23_04-44-08/rally_full/glance.json
https://artifacts.opnfv.org/logs/functest/ericsson-virtual3/hunter/2019-08-23_04-44-08/rally_full/rally_full.html
https://artifacts.opnfv.org/logs/functest/ericsson-virtual3/hunter/2019-08-23_04-44-08/juju_epc
https://artifacts.opnfv.org/logs/functest/ericsson-virtual3/hunter/2019-08-23_04-44-08/juju_epc/clouds.yaml
https://artifacts.opnfv.org/logs/functest/ericsson-virtual3/hunter/2019-08-23_04-44-08/juju_epc/credentials.yaml
https://artifacts.opnfv.org/logs/functest/ericsson-virtual3/hunter/2019-08-23_04-44-08/neutron-tempest-plugin-api
https://artifacts.opnfv.org/logs/functest/ericsson-virtual3/hunter/2019-08-23_04-44-08/neutron-tempest-plugin-api/rally.conf
https://artifacts.opnfv.org/logs/functest/ericsson-virtual3/hunter/2019-08-23_04-44-08/neutron-tempest-plugin-api/tempest.debug.log
https://artifacts.opnfv.org/logs/functest/ericsson-virtual3/hunter/2019-08-23_04-44-08/neutron-tempest-plugin-api/rally.log
https://artifacts.opnfv.org/logs/functest/ericsson-virtual3/hunter/2019-08-23_04-44-08/neutron-tempest-plugin-api/tempest-report.html
https://artifacts.opnfv.org/logs/functest/ericsson-virtual3/hunter/2019-08-23_04-44-08/neutron-tempest-plugin-api/tempest-report.xml
https://artifacts.opnfv.org/logs/functest/ericsson-virtual3/hunter/2019-08-23_04-44-08/neutron-tempest-plugin-api/test_list.txt
https://artifacts.opnfv.org/logs/functest/ericsson-virtual3/hunter/2019-08-23_04-44-08/neutron-tempest-plugin-api/tempest.log
https://artifacts.opnfv.org/logs/functest/ericsson-virtual3/hunter/2019-08-23_04-44-08/neutron-tempest-plugin-api/test_raw_list.txt
https://artifacts.opnfv.org/logs/functest/ericsson-virtual3/hunter/2019-08-23_04-44-08/neutron-tempest-plugin-api/tempest.conf
https://artifacts.opnfv.org/logs/functest/ericsson-virtual3/hunter/2019-08-23_04-44-08/tempest_scenario
https://artifacts.opnfv.org/logs/functest/ericsson-virtual3/hunter/2019-08-23_04-44-08/tempest_scenario/rally.conf
https://artifacts.opnfv.org/logs/functest/ericsson-virtual3/hunter/2019-08-23_04-44-08/tempest_scenario/tempest.debug.log
https://artifacts.opnfv.org/logs/functest/ericsson-virtual3/hunter/2019-08-23_04-44-08/tempest_scenario/rally.log
https://artifacts.opnfv.org/logs/functest/ericsson-virtual3/hunter/2019-08-23_04-44-08/tempest_scenario/tempest-report.html
https://artifacts.opnfv.org/logs/functest/ericsson-virtual3/hunter/2019-08-23_04-44-08/tempest_scenario/tempest-report.xml
https://artifacts.opnfv.org/logs/functest/ericsson-virtual3/hunter/2019-08-23_04-44-08/tempest_scenario/test_list.txt
https://artifacts.opnfv.org/logs/functest/ericsson-virtual3/hunter/2019-08-23_04-44-08/tempest_scenario/tempest.log
https://artifacts.opnfv.org/logs/functest/ericsson-virtual3/hunter/2019-08-23_04-44-08/tempest_scenario/test_raw_list.txt
https://artifacts.opnfv.org/logs/functest/ericsson-virtual3/hunter/2019-08-23_04-44-08/tempest_scenario/tempest.conf
https://artifacts.opnfv.org/logs/functest/ericsson-virtual3/hunter/2019-08-23_04-44-08/return_value
https://artifacts.opnfv.org/logs/functest/ericsson-virtual3/hunter/2019-08-23_04-44-08/shaker
https://artifacts.opnfv.org/logs/functest/ericsson-virtual3/hunter/2019-08-23_04-44-08/barbican
https://artifacts.opnfv.org/logs/functest/ericsson-virtual3/hunter/2019-08-23_04-44-08/barbican/rally.conf
https://artifacts.opnfv.org/logs/functest/ericsson-virtual3/hunter/2019-08-23_04-44-08/barbican/tempest.debug.log
https://artifacts.opnfv.org/logs/functest/ericsson-virtual3/hunter/2019-08-23_04-44-08/barbican/rally.log
https://artifacts.opnfv.org/logs/functest/ericsson-virtual3/hunter/2019-08-23_04-44-08/barbican/tempest-report.html
https://artifacts.opnfv.org/logs/functest/ericsson-virtual3/hunter/2019-08-23_04-44-08/barbican/tempest-report.xml
https://artifacts.opnfv.org/logs/functest/ericsson-virtual3/hunter/2019-08-23_04-44-08/barbican/test_list.txt
https://artifacts.opnfv.org/logs/functest/ericsson-virtual3/hunter/2019-08-23_04-44-08/barbican/tempest.log
https://artifacts.opnfv.org/logs/functest/ericsson-virtual3/hunter/2019-08-23_04-44-08/barbican/test_raw_list.txt
https://artifacts.opnfv.org/logs/functest/ericsson-virtual3/hunter/2019-08-23_04-44-08/barbican/tempest.conf
https://artifacts.opnfv.org/logs/functest/ericsson-virtual3/hunter/2019-08-23_04-44-08/odl
https://artifacts.opnfv.org/logs/functest/ericsson-virtual3/hunter/2019-08-23_04-44-08/odl/log.html
https://artifacts.opnfv.org/logs/functest/ericsson-virtual3/hunter/2019-08-23_04-44-08/odl/output.xml
https://artifacts.opnfv.org/logs/functest/ericsson-virtual3/hunter/2019-08-23_04-44-08/odl/xunit.xml
https://artifacts.opnfv.org/logs/functest/ericsson-virtual3/hunter/2019-08-23_04-44-08/odl/report.html
https://artifacts.opnfv.org/logs/functest/ericsson-virtual3/hunter/2019-08-23_04-44-08/rally_sanity
https://artifacts.opnfv.org/logs/functest/ericsson-virtual3/hunter/2019-08-23_04-44-08/rally_sanity/nova.json
https://artifacts.opnfv.org/logs/functest/ericsson-virtual3/hunter/2019-08-23_04-44-08/rally_sanity/rally.log
https://artifacts.opnfv.org/logs/functest/ericsson-virtual3/hunter/2019-08-23_04-44-08/rally_sanity/keystone.json
https://artifacts.opnfv.org/logs/functest/ericsson-virtual3/hunter/2019-08-23_04-44-08/rally_sanity/authenticate.json
https://artifacts.opnfv.org/logs/functest/ericsson-virtual3/hunter/2019-08-23_04-44-08/rally_sanity/gnocchi.json
https://artifacts.opnfv.org/logs/functest/ericsson-virtual3/hunter/2019-08-23_04-44-08/rally_sanity/heat.json
https://artifacts.opnfv.org/logs/functest/ericsson-virtual3/hunter/2019-08-23_04-44-08/rally_sanity/rally_sanity.xml
https://artifacts.opnfv.org/logs/functest/ericsson-virtual3/hunter/2019-08-23_04-44-08/rally_sanity/quotas.json
https://artifacts.opnfv.org/logs/functest/ericsson-virtual3/hunter/2019-08-23_04-44-08/rally_sanity/neutron.json
https://artifacts.opnfv.org/logs/functest/ericsson-virtual3/hunter/2019-08-23_04-44-08/rally_sanity/rally_sanity.html
https://artifacts.opnfv.org/logs/functest/ericsson-virtual3/hunter/2019-08-23_04-44-08/rally_sanity/cinder.json
https://artifacts.opnfv.org/logs/functest/ericsson-virtual3/hunter/2019-08-23_04-44-08/rally_sanity/glance.json
https://artifacts.opnfv.org/logs/functest/ericsson-virtual3/hunter/2019-08-23_04-44-08/refstack_defcore
https://artifacts.opnfv.org/logs/functest/ericsson-virtual3/hunter/2019-08-23_04-44-08/refstack_defcore/rally.conf
https://artifacts.opnfv.org/logs/functest/ericsson-virtual3/hunter/2019-08-23_04-44-08/refstack_defcore/tempest.debug.log
https://artifacts.opnfv.org/logs/functest/ericsson-virtual3/hunter/2019-08-23_04-44-08/refstack_defcore/rally.log
https://artifacts.opnfv.org/logs/functest/ericsson-virtual3/hunter/2019-08-23_04-44-08/refstack_defcore/tempest-report.html
https://artifacts.opnfv.org/logs/functest/ericsson-virtual3/hunter/2019-08-23_04-44-08/refstack_defcore/tempest-report.xml
https://artifacts.opnfv.org/logs/functest/ericsson-virtual3/hunter/2019-08-23_04-44-08/refstack_defcore/test_list.txt
https://artifacts.opnfv.org/logs/functest/ericsson-virtual3/hunter/2019-08-23_04-44-08/refstack_defcore/tempest.log
https://artifacts.opnfv.org/logs/functest/ericsson-virtual3/hunter/2019-08-23_04-44-08/refstack_defcore/test_raw_list.txt
https://artifacts.opnfv.org/logs/functest/ericsson-virtual3/hunter/2019-08-23_04-44-08/refstack_defcore/tempest.conf
[functest-fuel-virtual-daily-hunter] $ /bin/bash /tmp/jenkins5505156537652352079.sh
Build step 'Execute shell' marked build as failure
New run name is '639 Suite: daily Scenario: os-odl-nofeature-noha'
Email was triggered for: Failure - Any
Sending email for trigger: Failure - Any
Request made to compress build log
Sending email to: tbramwell@linuxfoundation.org agardner@linuxfoundation.org rgrigar@linuxfoundation.org
Finished: FAILURE