FailedConsole Output

Started by upstream project "fuel-os-odl-ovs-noha-virtual-daily-hunter" build number 118
originally caused by:
 Started by timer
Running as SYSTEM
[EnvInject] - Loading node environment variables.
Building remotely on ericsson-virtual2 (fuel-virtual ci-resource opnfv-sysinfo) in workspace /home/jenkins/opnfv/slave_root/workspace/functest-fuel-virtual-daily-hunter
using credential d42411ac011ad6f3dd2e1fa34eaa5d87f910eb2e
Wiping out workspace first.
Cloning the remote Git repository
Cloning repository https://gerrit.opnfv.org/gerrit/functest
 > git init /home/jenkins/opnfv/slave_root/workspace/functest-fuel-virtual-daily-hunter # timeout=10
Fetching upstream changes from https://gerrit.opnfv.org/gerrit/functest
 > git --version # timeout=10
using GIT_SSH to set credentials Jenkins Master SSH
 > git fetch --tags --progress https://gerrit.opnfv.org/gerrit/functest +refs/heads/*:refs/remotes/origin/* # timeout=15
 > git config remote.origin.url https://gerrit.opnfv.org/gerrit/functest # timeout=10
 > git config --add remote.origin.fetch +refs/heads/*:refs/remotes/origin/* # timeout=10
 > git config remote.origin.url https://gerrit.opnfv.org/gerrit/functest # timeout=10
Fetching upstream changes from https://gerrit.opnfv.org/gerrit/functest
using GIT_SSH to set credentials Jenkins Master SSH
 > git fetch --tags --progress https://gerrit.opnfv.org/gerrit/functest +refs/heads/*:refs/remotes/origin/* # timeout=15
 > git rev-parse refs/remotes/origin/stable/hunter^{commit} # timeout=10
 > git rev-parse refs/remotes/origin/origin/stable/hunter^{commit} # timeout=10
Checking out Revision f8800b23d406c8acad7acc62035d5425d7358338 (refs/remotes/origin/stable/hunter)
 > git config core.sparsecheckout # timeout=10
 > git checkout -f f8800b23d406c8acad7acc62035d5425d7358338 # timeout=15
Commit message: "Clean orphan security groups"
 > git rev-list --no-walk f8800b23d406c8acad7acc62035d5425d7358338 # timeout=10
Run condition [Regular expression match] enabling prebuild for step [Execute shell]
Run condition [Regular expression match] enabling prebuild for step [Execute shell]
No emails were triggered.
New run name is '635 Suite: daily Scenario: os-odl-ovs-noha'
[description-setter] Description set: Built on ericsson-virtual2
[functest-fuel-virtual-daily-hunter] $ /bin/bash /tmp/jenkins2149555511138162883.sh
Cleaning up docker containers/images...
Regular expression run condition: Expression=[os-.*], Label=[os-odl-ovs-noha]
Run condition [Regular expression match] enabling perform for step [Execute shell]
[functest-fuel-virtual-daily-hunter] $ /usr/bin/env bash /tmp/jenkins8396936670087046853.sh
Map mcp ssh_key
<13>Aug 22 06:52:18 fetch_os_creds.info: Fetching rc file...
<13>Aug 22 06:52:18 fetch_os_creds.info: Verifying connectivity to 10.20.0.2...
<13>Aug 22 06:52:18 fetch_os_creds.info: 10.20.0.2 is reachable!
<13>Aug 22 06:52:19 fetch_os_creds.info: ... from controller 172.16.10.36 ...
Warning: Permanently added '172.16.10.36' (ECDSA) to the list of known hosts.
-------- Credentials: --------

export OS_IDENTITY_API_VERSION=3
export OS_PROJECT_DOMAIN_NAME=Default
export OS_USER_DOMAIN_NAME=Default
export OS_PROJECT_NAME=admin
export OS_TENANT_NAME=admin
export OS_USERNAME=admin
export OS_PASSWORD=opnfv_secret
export OS_REGION_NAME=RegionOne
export OS_INTERFACE=internal
export OS_ENDPOINT_TYPE="internal"
export OS_CACERT="/etc/ssl/certs/ca-certificates.crt"
export SDN_CONTROLLER_USER=admin
export SDN_CONTROLLER_RESTCONFPORT=8282
export SDN_CONTROLLER_PASSWORD=admin
export SDN_CONTROLLER_WEBPORT=8282
export SDN_CONTROLLER_IP=10.16.0.107
export VOLUME_DEVICE_NAME=sdc
export OS_AUTH_URL=http://172.16.10.36:35357/v3
Functest: Start Docker and prepare environment
Functest: Download images that will be used by test cases
+ wget_opts='-N --tries=1 --connect-timeout=30'
+ '[' -t 1 ']'
+ wget_opts='-N --tries=1 --connect-timeout=30 --progress=dot:giga'
+ cat
+ wget -N --tries=1 --connect-timeout=30 --progress=dot:giga -i - -P /home/jenkins/opnfv/functest/images
--2019-08-22 06:52:19--  http://download.cirros-cloud.net/0.4.0/cirros-0.4.0-x86_64-disk.img
Resolving download.cirros-cloud.net (download.cirros-cloud.net)... 64.90.42.85, 2607:f298:6:a036::bd6:a72a
Connecting to download.cirros-cloud.net (download.cirros-cloud.net)|64.90.42.85|:80... connected.
HTTP request sent, awaiting response... 304 Not Modified
File ‘/home/jenkins/opnfv/functest/images/cirros-0.4.0-x86_64-disk.img’ not modified on server. Omitting download.

--2019-08-22 06:52:20--  https://cloud-images.ubuntu.com/releases/14.04/release/ubuntu-14.04-server-cloudimg-amd64-disk1.img
Resolving cloud-images.ubuntu.com (cloud-images.ubuntu.com)... 91.189.88.89, 2001:67c:1560:8001::8001
Connecting to cloud-images.ubuntu.com (cloud-images.ubuntu.com)|91.189.88.89|:443... connected.
HTTP request sent, awaiting response... 302 Found
Location: https://cloud-images.ubuntu.com/releases/trusty/release/ubuntu-14.04-server-cloudimg-amd64-disk1.img [following]
--2019-08-22 06:52:20--  https://cloud-images.ubuntu.com/releases/trusty/release/ubuntu-14.04-server-cloudimg-amd64-disk1.img
Reusing existing connection to cloud-images.ubuntu.com:443.
HTTP request sent, awaiting response... 304 Not Modified
File ‘/home/jenkins/opnfv/functest/images/ubuntu-14.04-server-cloudimg-amd64-disk1.img’ not modified on server. Omitting download.

--2019-08-22 06:52:20--  https://cloud-images.ubuntu.com/releases/16.04/release/ubuntu-16.04-server-cloudimg-amd64-disk1.img
Reusing existing connection to cloud-images.ubuntu.com:443.
HTTP request sent, awaiting response... 302 Found
Location: https://cloud-images.ubuntu.com/releases/xenial/release/ubuntu-16.04-server-cloudimg-amd64-disk1.img [following]
--2019-08-22 06:52:20--  https://cloud-images.ubuntu.com/releases/xenial/release/ubuntu-16.04-server-cloudimg-amd64-disk1.img
Reusing existing connection to cloud-images.ubuntu.com:443.
HTTP request sent, awaiting response... 304 Not Modified
File ‘/home/jenkins/opnfv/functest/images/ubuntu-16.04-server-cloudimg-amd64-disk1.img’ not modified on server. Omitting download.

--2019-08-22 06:52:20--  http://download.cirros-cloud.net/0.4.0/cirros-0.4.0-aarch64-disk.img
Connecting to download.cirros-cloud.net (download.cirros-cloud.net)|64.90.42.85|:80... connected.
HTTP request sent, awaiting response... 304 Not Modified
File ‘/home/jenkins/opnfv/functest/images/cirros-0.4.0-aarch64-disk.img’ not modified on server. Omitting download.

--2019-08-22 06:52:20--  https://cloud-images.ubuntu.com/releases/14.04/release/ubuntu-14.04-server-cloudimg-arm64-uefi1.img
Connecting to cloud-images.ubuntu.com (cloud-images.ubuntu.com)|91.189.88.89|:443... connected.
HTTP request sent, awaiting response... 302 Found
Location: https://cloud-images.ubuntu.com/releases/trusty/release/ubuntu-14.04-server-cloudimg-arm64-uefi1.img [following]
--2019-08-22 06:52:20--  https://cloud-images.ubuntu.com/releases/trusty/release/ubuntu-14.04-server-cloudimg-arm64-uefi1.img
Reusing existing connection to cloud-images.ubuntu.com:443.
HTTP request sent, awaiting response... 304 Not Modified
File ‘/home/jenkins/opnfv/functest/images/ubuntu-14.04-server-cloudimg-arm64-uefi1.img’ not modified on server. Omitting download.

--2019-08-22 06:52:20--  http://repository.cloudifysource.org/cloudify/19.01.24/community-release/cloudify-docker-manager-community-19.01.24.tar
Resolving repository.cloudifysource.org (repository.cloudifysource.org)... 54.192.98.62, 54.192.98.97, 54.192.98.108, ...
Connecting to repository.cloudifysource.org (repository.cloudifysource.org)|54.192.98.62|:80... connected.
HTTP request sent, awaiting response... 304 Not Modified
File ‘/home/jenkins/opnfv/functest/images/cloudify-docker-manager-community-19.01.24.tar’ not modified on server. Omitting download.

--2019-08-22 06:52:21--  http://testresults.opnfv.org/functest/vyos-1.1.8-amd64.qcow2
Resolving testresults.opnfv.org (testresults.opnfv.org)... 104.154.71.112
Connecting to testresults.opnfv.org (testresults.opnfv.org)|104.154.71.112|:80... connected.
HTTP request sent, awaiting response... 304 Not Modified
File ‘/home/jenkins/opnfv/functest/images/vyos-1.1.8-amd64.qcow2’ not modified on server. Omitting download.

--2019-08-22 06:52:21--  http://testresults.opnfv.org/functest/shaker-image.qcow2
Reusing existing connection to testresults.opnfv.org:80.
HTTP request sent, awaiting response... 304 Not Modified
File ‘/home/jenkins/opnfv/functest/images/shaker-image.qcow2’ not modified on server. Omitting download.

--2019-08-22 06:52:21--  http://testresults.opnfv.org/functest/shaker-image-arm64.qcow2
Reusing existing connection to testresults.opnfv.org:80.
HTTP request sent, awaiting response... 304 Not Modified
File ‘/home/jenkins/opnfv/functest/images/shaker-image-arm64.qcow2’ not modified on server. Omitting download.

Warning: Permanently added '10.20.0.2' (ECDSA) to the list of known hosts.
tempest_conf.yaml:
---
compute-feature-enabled:
    shelve: false
    vnc_console: false
    spice_console: true
identity-feature-enabled:
    api_v2: false
    api_v2_admin: false
image-feature-enabled:
    api_v2: true
    api_v1: false
volume:
    storage_protocol: iSCSI
volume-feature-enabled:
    backup: false
compute:
    max_microversion: 2.65
Functest: Pulling Functest Docker image opnfv/functest-healthcheck:hunter ...
Running Functest tier 'healthcheck'. CMD: docker run --rm  -e INSTALLER_TYPE=fuel -e INSTALLER_IP=10.20.0.2     -e NODE_NAME=ericsson-virtual2 -e DEPLOY_SCENARIO=os-odl-ovs-noha     -e BUILD_TAG=jenkins-functest-fuel-virtual-daily-hunter-635 -e DEPLOY_TYPE=virt -e CI_LOOP=daily     -e TEST_DB_URL=http://testresults.opnfv.org/test/api/v1/results -e ENERGY_RECORDER_API_URL=http://energy.opnfv.fr/resources     -e DEBUG=true -e POD_ARCH=x86_64 -e BLOCK_MIGRATION=false -e SDN_CONTROLLER_RESTCONFPORT=8080 -e IMAGE_PROPERTIES=hw_disk_bus:scsi,hw_scsi_model:virtio-scsi,hw_mem_page_size:large -e FLAVOR_EXTRA_SPECS=hw:mem_page_size:large -v /home/jenkins/opnfv/functest/images:/home/opnfv/functest/images -v /home/jenkins/opnfv/functest/results/hunter:/home/opnfv/functest/results -v /var/lib/opnfv/mcp.rsa:/root/.ssh/id_rsa       -v /home/jenkins/opnfv-openrc.sh:/home/opnfv/functest/conf/env_file      -v /tmp/tmp.paOL1FzvId:/usr/lib/python2.7/site-packages/functest/opnfv_tests/openstack/tempest/custom_tests/tempest_conf.yaml  opnfv/functest-healthcheck:hunter /bin/bash -c 'run_tests -r -t all'
2019-08-22 04:52:27,354 - xtesting.ci.run_tests - INFO - Deployment description:

+--------------------------------------+----------------------------------------------------------+
|               ENV VAR                |                          VALUE                           |
+--------------------------------------+----------------------------------------------------------+
|              BUILD_TAG               |      jenkins-functest-fuel-virtual-daily-hunter-635      |
|             TEST_DB_URL              |     http://testresults.opnfv.org/test/api/v1/results     |
|     ENERGY_RECORDER_API_PASSWORD     |                                                          |
|               CI_LOOP                |                          daily                           |
|                DEBUG                 |                           true                           |
|            INSTALLER_TYPE            |                           fuel                           |
|       ENERGY_RECORDER_API_URL        |             http://energy.opnfv.fr/resources             |
|           DEPLOY_SCENARIO            |                     os-odl-ovs-noha                      |
|       ENERGY_RECORDER_API_USER       |                                                          |
|              NODE_NAME               |                    ericsson-virtual2                     |
+--------------------------------------+----------------------------------------------------------+

2019-08-22 04:52:27,359 - xtesting.ci.run_tests - INFO - Sourcing env file /var/lib/xtesting/conf/env_file


export OS_IDENTITY_API_VERSION=3
export OS_PROJECT_DOMAIN_NAME=Default
export OS_USER_DOMAIN_NAME=Default
export OS_PROJECT_NAME=admin
export OS_TENANT_NAME=admin
export OS_USERNAME=admin
export OS_PASSWORD=opnfv_secret
export OS_REGION_NAME=RegionOne
export OS_INTERFACE=internal
export OS_ENDPOINT_TYPE="internal"
export OS_CACERT="/etc/ssl/certs/ca-certificates.crt"
export SDN_CONTROLLER_USER=admin
export SDN_CONTROLLER_RESTCONFPORT=8282
export SDN_CONTROLLER_PASSWORD=admin
export SDN_CONTROLLER_WEBPORT=8282
export SDN_CONTROLLER_IP=10.16.0.107
export VOLUME_DEVICE_NAME=sdc
export OS_AUTH_URL=http://172.16.10.36:35357/v3

2019-08-22 04:52:27,361 - xtesting.ci.run_tests - INFO - TESTS TO BE EXECUTED:

+---------------------+---------------+-------------------------------------------------+------------------------------------------+
|        TIERS        |     ORDER     |                   DESCRIPTION                   |                TESTCASES                 |
+---------------------+---------------+-------------------------------------------------+------------------------------------------+
|     healthcheck     |       0       |     First tier to be executed to verify the     |     connection_check tenantnetwork1      |
|                     |               |           basic operations in the VIM.          |     tenantnetwork2 vmready1 vmready2     |
|                     |               |                                                 |      singlevm1 singlevm2 vping_ssh       |
|                     |               |                                                 |      vping_userdata cinder_test odl      |
|                     |               |                                                 |              tempest_smoke               |
+---------------------+---------------+-------------------------------------------------+------------------------------------------+

2019-08-22 04:52:27,427 - xtesting.ci.run_tests - INFO - Loading test case 'connection_check'...
2019-08-22 04:52:28,069 - xtesting.ci.run_tests - INFO - Running test case 'connection_check'...
2019-08-22 04:52:31,852 - xtesting.core.testcase - INFO - The results were successfully pushed to DB
2019-08-22 04:52:31,852 - xtesting.ci.run_tests - INFO - Test result:

+--------------------------+------------------+------------------+----------------+
|        TEST CASE         |     PROJECT      |     DURATION     |     RESULT     |
+--------------------------+------------------+------------------+----------------+
|     connection_check     |     functest     |      00:04       |      PASS      |
+--------------------------+------------------+------------------+----------------+

2019-08-22 04:52:31,886 - xtesting.ci.run_tests - INFO - Loading test case 'tenantnetwork1'...
2019-08-22 04:52:32,844 - xtesting.ci.run_tests - INFO - Running test case 'tenantnetwork1'...
2019-08-22 04:52:37,944 - xtesting.core.testcase - INFO - The results were successfully pushed to DB
2019-08-22 04:52:37,945 - xtesting.ci.run_tests - INFO - Test result:

+------------------------+------------------+------------------+----------------+
|       TEST CASE        |     PROJECT      |     DURATION     |     RESULT     |
+------------------------+------------------+------------------+----------------+
|     tenantnetwork1     |     functest     |      00:05       |      PASS      |
+------------------------+------------------+------------------+----------------+

2019-08-22 04:52:46,289 - xtesting.ci.run_tests - INFO - Loading test case 'tenantnetwork2'...
2019-08-22 04:52:48,439 - xtesting.ci.run_tests - INFO - Running test case 'tenantnetwork2'...
2019-08-22 04:52:56,537 - xtesting.core.testcase - INFO - The results were successfully pushed to DB
2019-08-22 04:52:56,537 - xtesting.ci.run_tests - INFO - Test result:

+------------------------+------------------+------------------+----------------+
|       TEST CASE        |     PROJECT      |     DURATION     |     RESULT     |
+------------------------+------------------+------------------+----------------+
|     tenantnetwork2     |     functest     |      00:08       |      PASS      |
+------------------------+------------------+------------------+----------------+

2019-08-22 04:53:06,266 - xtesting.ci.run_tests - INFO - Loading test case 'vmready1'...
2019-08-22 04:53:07,166 - xtesting.ci.run_tests - INFO - Running test case 'vmready1'...
2019-08-22 04:53:14,922 - xtesting.core.testcase - INFO - The results were successfully pushed to DB
2019-08-22 04:53:14,923 - xtesting.ci.run_tests - INFO - Test result:

+-------------------+------------------+------------------+----------------+
|     TEST CASE     |     PROJECT      |     DURATION     |     RESULT     |
+-------------------+------------------+------------------+----------------+
|      vmready1     |     functest     |      00:07       |      PASS      |
+-------------------+------------------+------------------+----------------+

2019-08-22 04:53:23,361 - xtesting.ci.run_tests - INFO - Loading test case 'vmready2'...
2019-08-22 04:53:25,428 - xtesting.ci.run_tests - INFO - Running test case 'vmready2'...
2019-08-22 04:53:32,778 - xtesting.core.testcase - INFO - The results were successfully pushed to DB
2019-08-22 04:53:32,778 - xtesting.ci.run_tests - INFO - Test result:

+-------------------+------------------+------------------+----------------+
|     TEST CASE     |     PROJECT      |     DURATION     |     RESULT     |
+-------------------+------------------+------------------+----------------+
|      vmready2     |     functest     |      00:07       |      PASS      |
+-------------------+------------------+------------------+----------------+

2019-08-22 04:53:42,819 - xtesting.ci.run_tests - INFO - Loading test case 'singlevm1'...
2019-08-22 04:53:43,643 - xtesting.ci.run_tests - INFO - Running test case 'singlevm1'...
2019-08-22 04:54:24,800 - xtesting.core.testcase - INFO - The results were successfully pushed to DB
2019-08-22 04:54:24,800 - xtesting.ci.run_tests - INFO - Test result:

+-------------------+------------------+------------------+----------------+
|     TEST CASE     |     PROJECT      |     DURATION     |     RESULT     |
+-------------------+------------------+------------------+----------------+
|     singlevm1     |     functest     |      00:41       |      PASS      |
+-------------------+------------------+------------------+----------------+

2019-08-22 04:54:38,577 - xtesting.ci.run_tests - INFO - Loading test case 'singlevm2'...
2019-08-22 04:54:41,074 - xtesting.ci.run_tests - INFO - Running test case 'singlevm2'...
2019-08-22 04:55:16,040 - xtesting.core.testcase - INFO - The results were successfully pushed to DB
2019-08-22 04:55:16,040 - xtesting.ci.run_tests - INFO - Test result:

+-------------------+------------------+------------------+----------------+
|     TEST CASE     |     PROJECT      |     DURATION     |     RESULT     |
+-------------------+------------------+------------------+----------------+
|     singlevm2     |     functest     |      00:35       |      PASS      |
+-------------------+------------------+------------------+----------------+

2019-08-22 04:55:31,095 - xtesting.ci.run_tests - INFO - Loading test case 'vping_ssh'...
2019-08-22 04:55:33,097 - xtesting.ci.run_tests - INFO - Running test case 'vping_ssh'...
2019-08-22 04:56:19,222 - xtesting.core.testcase - INFO - The results were successfully pushed to DB
2019-08-22 04:56:19,223 - xtesting.ci.run_tests - INFO - Test result:

+-------------------+------------------+------------------+----------------+
|     TEST CASE     |     PROJECT      |     DURATION     |     RESULT     |
+-------------------+------------------+------------------+----------------+
|     vping_ssh     |     functest     |      00:46       |      PASS      |
+-------------------+------------------+------------------+----------------+

2019-08-22 04:56:36,498 - xtesting.ci.run_tests - INFO - Loading test case 'vping_userdata'...
2019-08-22 04:56:38,495 - xtesting.ci.run_tests - INFO - Running test case 'vping_userdata'...
2019-08-22 04:57:15,919 - xtesting.core.testcase - INFO - The results were successfully pushed to DB
2019-08-22 04:57:15,920 - xtesting.ci.run_tests - INFO - Test result:

+------------------------+------------------+------------------+----------------+
|       TEST CASE        |     PROJECT      |     DURATION     |     RESULT     |
+------------------------+------------------+------------------+----------------+
|     vping_userdata     |     functest     |      00:37       |      PASS      |
+------------------------+------------------+------------------+----------------+

2019-08-22 04:57:31,695 - xtesting.ci.run_tests - INFO - Loading test case 'cinder_test'...
2019-08-22 04:57:33,549 - xtesting.ci.run_tests - INFO - Running test case 'cinder_test'...
2019-08-22 04:59:06,360 - xtesting.core.testcase - INFO - The results were successfully pushed to DB
2019-08-22 04:59:06,361 - xtesting.ci.run_tests - INFO - Test result:

+---------------------+------------------+------------------+----------------+
|      TEST CASE      |     PROJECT      |     DURATION     |     RESULT     |
+---------------------+------------------+------------------+----------------+
|     cinder_test     |     functest     |      01:32       |      PASS      |
+---------------------+------------------+------------------+----------------+

2019-08-22 04:59:27,315 - xtesting.ci.run_tests - INFO - Loading test case 'odl'...
2019-08-22 04:59:27,538 - xtesting.ci.run_tests - INFO - Running test case 'odl'...
[ WARN ] Deprecation Warning: Use Post Request in the future
2019-08-22 04:59:46,919 - xtesting.core.robotframework - INFO - 
==============================================================================
Basic & Neutron                                                               
==============================================================================
Basic & Neutron.Basic                                                         
==============================================================================
Basic & Neutron.Basic.Restconf Modules :: Test suite to verify Restconf is OK.
==============================================================================
Get Controller Modules :: Get the restconf modules, check 200 stat... | PASS |
------------------------------------------------------------------------------
Basic & Neutron.Basic.Restconf Modules :: Test suite to verify Res... | PASS |
1 critical test, 1 passed, 0 failed
1 test total, 1 passed, 0 failed
==============================================================================
Basic & Neutron.Basic                                                 | PASS |
1 critical test, 1 passed, 0 failed
1 test total, 1 passed, 0 failed
==============================================================================
Basic & Neutron.Neutron :: Test suite for Neutron Plugin                      
==============================================================================
Basic & Neutron.Neutron.Reachability                                          
==============================================================================
Get the complete list of networks :: Get the complete list of netw... | PASS |
------------------------------------------------------------------------------
Get the complete list of subnets :: Get the complete list of subnets  | PASS |
------------------------------------------------------------------------------
Get the complete list of ports :: Get the complete list of ports      | PASS |
------------------------------------------------------------------------------
Basic & Neutron.Neutron.Reachability                                  | PASS |
3 critical tests, 3 passed, 0 failed
3 tests total, 3 passed, 0 failed
==============================================================================
Basic & Neutron.Neutron.Networks :: Checking Network created in OpenStack a...
==============================================================================
Check OpenStack Networks :: Checking OpenStack Neutron for known n... | PASS |
------------------------------------------------------------------------------
Check OpenDaylight Networks :: Checking OpenDaylight Neutron API f... | PASS |
------------------------------------------------------------------------------
Create Network :: Create new network in OpenStack                     | PASS |
------------------------------------------------------------------------------
Check Network :: Check network created in OpenDaylight                | PASS |
------------------------------------------------------------------------------
Basic & Neutron.Neutron.Networks :: Checking Network created in Op... | PASS |
4 critical tests, 4 passed, 0 failed
4 tests total, 4 passed, 0 failed
==============================================================================
Basic & Neutron.Neutron.Subnets :: Checking Subnets created in OpenStack ar...
==============================================================================
Check OpenStack Subnets :: Checking OpenStack Neutron for known su... | PASS |
------------------------------------------------------------------------------
Check OpenDaylight subnets :: Checking OpenDaylight Neutron API fo... | PASS |
------------------------------------------------------------------------------
Create New subnet :: Create new subnet in OpenStack                   | PASS |
------------------------------------------------------------------------------
Check New subnet :: Check new subnet created in OpenDaylight          | PASS |
------------------------------------------------------------------------------
Basic & Neutron.Neutron.Subnets :: Checking Subnets created in Ope... | PASS |
4 critical tests, 4 passed, 0 failed
4 tests total, 4 passed, 0 failed
==============================================================================
Basic & Neutron.Neutron.Ports :: Checking Port created in OpenStack are pus...
==============================================================================
Check OpenStack ports :: Checking OpenStack Neutron for known ports   | PASS |
------------------------------------------------------------------------------
Check OpenDaylight ports :: Checking OpenDaylight Neutron API for ... | PASS |
------------------------------------------------------------------------------
Create New Port :: Create new port in OpenStack                       | PASS |
------------------------------------------------------------------------------
Check New Port :: Check new port created in OpenDaylight              | PASS |
------------------------------------------------------------------------------
Basic & Neutron.Neutron.Ports :: Checking Port created in OpenStac... | PASS |
4 critical tests, 4 passed, 0 failed
4 tests total, 4 passed, 0 failed
==============================================================================
Basic & Neutron.Neutron.Delete Ports :: Checking Port deleted in OpenStack ...
==============================================================================
Delete New Port :: Delete previously created port in OpenStack        | PASS |
------------------------------------------------------------------------------
Check Port Deleted :: Check port deleted in OpenDaylight              | PASS |
------------------------------------------------------------------------------
Basic & Neutron.Neutron.Delete Ports :: Checking Port deleted in O... | PASS |
2 critical tests, 2 passed, 0 failed
2 tests total, 2 passed, 0 failed
==============================================================================
Basic & Neutron.Neutron.Delete Subnets :: Checking Subnets deleted in OpenS...
==============================================================================
Delete New subnet :: Delete previously created subnet in OpenStack    | PASS |
------------------------------------------------------------------------------
Check New subnet deleted :: Check subnet deleted in OpenDaylight      | PASS |
------------------------------------------------------------------------------
Basic & Neutron.Neutron.Delete Subnets :: Checking Subnets deleted... | PASS |
2 critical tests, 2 passed, 0 failed
2 tests total, 2 passed, 0 failed
==============================================================================
Basic & Neutron.Neutron.Delete Networks :: Checking Network deleted in Open...
==============================================================================
Delete Network :: Delete network in OpenStack                         | PASS |
------------------------------------------------------------------------------
Check Network deleted :: Check network deleted in OpenDaylight        | PASS |
------------------------------------------------------------------------------
Basic & Neutron.Neutron.Delete Networks :: Checking Network delete... | PASS |
2 critical tests, 2 passed, 0 failed
2 tests total, 2 passed, 0 failed
==============================================================================
Basic & Neutron.Neutron :: Test suite for Neutron Plugin              | PASS |
21 critical tests, 21 passed, 0 failed
21 tests total, 21 passed, 0 failed
==============================================================================
Basic & Neutron                                                       | PASS |
22 critical tests, 22 passed, 0 failed
22 tests total, 22 passed, 0 failed
==============================================================================
Output:  /home/opnfv/functest/results/odl/output.xml

2019-08-22 04:59:46,943 - xtesting.core.robotframework - INFO - Results were successfully parsed
2019-08-22 04:59:47,063 - xtesting.core.robotframework - INFO - Results were successfully generated
2019-08-22 04:59:47,341 - xtesting.core.testcase - INFO - The results were successfully pushed to DB
2019-08-22 04:59:47,341 - xtesting.ci.run_tests - INFO - Test result:

+-------------------+------------------+------------------+----------------+
|     TEST CASE     |     PROJECT      |     DURATION     |     RESULT     |
+-------------------+------------------+------------------+----------------+
|        odl        |     functest     |      00:19       |      PASS      |
+-------------------+------------------+------------------+----------------+

2019-08-22 04:59:47,371 - xtesting.ci.run_tests - INFO - Loading test case 'tempest_smoke'...
2019-08-22 04:59:50,627 - xtesting.ci.run_tests - INFO - Running test case 'tempest_smoke'...
2019-08-22 05:04:17,630 - xtesting.core.testcase - INFO - The results were successfully pushed to DB
2019-08-22 05:04:17,631 - xtesting.ci.run_tests - INFO - Test result:

+-----------------------+------------------+------------------+----------------+
|       TEST CASE       |     PROJECT      |     DURATION     |     RESULT     |
+-----------------------+------------------+------------------+----------------+
|     tempest_smoke     |     functest     |      04:27       |      PASS      |
+-----------------------+------------------+------------------+----------------+

2019-08-22 05:04:28,382 - xtesting.ci.run_tests - INFO - Xtesting report:

+--------------------------+------------------+---------------------+------------------+----------------+
|        TEST CASE         |     PROJECT      |         TIER        |     DURATION     |     RESULT     |
+--------------------------+------------------+---------------------+------------------+----------------+
|     connection_check     |     functest     |     healthcheck     |      00:04       |      PASS      |
|      tenantnetwork1      |     functest     |     healthcheck     |      00:05       |      PASS      |
|      tenantnetwork2      |     functest     |     healthcheck     |      00:08       |      PASS      |
|         vmready1         |     functest     |     healthcheck     |      00:07       |      PASS      |
|         vmready2         |     functest     |     healthcheck     |      00:07       |      PASS      |
|        singlevm1         |     functest     |     healthcheck     |      00:41       |      PASS      |
|        singlevm2         |     functest     |     healthcheck     |      00:35       |      PASS      |
|        vping_ssh         |     functest     |     healthcheck     |      00:46       |      PASS      |
|      vping_userdata      |     functest     |     healthcheck     |      00:37       |      PASS      |
|       cinder_test        |     functest     |     healthcheck     |      01:32       |      PASS      |
|           odl            |     functest     |     healthcheck     |      00:19       |      PASS      |
|      tempest_smoke       |     functest     |     healthcheck     |      04:27       |      PASS      |
+--------------------------+------------------+---------------------+------------------+----------------+

2019-08-22 05:04:28,396 - xtesting.ci.run_tests - INFO - Execution exit value: Result.EX_OK
Functest: Pulling Functest Docker image opnfv/functest-smoke:hunter ...
Running Functest tier 'smoke'. CMD: docker run --rm  -e INSTALLER_TYPE=fuel -e INSTALLER_IP=10.20.0.2     -e NODE_NAME=ericsson-virtual2 -e DEPLOY_SCENARIO=os-odl-ovs-noha     -e BUILD_TAG=jenkins-functest-fuel-virtual-daily-hunter-635 -e DEPLOY_TYPE=virt -e CI_LOOP=daily     -e TEST_DB_URL=http://testresults.opnfv.org/test/api/v1/results -e ENERGY_RECORDER_API_URL=http://energy.opnfv.fr/resources     -e DEBUG=true -e POD_ARCH=x86_64 -e BLOCK_MIGRATION=false -e SDN_CONTROLLER_RESTCONFPORT=8080 -e IMAGE_PROPERTIES=hw_disk_bus:scsi,hw_scsi_model:virtio-scsi,hw_mem_page_size:large -e FLAVOR_EXTRA_SPECS=hw:mem_page_size:large -v /home/jenkins/opnfv/functest/images:/home/opnfv/functest/images -v /home/jenkins/opnfv/functest/results/hunter:/home/opnfv/functest/results -v /var/lib/opnfv/mcp.rsa:/root/.ssh/id_rsa       -v /home/jenkins/opnfv-openrc.sh:/home/opnfv/functest/conf/env_file      -v /tmp/tmp.paOL1FzvId:/usr/lib/python2.7/site-packages/functest/opnfv_tests/openstack/tempest/custom_tests/tempest_conf.yaml  opnfv/functest-smoke:hunter /bin/bash -c 'run_tests -r -t all'
2019-08-22 05:04:33,646 - xtesting.ci.run_tests - INFO - Deployment description:

+--------------------------------------+----------------------------------------------------------+
|               ENV VAR                |                          VALUE                           |
+--------------------------------------+----------------------------------------------------------+
|              BUILD_TAG               |      jenkins-functest-fuel-virtual-daily-hunter-635      |
|             TEST_DB_URL              |     http://testresults.opnfv.org/test/api/v1/results     |
|     ENERGY_RECORDER_API_PASSWORD     |                                                          |
|               CI_LOOP                |                          daily                           |
|                DEBUG                 |                           true                           |
|            INSTALLER_TYPE            |                           fuel                           |
|       ENERGY_RECORDER_API_URL        |             http://energy.opnfv.fr/resources             |
|           DEPLOY_SCENARIO            |                     os-odl-ovs-noha                      |
|       ENERGY_RECORDER_API_USER       |                                                          |
|              NODE_NAME               |                    ericsson-virtual2                     |
+--------------------------------------+----------------------------------------------------------+

2019-08-22 05:04:33,651 - xtesting.ci.run_tests - INFO - Sourcing env file /var/lib/xtesting/conf/env_file


export OS_IDENTITY_API_VERSION=3
export OS_PROJECT_DOMAIN_NAME=Default
export OS_USER_DOMAIN_NAME=Default
export OS_PROJECT_NAME=admin
export OS_TENANT_NAME=admin
export OS_USERNAME=admin
export OS_PASSWORD=opnfv_secret
export OS_REGION_NAME=RegionOne
export OS_INTERFACE=internal
export OS_ENDPOINT_TYPE="internal"
export OS_CACERT="/etc/ssl/certs/ca-certificates.crt"
export SDN_CONTROLLER_USER=admin
export SDN_CONTROLLER_RESTCONFPORT=8282
export SDN_CONTROLLER_PASSWORD=admin
export SDN_CONTROLLER_WEBPORT=8282
export SDN_CONTROLLER_IP=10.16.0.107
export VOLUME_DEVICE_NAME=sdc
export OS_AUTH_URL=http://172.16.10.36:35357/v3

2019-08-22 05:04:33,652 - xtesting.ci.run_tests - INFO - TESTS TO BE EXECUTED:

+---------------+---------------+------------------------------------------+-------------------------------------------------+
|     TIERS     |     ORDER     |               DESCRIPTION                |                    TESTCASES                    |
+---------------+---------------+------------------------------------------+-------------------------------------------------+
|     smoke     |       1       |     Set of basic Functional tests to     |     neutron-tempest-plugin-api rally_sanity     |
|               |               |      validate the OPNFV scenarios.       |          refstack_defcore tempest_full          |
|               |               |                                          |      tempest_scenario patrole neutron_trunk     |
|               |               |                                          |         networking-bgpvpn networking-sfc        |
|               |               |                                          |                     barbican                    |
+---------------+---------------+------------------------------------------+-------------------------------------------------+

2019-08-22 05:04:33,696 - xtesting.ci.run_tests - INFO - Loading test case 'neutron-tempest-plugin-api'...
2019-08-22 05:04:38,369 - xtesting.ci.run_tests - INFO - Running test case 'neutron-tempest-plugin-api'...
2019-08-22 05:15:27,570 - xtesting.core.testcase - INFO - The results were successfully pushed to DB
2019-08-22 05:15:27,570 - xtesting.ci.run_tests - INFO - Test result:

+------------------------------------+------------------+------------------+----------------+
|             TEST CASE              |     PROJECT      |     DURATION     |     RESULT     |
+------------------------------------+------------------+------------------+----------------+
|     neutron-tempest-plugin-api     |     functest     |      10:49       |      FAIL      |
+------------------------------------+------------------+------------------+----------------+

2019-08-22 05:15:38,817 - xtesting.ci.run_tests - ERROR - The test case 'neutron-tempest-plugin-api' failed.
2019-08-22 05:15:38,852 - xtesting.ci.run_tests - INFO - Loading test case 'rally_sanity'...
2019-08-22 05:15:41,384 - xtesting.ci.run_tests - INFO - Running test case 'rally_sanity'...
2019-08-22 05:36:23,160 - xtesting.core.testcase - INFO - The results were successfully pushed to DB
2019-08-22 05:36:23,160 - xtesting.ci.run_tests - INFO - Test result:

+----------------------+------------------+------------------+----------------+
|      TEST CASE       |     PROJECT      |     DURATION     |     RESULT     |
+----------------------+------------------+------------------+----------------+
|     rally_sanity     |     functest     |      20:41       |      FAIL      |
+----------------------+------------------+------------------+----------------+

2019-08-22 05:36:35,331 - xtesting.ci.run_tests - ERROR - The test case 'rally_sanity' failed.
2019-08-22 05:36:35,361 - xtesting.ci.run_tests - INFO - Loading test case 'refstack_defcore'...
2019-08-22 05:36:39,404 - xtesting.ci.run_tests - INFO - Running test case 'refstack_defcore'...
2019-08-22 05:44:37,570 - xtesting.core.testcase - INFO - The results were successfully pushed to DB
2019-08-22 05:44:37,570 - xtesting.ci.run_tests - INFO - Test result:

+--------------------------+------------------+------------------+----------------+
|        TEST CASE         |     PROJECT      |     DURATION     |     RESULT     |
+--------------------------+------------------+------------------+----------------+
|     refstack_defcore     |     functest     |      07:58       |      PASS      |
+--------------------------+------------------+------------------+----------------+

2019-08-22 05:44:48,947 - xtesting.ci.run_tests - INFO - Loading test case 'tempest_full'...
2019-08-22 05:44:52,931 - xtesting.ci.run_tests - INFO - Running test case 'tempest_full'...
2019-08-22 06:30:10,256 - xtesting.core.testcase - INFO - The results were successfully pushed to DB
2019-08-22 06:30:10,257 - xtesting.ci.run_tests - INFO - Test result:

+----------------------+------------------+------------------+----------------+
|      TEST CASE       |     PROJECT      |     DURATION     |     RESULT     |
+----------------------+------------------+------------------+----------------+
|     tempest_full     |     functest     |      45:17       |      FAIL      |
+----------------------+------------------+------------------+----------------+

2019-08-22 06:30:22,628 - xtesting.ci.run_tests - ERROR - The test case 'tempest_full' failed.
2019-08-22 06:30:22,665 - xtesting.ci.run_tests - INFO - Loading test case 'tempest_scenario'...
2019-08-22 06:30:26,613 - xtesting.ci.run_tests - INFO - Running test case 'tempest_scenario'...
2019-08-22 06:40:55,319 - xtesting.core.testcase - INFO - The results were successfully pushed to DB
2019-08-22 06:40:55,319 - xtesting.ci.run_tests - INFO - Test result:

+--------------------------+------------------+------------------+----------------+
|        TEST CASE         |     PROJECT      |     DURATION     |     RESULT     |
+--------------------------+------------------+------------------+----------------+
|     tempest_scenario     |     functest     |      10:28       |      PASS      |
+--------------------------+------------------+------------------+----------------+

2019-08-22 06:41:06,740 - xtesting.ci.run_tests - INFO - Loading test case 'patrole'...
2019-08-22 06:41:10,432 - xtesting.ci.run_tests - INFO - Running test case 'patrole'...
2019-08-22 06:44:19,815 - xtesting.core.testcase - INFO - The results were successfully pushed to DB
2019-08-22 06:44:19,816 - xtesting.ci.run_tests - INFO - Test result:

+-------------------+------------------+------------------+----------------+
|     TEST CASE     |     PROJECT      |     DURATION     |     RESULT     |
+-------------------+------------------+------------------+----------------+
|      patrole      |     functest     |      03:09       |      PASS      |
+-------------------+------------------+------------------+----------------+

2019-08-22 06:44:30,693 - xtesting.ci.run_tests - INFO - Loading test case 'neutron_trunk'...
2019-08-22 06:44:34,653 - xtesting.ci.run_tests - INFO - Running test case 'neutron_trunk'...
2019-08-22 06:47:18,133 - xtesting.core.testcase - INFO - The results were successfully pushed to DB
2019-08-22 06:47:18,133 - xtesting.ci.run_tests - INFO - Test result:

+-----------------------+------------------+------------------+----------------+
|       TEST CASE       |     PROJECT      |     DURATION     |     RESULT     |
+-----------------------+------------------+------------------+----------------+
|     neutron_trunk     |     functest     |      02:43       |      PASS      |
+-----------------------+------------------+------------------+----------------+

2019-08-22 06:47:28,926 - xtesting.ci.run_tests - INFO - Loading test case 'networking-bgpvpn'...
2019-08-22 06:47:32,483 - functest.opnfv_tests.openstack.tempest.tempest - WARNING - Cannot find Neutron extension: bgpvpn
2019-08-22 06:47:33,122 - xtesting.ci.run_tests - INFO - Skipping test case 'networking-bgpvpn'...
2019-08-22 06:47:33,122 - xtesting.ci.run_tests - INFO - Test result:

+---------------------------+------------------+------------------+----------------+
|         TEST CASE         |     PROJECT      |     DURATION     |     RESULT     |
+---------------------------+------------------+------------------+----------------+
|     networking-bgpvpn     |     functest     |      00:00       |      SKIP      |
+---------------------------+------------------+------------------+----------------+

2019-08-22 06:47:33,155 - xtesting.ci.run_tests - INFO - Loading test case 'networking-sfc'...
2019-08-22 06:47:37,006 - functest.opnfv_tests.openstack.tempest.tempest - WARNING - Cannot find Neutron extension: sfc
2019-08-22 06:47:37,685 - xtesting.ci.run_tests - INFO - Skipping test case 'networking-sfc'...
2019-08-22 06:47:37,685 - xtesting.ci.run_tests - INFO - Test result:

+------------------------+------------------+------------------+----------------+
|       TEST CASE        |     PROJECT      |     DURATION     |     RESULT     |
+------------------------+------------------+------------------+----------------+
|     networking-sfc     |     functest     |      00:00       |      SKIP      |
+------------------------+------------------+------------------+----------------+

2019-08-22 06:47:37,718 - xtesting.ci.run_tests - INFO - Loading test case 'barbican'...
2019-08-22 06:47:41,644 - xtesting.ci.run_tests - INFO - Running test case 'barbican'...
2019-08-22 06:50:22,758 - xtesting.core.testcase - INFO - The results were successfully pushed to DB
2019-08-22 06:50:22,758 - xtesting.ci.run_tests - INFO - Test result:

+-------------------+------------------+------------------+----------------+
|     TEST CASE     |     PROJECT      |     DURATION     |     RESULT     |
+-------------------+------------------+------------------+----------------+
|      barbican     |     functest     |      02:41       |      PASS      |
+-------------------+------------------+------------------+----------------+

2019-08-22 06:50:32,793 - xtesting.ci.run_tests - INFO - Xtesting report:

+------------------------------------+------------------+---------------+------------------+----------------+
|             TEST CASE              |     PROJECT      |      TIER     |     DURATION     |     RESULT     |
+------------------------------------+------------------+---------------+------------------+----------------+
|     neutron-tempest-plugin-api     |     functest     |     smoke     |      10:49       |      FAIL      |
|            rally_sanity            |     functest     |     smoke     |      20:41       |      FAIL      |
|          refstack_defcore          |     functest     |     smoke     |      07:58       |      PASS      |
|            tempest_full            |     functest     |     smoke     |      45:17       |      FAIL      |
|          tempest_scenario          |     functest     |     smoke     |      10:28       |      PASS      |
|              patrole               |     functest     |     smoke     |      03:09       |      PASS      |
|           neutron_trunk            |     functest     |     smoke     |      02:43       |      PASS      |
|         networking-bgpvpn          |     functest     |     smoke     |      00:00       |      SKIP      |
|           networking-sfc           |     functest     |     smoke     |      00:00       |      SKIP      |
|              barbican              |     functest     |     smoke     |      02:41       |      PASS      |
+------------------------------------+------------------+---------------+------------------+----------------+

2019-08-22 06:50:32,800 - xtesting.ci.run_tests - INFO - Execution exit value: Result.EX_ERROR
Functest: Pulling Functest Docker image opnfv/functest-benchmarking:hunter ...
Running Functest tier 'benchmarking'. CMD: docker run --rm  -e INSTALLER_TYPE=fuel -e INSTALLER_IP=10.20.0.2     -e NODE_NAME=ericsson-virtual2 -e DEPLOY_SCENARIO=os-odl-ovs-noha     -e BUILD_TAG=jenkins-functest-fuel-virtual-daily-hunter-635 -e DEPLOY_TYPE=virt -e CI_LOOP=daily     -e TEST_DB_URL=http://testresults.opnfv.org/test/api/v1/results -e ENERGY_RECORDER_API_URL=http://energy.opnfv.fr/resources     -e DEBUG=true -e POD_ARCH=x86_64 -e BLOCK_MIGRATION=false -e SDN_CONTROLLER_RESTCONFPORT=8080 -e IMAGE_PROPERTIES=hw_disk_bus:scsi,hw_scsi_model:virtio-scsi,hw_mem_page_size:large -e FLAVOR_EXTRA_SPECS=hw:mem_page_size:large -v /home/jenkins/opnfv/functest/images:/home/opnfv/functest/images -v /home/jenkins/opnfv/functest/results/hunter:/home/opnfv/functest/results -v /var/lib/opnfv/mcp.rsa:/root/.ssh/id_rsa       -v /home/jenkins/opnfv-openrc.sh:/home/opnfv/functest/conf/env_file      -v /tmp/tmp.paOL1FzvId:/usr/lib/python2.7/site-packages/functest/opnfv_tests/openstack/tempest/custom_tests/tempest_conf.yaml  opnfv/functest-benchmarking:hunter /bin/bash -c 'run_tests -r -t all'
2019-08-22 06:50:37,729 - xtesting.ci.run_tests - INFO - Deployment description:

+--------------------------------------+----------------------------------------------------------+
|               ENV VAR                |                          VALUE                           |
+--------------------------------------+----------------------------------------------------------+
|              BUILD_TAG               |      jenkins-functest-fuel-virtual-daily-hunter-635      |
|             TEST_DB_URL              |     http://testresults.opnfv.org/test/api/v1/results     |
|     ENERGY_RECORDER_API_PASSWORD     |                                                          |
|               CI_LOOP                |                          daily                           |
|                DEBUG                 |                           true                           |
|            INSTALLER_TYPE            |                           fuel                           |
|       ENERGY_RECORDER_API_URL        |             http://energy.opnfv.fr/resources             |
|           DEPLOY_SCENARIO            |                     os-odl-ovs-noha                      |
|       ENERGY_RECORDER_API_USER       |                                                          |
|              NODE_NAME               |                    ericsson-virtual2                     |
+--------------------------------------+----------------------------------------------------------+

2019-08-22 06:50:37,734 - xtesting.ci.run_tests - INFO - Sourcing env file /var/lib/xtesting/conf/env_file


export OS_IDENTITY_API_VERSION=3
export OS_PROJECT_DOMAIN_NAME=Default
export OS_USER_DOMAIN_NAME=Default
export OS_PROJECT_NAME=admin
export OS_TENANT_NAME=admin
export OS_USERNAME=admin
export OS_PASSWORD=opnfv_secret
export OS_REGION_NAME=RegionOne
export OS_INTERFACE=internal
export OS_ENDPOINT_TYPE="internal"
export OS_CACERT="/etc/ssl/certs/ca-certificates.crt"
export SDN_CONTROLLER_USER=admin
export SDN_CONTROLLER_RESTCONFPORT=8282
export SDN_CONTROLLER_PASSWORD=admin
export SDN_CONTROLLER_WEBPORT=8282
export SDN_CONTROLLER_IP=10.16.0.107
export VOLUME_DEVICE_NAME=sdc
export OS_AUTH_URL=http://172.16.10.36:35357/v3

2019-08-22 06:50:37,735 - xtesting.ci.run_tests - INFO - TESTS TO BE EXECUTED:

+----------------------+---------------+-------------------------------------------------+-------------------------------------------+
|        TIERS         |     ORDER     |                   DESCRIPTION                   |                 TESTCASES                 |
+----------------------+---------------+-------------------------------------------------+-------------------------------------------+
|     benchmarking     |       2       |     Run several OpenStack performance tools     |     rally_full rally_jobs vmtp shaker     |
|                      |               |     https://docs.openstack.org/performance-     |                                           |
|                      |               |       docs/latest/methodologies/tools.html      |                                           |
+----------------------+---------------+-------------------------------------------------+-------------------------------------------+

2019-08-22 06:50:37,748 - xtesting.ci.run_tests - INFO - Loading test case 'rally_full'...
2019-08-22 06:50:40,850 - xtesting.ci.run_tests - INFO - Running test case 'rally_full'...
2019-08-22 08:36:09,181 - xtesting.core.testcase - INFO - The results were successfully pushed to DB
2019-08-22 08:36:09,182 - xtesting.ci.run_tests - INFO - Test result:

+--------------------+------------------+------------------+----------------+
|     TEST CASE      |     PROJECT      |     DURATION     |     RESULT     |
+--------------------+------------------+------------------+----------------+
|     rally_full     |     functest     |      105:28      |      FAIL      |
+--------------------+------------------+------------------+----------------+

2019-08-22 08:36:21,940 - xtesting.ci.run_tests - ERROR - The test case 'rally_full' failed.
2019-08-22 08:36:21,959 - xtesting.ci.run_tests - INFO - Loading test case 'rally_jobs'...
2019-08-22 08:36:25,188 - xtesting.ci.run_tests - INFO - Running test case 'rally_jobs'...
2019-08-22 09:23:57,713 - xtesting.core.testcase - INFO - The results were successfully pushed to DB
2019-08-22 09:23:57,713 - xtesting.ci.run_tests - INFO - Test result:

+--------------------+------------------+------------------+----------------+
|     TEST CASE      |     PROJECT      |     DURATION     |     RESULT     |
+--------------------+------------------+------------------+----------------+
|     rally_jobs     |     functest     |      47:32       |      PASS      |
+--------------------+------------------+------------------+----------------+

2019-08-22 09:24:09,939 - xtesting.ci.run_tests - INFO - Loading test case 'vmtp'...
2019-08-22 09:24:12,616 - xtesting.ci.run_tests - INFO - Running test case 'vmtp'...
2019-08-22 09:42:31,190 - xtesting.core.testcase - INFO - The results were successfully pushed to DB
2019-08-22 09:42:31,190 - xtesting.ci.run_tests - INFO - Test result:

+-------------------+------------------+------------------+----------------+
|     TEST CASE     |     PROJECT      |     DURATION     |     RESULT     |
+-------------------+------------------+------------------+----------------+
|        vmtp       |     functest     |      18:18       |      PASS      |
+-------------------+------------------+------------------+----------------+

2019-08-22 09:42:35,921 - xtesting.ci.run_tests - INFO - Loading test case 'shaker'...
2019-08-22 09:42:38,817 - xtesting.ci.run_tests - INFO - Running test case 'shaker'...
2019-08-22 10:44:10,076 - functest.opnfv_tests.openstack.shaker.shaker - ERROR - cannot get report files
Traceback (most recent call last):
  File "/usr/lib/python2.7/site-packages/functest/opnfv_tests/openstack/shaker/shaker.py", line 125, in execute
    scpc.get('report.json', self.res_dir)
  File "/usr/lib/python2.7/site-packages/scp.py", line 217, in get
    self._recv_all()
  File "/usr/lib/python2.7/site-packages/scp.py", line 367, in _recv_all
    raise SCPException(asunicode(msg[1:]))
SCPException: scp: report.json: No such file or directory
2019-08-22 10:44:10,385 - xtesting.core.testcase - INFO - The results were successfully pushed to DB
2019-08-22 10:44:10,385 - xtesting.ci.run_tests - INFO - Test result:

+-------------------+------------------+------------------+----------------+
|     TEST CASE     |     PROJECT      |     DURATION     |     RESULT     |
+-------------------+------------------+------------------+----------------+
|       shaker      |     functest     |      61:31       |      FAIL      |
+-------------------+------------------+------------------+----------------+

2019-08-22 10:44:30,226 - xtesting.ci.run_tests - ERROR - The test case 'shaker' failed.
2019-08-22 10:44:30,226 - xtesting.ci.run_tests - INFO - Xtesting report:

+--------------------+------------------+----------------------+------------------+----------------+
|     TEST CASE      |     PROJECT      |         TIER         |     DURATION     |     RESULT     |
+--------------------+------------------+----------------------+------------------+----------------+
|     rally_full     |     functest     |     benchmarking     |      105:28      |      FAIL      |
|     rally_jobs     |     functest     |     benchmarking     |      47:32       |      PASS      |
|        vmtp        |     functest     |     benchmarking     |      18:18       |      PASS      |
|       shaker       |     functest     |     benchmarking     |      61:31       |      FAIL      |
+--------------------+------------------+----------------------+------------------+----------------+

2019-08-22 10:44:30,230 - xtesting.ci.run_tests - INFO - Execution exit value: Result.EX_ERROR
Functest: Pulling Functest Docker image opnfv/functest-features:hunter ...
Running Functest tier 'features'. CMD: docker run --rm  -e INSTALLER_TYPE=fuel -e INSTALLER_IP=10.20.0.2     -e NODE_NAME=ericsson-virtual2 -e DEPLOY_SCENARIO=os-odl-ovs-noha     -e BUILD_TAG=jenkins-functest-fuel-virtual-daily-hunter-635 -e DEPLOY_TYPE=virt -e CI_LOOP=daily     -e TEST_DB_URL=http://testresults.opnfv.org/test/api/v1/results -e ENERGY_RECORDER_API_URL=http://energy.opnfv.fr/resources     -e DEBUG=true -e POD_ARCH=x86_64 -e BLOCK_MIGRATION=false -e SDN_CONTROLLER_RESTCONFPORT=8080 -e IMAGE_PROPERTIES=hw_disk_bus:scsi,hw_scsi_model:virtio-scsi,hw_mem_page_size:large -e FLAVOR_EXTRA_SPECS=hw:mem_page_size:large -v /home/jenkins/opnfv/functest/images:/home/opnfv/functest/images -v /home/jenkins/opnfv/functest/results/hunter:/home/opnfv/functest/results -v /var/lib/opnfv/mcp.rsa:/root/.ssh/id_rsa       -v /home/jenkins/opnfv-openrc.sh:/home/opnfv/functest/conf/env_file      -v /tmp/tmp.paOL1FzvId:/usr/lib/python2.7/site-packages/functest/opnfv_tests/openstack/tempest/custom_tests/tempest_conf.yaml  opnfv/functest-features:hunter /bin/bash -c 'run_tests -r -t all'
2019-08-22 10:44:35,165 - xtesting.ci.run_tests - INFO - Deployment description:

+--------------------------------------+----------------------------------------------------------+
|               ENV VAR                |                          VALUE                           |
+--------------------------------------+----------------------------------------------------------+
|              BUILD_TAG               |      jenkins-functest-fuel-virtual-daily-hunter-635      |
|             TEST_DB_URL              |     http://testresults.opnfv.org/test/api/v1/results     |
|     ENERGY_RECORDER_API_PASSWORD     |                                                          |
|               CI_LOOP                |                          daily                           |
|                DEBUG                 |                           true                           |
|            INSTALLER_TYPE            |                           fuel                           |
|       ENERGY_RECORDER_API_URL        |             http://energy.opnfv.fr/resources             |
|           DEPLOY_SCENARIO            |                     os-odl-ovs-noha                      |
|       ENERGY_RECORDER_API_USER       |                                                          |
|              NODE_NAME               |                    ericsson-virtual2                     |
+--------------------------------------+----------------------------------------------------------+

2019-08-22 10:44:35,170 - xtesting.ci.run_tests - INFO - Sourcing env file /var/lib/xtesting/conf/env_file


export OS_IDENTITY_API_VERSION=3
export OS_PROJECT_DOMAIN_NAME=Default
export OS_USER_DOMAIN_NAME=Default
export OS_PROJECT_NAME=admin
export OS_TENANT_NAME=admin
export OS_USERNAME=admin
export OS_PASSWORD=opnfv_secret
export OS_REGION_NAME=RegionOne
export OS_INTERFACE=internal
export OS_ENDPOINT_TYPE="internal"
export OS_CACERT="/etc/ssl/certs/ca-certificates.crt"
export SDN_CONTROLLER_USER=admin
export SDN_CONTROLLER_RESTCONFPORT=8282
export SDN_CONTROLLER_PASSWORD=admin
export SDN_CONTROLLER_WEBPORT=8282
export SDN_CONTROLLER_IP=10.16.0.107
export VOLUME_DEVICE_NAME=sdc
export OS_AUTH_URL=http://172.16.10.36:35357/v3

2019-08-22 10:44:35,171 - xtesting.ci.run_tests - INFO - TESTS TO BE EXECUTED:

+------------------+---------------+-------------------------------------------+-----------------------------+
|      TIERS       |     ORDER     |                DESCRIPTION                |          TESTCASES          |
+------------------+---------------+-------------------------------------------+-----------------------------+
|     features     |       3       |     Test suites from feature projects     |     doctor-notification     |
|                  |               |           integrated in functest          |                             |
+------------------+---------------+-------------------------------------------+-----------------------------+

2019-08-22 10:44:35,185 - xtesting.ci.run_tests - INFO - Loading test case 'doctor-notification'...
2019-08-22 10:44:35,258 - xtesting.ci.run_tests - INFO - Running test case 'doctor-notification'...
2019-08-22 10:44:35,258 - xtesting.core.feature - INFO - Calling doctor-test
2019-08-22 10:48:25,848 - xtesting.core.testcase - INFO - The results were successfully pushed to DB
2019-08-22 10:48:25,848 - xtesting.ci.run_tests - INFO - Test result:

+-----------------------------+-----------------+------------------+----------------+
|          TEST CASE          |     PROJECT     |     DURATION     |     RESULT     |
+-----------------------------+-----------------+------------------+----------------+
|     doctor-notification     |      doctor     |      03:50       |      FAIL      |
+-----------------------------+-----------------+------------------+----------------+

2019-08-22 10:48:25,851 - xtesting.ci.run_tests - ERROR - The test case 'doctor-notification' failed.
2019-08-22 10:48:25,851 - xtesting.ci.run_tests - INFO - Xtesting report:

+-----------------------------+-------------------+------------------+------------------+----------------+
|          TEST CASE          |      PROJECT      |       TIER       |     DURATION     |     RESULT     |
+-----------------------------+-------------------+------------------+------------------+----------------+
|     doctor-notification     |       doctor      |     features     |      03:50       |      FAIL      |
|       functest-odl-sfc      |        sfc        |     features     |      00:00       |      SKIP      |
|      barometercollectd      |     barometer     |     features     |      00:00       |      SKIP      |
|             vgpu            |      functest     |     features     |      00:00       |      SKIP      |
|         stor4nfv_os         |      stor4nfv     |     features     |      00:00       |      SKIP      |
+-----------------------------+-------------------+------------------+------------------+----------------+

2019-08-22 10:48:25,854 - xtesting.ci.run_tests - INFO - Execution exit value: Result.EX_ERROR
Functest: Pulling Functest Docker image opnfv/functest-vnf:hunter ...
Running Functest tier 'vnf'. CMD: docker run --rm  -e INSTALLER_TYPE=fuel -e INSTALLER_IP=10.20.0.2     -e NODE_NAME=ericsson-virtual2 -e DEPLOY_SCENARIO=os-odl-ovs-noha     -e BUILD_TAG=jenkins-functest-fuel-virtual-daily-hunter-635 -e DEPLOY_TYPE=virt -e CI_LOOP=daily     -e TEST_DB_URL=http://testresults.opnfv.org/test/api/v1/results -e ENERGY_RECORDER_API_URL=http://energy.opnfv.fr/resources     -e DEBUG=true -e POD_ARCH=x86_64 -e BLOCK_MIGRATION=false -e SDN_CONTROLLER_RESTCONFPORT=8080 -e IMAGE_PROPERTIES=hw_disk_bus:scsi,hw_scsi_model:virtio-scsi,hw_mem_page_size:large -e FLAVOR_EXTRA_SPECS=hw:mem_page_size:large -v /home/jenkins/opnfv/functest/images:/home/opnfv/functest/images -v /home/jenkins/opnfv/functest/results/hunter:/home/opnfv/functest/results -v /var/lib/opnfv/mcp.rsa:/root/.ssh/id_rsa       -v /home/jenkins/opnfv-openrc.sh:/home/opnfv/functest/conf/env_file      -v /tmp/tmp.paOL1FzvId:/usr/lib/python2.7/site-packages/functest/opnfv_tests/openstack/tempest/custom_tests/tempest_conf.yaml  opnfv/functest-vnf:hunter /bin/bash -c 'run_tests -r -t all'
2019-08-22 10:48:30,161 - xtesting.ci.run_tests - INFO - Deployment description:

+--------------------------------------+----------------------------------------------------------+
|               ENV VAR                |                          VALUE                           |
+--------------------------------------+----------------------------------------------------------+
|              BUILD_TAG               |      jenkins-functest-fuel-virtual-daily-hunter-635      |
|             TEST_DB_URL              |     http://testresults.opnfv.org/test/api/v1/results     |
|     ENERGY_RECORDER_API_PASSWORD     |                                                          |
|               CI_LOOP                |                          daily                           |
|                DEBUG                 |                           true                           |
|            INSTALLER_TYPE            |                           fuel                           |
|       ENERGY_RECORDER_API_URL        |             http://energy.opnfv.fr/resources             |
|           DEPLOY_SCENARIO            |                     os-odl-ovs-noha                      |
|       ENERGY_RECORDER_API_USER       |                                                          |
|              NODE_NAME               |                    ericsson-virtual2                     |
+--------------------------------------+----------------------------------------------------------+

2019-08-22 10:48:30,169 - xtesting.ci.run_tests - INFO - Sourcing env file /var/lib/xtesting/conf/env_file


export OS_IDENTITY_API_VERSION=3
export OS_PROJECT_DOMAIN_NAME=Default
export OS_USER_DOMAIN_NAME=Default
export OS_PROJECT_NAME=admin
export OS_TENANT_NAME=admin
export OS_USERNAME=admin
export OS_PASSWORD=opnfv_secret
export OS_REGION_NAME=RegionOne
export OS_INTERFACE=internal
export OS_ENDPOINT_TYPE="internal"
export OS_CACERT="/etc/ssl/certs/ca-certificates.crt"
export SDN_CONTROLLER_USER=admin
export SDN_CONTROLLER_RESTCONFPORT=8282
export SDN_CONTROLLER_PASSWORD=admin
export SDN_CONTROLLER_WEBPORT=8282
export SDN_CONTROLLER_IP=10.16.0.107
export VOLUME_DEVICE_NAME=sdc
export OS_AUTH_URL=http://172.16.10.36:35357/v3

2019-08-22 10:48:30,171 - xtesting.ci.run_tests - INFO - TESTS TO BE EXECUTED:

+---------------+---------------+---------------------------------------+----------------------------------------+
|     TIERS     |     ORDER     |              DESCRIPTION              |               TESTCASES                |
+---------------+---------------+---------------------------------------+----------------------------------------+
|      vnf      |       4       |     Collection of VNF test cases.     |     cloudify cloudify_ims heat_ims     |
|               |               |                                       |         vyos_vrouter juju_epc          |
+---------------+---------------+---------------------------------------+----------------------------------------+

2019-08-22 10:48:30,187 - xtesting.ci.run_tests - INFO - Loading test case 'cloudify'...
2019-08-22 10:48:32,990 - xtesting.ci.run_tests - INFO - Running test case 'cloudify'...
2019-08-22 10:54:03,159 - functest.core.cloudify - INFO - Attemps running status of the Manager
2019-08-22 10:54:33,796 - functest.core.cloudify - INFO - The current manager status is running
2019-08-22 10:54:34,401 - functest.core.cloudify - INFO - Secrets API successfully reached
2019-08-22 10:54:34,401 - functest.core.cloudify - INFO - Cloudify Manager is up and running
2019-08-22 10:54:34,701 - xtesting.core.testcase - INFO - The results were successfully pushed to DB
2019-08-22 10:54:34,701 - xtesting.ci.run_tests - INFO - Test result:

+-------------------+------------------+------------------+----------------+
|     TEST CASE     |     PROJECT      |     DURATION     |     RESULT     |
+-------------------+------------------+------------------+----------------+
|      cloudify     |     functest     |      06:01       |      PASS      |
+-------------------+------------------+------------------+----------------+

2019-08-22 10:54:54,217 - xtesting.ci.run_tests - INFO - Loading test case 'cloudify_ims'...
2019-08-22 10:54:56,541 - xtesting.ci.run_tests - INFO - Running test case 'cloudify_ims'...
2019-08-22 11:01:13,479 - functest.core.cloudify - INFO - Attemps running status of the Manager
2019-08-22 11:01:43,981 - functest.core.cloudify - INFO - The current manager status is running
2019-08-22 11:01:44,472 - functest.core.cloudify - INFO - Secrets API successfully reached
2019-08-22 11:01:44,473 - functest.core.cloudify - INFO - Cloudify Manager is up and running
2019-08-22 11:01:46,336 - functest.core.cloudify - INFO - Put private keypair in manager
2019-08-22 11:01:54,138 - functest.core.singlevm - ERROR - Cannot run cloudify_ims
Traceback (most recent call last):
  File "/usr/lib/python2.7/site-packages/functest/core/singlevm.py", line 468, in run
    if not self.execute():
  File "/usr/lib/python2.7/site-packages/functest/opnfv_tests/vnf/ims/cloudify_ims.py", line 166, in execute
    if self.deploy_vnf() and self.test_vnf():
  File "/usr/lib/python2.7/site-packages/functest/opnfv_tests/vnf/ims/cloudify_ims.py", line 193, in deploy_vnf
    descriptor.get('file_name'), descriptor.get('name'))
  File "/usr/lib/python2.7/site-packages/cloudify_rest_client/blueprints.py", line 213, in upload
    progress_callback=progress_callback)
  File "/usr/lib/python2.7/site-packages/cloudify_rest_client/blueprints.py", line 115, in _upload
    expected_status_code=201)
  File "/usr/lib/python2.7/site-packages/cloudify_rest_client/client.py", line 263, in put
    timeout=timeout)
  File "/usr/lib/python2.7/site-packages/cloudify_rest_client/client.py", line 224, in do_request
    verify=self.get_request_verify(), timeout=timeout)
  File "/usr/lib/python2.7/site-packages/cloudify_rest_client/client.py", line 158, in _do_request
    self._raise_client_error(response, request_url)
  File "/usr/lib/python2.7/site-packages/cloudify_rest_client/client.py", line 119, in _raise_client_error
    response=response)
  File "/usr/lib/python2.7/site-packages/cloudify_rest_client/client.py", line 131, in _prepare_and_raise_exception
    status_code, error_code=error_code, response=response)
CloudifyClientError: 400: Invalid blueprint - Plugin cloudify-openstack-plugin (query: {'package_name': 'cloudify-openstack-plugin'}) not found
2019-08-22 11:01:54,450 - xtesting.core.testcase - INFO - The results were successfully pushed to DB
2019-08-22 11:01:54,450 - xtesting.ci.run_tests - INFO - Test result:

+----------------------+------------------+------------------+----------------+
|      TEST CASE       |     PROJECT      |     DURATION     |     RESULT     |
+----------------------+------------------+------------------+----------------+
|     cloudify_ims     |     functest     |      06:58       |      FAIL      |
+----------------------+------------------+------------------+----------------+

2019-08-22 11:01:54,453 - functest.core.cloudify - INFO - Deleting the current deployment
2019-08-22 11:01:54,603 - functest.core.cloudify - ERROR - Some issue during the undeployment ..
Traceback (most recent call last):
  File "/usr/lib/python2.7/site-packages/functest/core/cloudify.py", line 152, in kill_existing_execution
    dep_name, 'uninstall', parameters=dict(ignore_failure=True))
  File "/usr/lib/python2.7/site-packages/cloudify_rest_client/executions.py", line 201, in start
    expected_status_code=201)
  File "/usr/lib/python2.7/site-packages/cloudify_rest_client/client.py", line 285, in post
    timeout=timeout)
  File "/usr/lib/python2.7/site-packages/cloudify_rest_client/client.py", line 224, in do_request
    verify=self.get_request_verify(), timeout=timeout)
  File "/usr/lib/python2.7/site-packages/cloudify_rest_client/client.py", line 158, in _do_request
    self._raise_client_error(response, request_url)
  File "/usr/lib/python2.7/site-packages/cloudify_rest_client/client.py", line 119, in _raise_client_error
    response=response)
  File "/usr/lib/python2.7/site-packages/cloudify_rest_client/client.py", line 131, in _prepare_and_raise_exception
    status_code, error_code=error_code, response=response)
CloudifyClientError: 404: Requested `Deployment` with ID `clearwater-opnfv` was not found
2019-08-22 11:02:10,772 - xtesting.ci.run_tests - ERROR - The test case 'cloudify_ims' failed.
2019-08-22 11:02:10,785 - xtesting.ci.run_tests - INFO - Loading test case 'heat_ims'...
2019-08-22 11:02:12,880 - xtesting.ci.run_tests - INFO - Running test case 'heat_ims'...
2019-08-22 11:34:57,204 - xtesting.core.testcase - INFO - The results were successfully pushed to DB
2019-08-22 11:34:57,204 - xtesting.ci.run_tests - INFO - Test result:

+-------------------+------------------+------------------+----------------+
|     TEST CASE     |     PROJECT      |     DURATION     |     RESULT     |
+-------------------+------------------+------------------+----------------+
|      heat_ims     |     functest     |      32:44       |      PASS      |
+-------------------+------------------+------------------+----------------+

2019-08-22 11:36:00,905 - xtesting.ci.run_tests - INFO - Loading test case 'vyos_vrouter'...
2019-08-22 11:36:03,363 - xtesting.ci.run_tests - INFO - Running test case 'vyos_vrouter'...
2019-08-22 11:42:05,882 - functest.core.cloudify - INFO - Attemps running status of the Manager
2019-08-22 11:42:36,429 - functest.core.cloudify - INFO - The current manager status is running
2019-08-22 11:42:36,925 - functest.core.cloudify - INFO - Secrets API successfully reached
2019-08-22 11:42:36,926 - functest.core.cloudify - INFO - Cloudify Manager is up and running
2019-08-22 11:42:36,926 - functest.core.cloudify - INFO - Put private keypair in manager
2019-08-22 11:53:36,920 - xtesting.core.testcase - INFO - The results were successfully pushed to DB
2019-08-22 11:53:36,920 - xtesting.ci.run_tests - INFO - Test result:

+----------------------+------------------+------------------+----------------+
|      TEST CASE       |     PROJECT      |     DURATION     |     RESULT     |
+----------------------+------------------+------------------+----------------+
|     vyos_vrouter     |     functest     |      17:33       |      PASS      |
+----------------------+------------------+------------------+----------------+

2019-08-22 11:53:36,923 - functest.core.cloudify - INFO - Deleting the current deployment
2019-08-22 11:55:05,446 - xtesting.ci.run_tests - INFO - Loading test case 'juju_epc'...
2019-08-22 11:55:07,734 - xtesting.ci.run_tests - INFO - Running test case 'juju_epc'...
2019-08-22 12:09:52,046 - functest.opnfv_tests.vnf.epc.juju_epc - ERROR - Exception with Juju VNF Deployment: ['timeout', '-t', '4800', 'juju-wait']
ERROR:root:ERROR dial tcp 192.168.120.10:17070: i/o timeout

ERROR:root:juju status --format=json failed: 1

2019-08-22 12:09:52,370 - xtesting.core.testcase - INFO - The results were successfully pushed to DB
2019-08-22 12:09:52,371 - xtesting.ci.run_tests - INFO - Test result:

+-------------------+------------------+------------------+----------------+
|     TEST CASE     |     PROJECT      |     DURATION     |     RESULT     |
+-------------------+------------------+------------------+----------------+
|      juju_epc     |     functest     |      14:44       |      FAIL      |
+-------------------+------------------+------------------+----------------+

2019-08-22 12:19:52,497 - functest.opnfv_tests.vnf.epc.juju_epc - ERROR - Exception with Juju Cleanup: ['juju', 'debug-log', '--replay', '--no-tail']
ERROR dial tcp 252.10.0.1:17070: i/o timeout

2019-08-22 12:20:05,261 - functest.core.tenantnetwork - ERROR - cannot clean all resources
Traceback (most recent call last):
  File "/usr/lib/python2.7/site-packages/functest/core/tenantnetwork.py", line 284, in clean
    self.cloud.delete_subnet(self.subnet.id)
  File "/usr/lib/python2.7/site-packages/shade/openstackcloud.py", line 7680, in delete_subnet
    "/subnets/{subnet_id}.json".format(subnet_id=subnet['id']))
  File "/usr/lib/python2.7/site-packages/keystoneauth1/adapter.py", line 343, in delete
    return self.request(url, 'DELETE', **kwargs)
  File "/usr/lib/python2.7/site-packages/openstack/_adapter.py", line 164, in request
    return _json_response(response, error_message=error_message)
  File "/usr/lib/python2.7/site-packages/openstack/_adapter.py", line 95, in _json_response
    exceptions.raise_from_response(response, error_message=error_message)
  File "/usr/lib/python2.7/site-packages/openstack/exceptions.py", line 229, in raise_from_response
    http_status=http_status, request_id=request_id
ConflictException: ConflictException: 409: Client Error for url: http://172.16.10.36:9696/v2.0/subnets/b9800f6e-e770-41d8-b921-595722098b81.json, Unable to complete operation on subnet b9800f6e-e770-41d8-b921-595722098b81: One or more ports have an IP allocation from this subnet.
2019-08-22 12:20:07,517 - functest.core.tenantnetwork - ERROR - Cannot clean all resources
Traceback (most recent call last):
  File "/usr/lib/python2.7/site-packages/functest/core/tenantnetwork.py", line 129, in clean
    self.orig_cloud.delete_security_group(sec_id)
  File "/usr/lib/python2.7/site-packages/shade/openstackcloud.py", line 7987, in delete_security_group
    name_or_id)
  File "/usr/lib/python2.7/site-packages/keystoneauth1/adapter.py", line 343, in delete
    return self.request(url, 'DELETE', **kwargs)
  File "/usr/lib/python2.7/site-packages/openstack/_adapter.py", line 164, in request
    return _json_response(response, error_message=error_message)
  File "/usr/lib/python2.7/site-packages/openstack/_adapter.py", line 95, in _json_response
    exceptions.raise_from_response(response, error_message=error_message)
  File "/usr/lib/python2.7/site-packages/openstack/exceptions.py", line 229, in raise_from_response
    http_status=http_status, request_id=request_id
ConflictException: Error deleting security group cb6f2cf6-76be-4005-ae77-ab4fd1648df9: Client Error for url: http://172.16.10.36:9696/v2.0/security-groups/cb6f2cf6-76be-4005-ae77-ab4fd1648df9.json, Security Group cb6f2cf6-76be-4005-ae77-ab4fd1648df9 in use.
2019-08-22 12:20:07,518 - xtesting.ci.run_tests - ERROR - The test case 'juju_epc' failed.
2019-08-22 12:20:07,518 - xtesting.ci.run_tests - INFO - Xtesting report:

+----------------------+------------------+--------------+------------------+----------------+
|      TEST CASE       |     PROJECT      |     TIER     |     DURATION     |     RESULT     |
+----------------------+------------------+--------------+------------------+----------------+
|       cloudify       |     functest     |     vnf      |      06:01       |      PASS      |
|     cloudify_ims     |     functest     |     vnf      |      06:58       |      FAIL      |
|       heat_ims       |     functest     |     vnf      |      32:44       |      PASS      |
|     vyos_vrouter     |     functest     |     vnf      |      17:33       |      PASS      |
|       juju_epc       |     functest     |     vnf      |      14:44       |      FAIL      |
+----------------------+------------------+--------------+------------------+----------------+

2019-08-22 12:20:07,522 - xtesting.ci.run_tests - INFO - Execution exit value: Result.EX_ERROR
Regular expression run condition: Expression=[k8-.*], Label=[os-odl-ovs-noha]
Run condition [Regular expression match] preventing perform for step [Execute shell]
[functest-fuel-virtual-daily-hunter] $ /bin/bash /tmp/jenkins2095197308398714991.sh
Uploading logs to artifact logs/functest/ericsson-virtual2/hunter/2019-08-22_12-20-08
Logs can be found in https://artifacts.opnfv.org/logs_functest_ericsson-virtual2.html
https://artifacts.opnfv.org/logs/functest/ericsson-virtual2/hunter/2019-08-22_12-20-08/doctor-notification
https://artifacts.opnfv.org/logs/functest/ericsson-virtual2/hunter/2019-08-22_12-20-08/doctor-notification/doctor-notification.log
https://artifacts.opnfv.org/logs/functest/ericsson-virtual2/hunter/2019-08-22_12-20-08/rally_jobs
https://artifacts.opnfv.org/logs/functest/ericsson-virtual2/hunter/2019-08-22_12-20-08/rally_jobs/rally_jobs.xml
https://artifacts.opnfv.org/logs/functest/ericsson-virtual2/hunter/2019-08-22_12-20-08/rally_jobs/neutron.json
https://artifacts.opnfv.org/logs/functest/ericsson-virtual2/hunter/2019-08-22_12-20-08/rally_jobs/rally.log
https://artifacts.opnfv.org/logs/functest/ericsson-virtual2/hunter/2019-08-22_12-20-08/rally_jobs/rally_jobs.html
https://artifacts.opnfv.org/logs/functest/ericsson-virtual2/hunter/2019-08-22_12-20-08/tempest_smoke
https://artifacts.opnfv.org/logs/functest/ericsson-virtual2/hunter/2019-08-22_12-20-08/tempest_smoke/test_list.txt
https://artifacts.opnfv.org/logs/functest/ericsson-virtual2/hunter/2019-08-22_12-20-08/tempest_smoke/tempest.debug.log
https://artifacts.opnfv.org/logs/functest/ericsson-virtual2/hunter/2019-08-22_12-20-08/tempest_smoke/test_raw_list.txt
https://artifacts.opnfv.org/logs/functest/ericsson-virtual2/hunter/2019-08-22_12-20-08/tempest_smoke/tempest.conf
https://artifacts.opnfv.org/logs/functest/ericsson-virtual2/hunter/2019-08-22_12-20-08/tempest_smoke/tempest-report.html
https://artifacts.opnfv.org/logs/functest/ericsson-virtual2/hunter/2019-08-22_12-20-08/tempest_smoke/tempest.log
https://artifacts.opnfv.org/logs/functest/ericsson-virtual2/hunter/2019-08-22_12-20-08/tempest_smoke/rally.log
https://artifacts.opnfv.org/logs/functest/ericsson-virtual2/hunter/2019-08-22_12-20-08/tempest_smoke/rally.conf
https://artifacts.opnfv.org/logs/functest/ericsson-virtual2/hunter/2019-08-22_12-20-08/tempest_smoke/tempest-report.xml
https://artifacts.opnfv.org/logs/functest/ericsson-virtual2/hunter/2019-08-22_12-20-08/refstack_defcore
https://artifacts.opnfv.org/logs/functest/ericsson-virtual2/hunter/2019-08-22_12-20-08/refstack_defcore/test_list.txt
https://artifacts.opnfv.org/logs/functest/ericsson-virtual2/hunter/2019-08-22_12-20-08/refstack_defcore/tempest.debug.log
https://artifacts.opnfv.org/logs/functest/ericsson-virtual2/hunter/2019-08-22_12-20-08/refstack_defcore/test_raw_list.txt
https://artifacts.opnfv.org/logs/functest/ericsson-virtual2/hunter/2019-08-22_12-20-08/refstack_defcore/tempest.conf
https://artifacts.opnfv.org/logs/functest/ericsson-virtual2/hunter/2019-08-22_12-20-08/refstack_defcore/tempest-report.html
https://artifacts.opnfv.org/logs/functest/ericsson-virtual2/hunter/2019-08-22_12-20-08/refstack_defcore/tempest.log
https://artifacts.opnfv.org/logs/functest/ericsson-virtual2/hunter/2019-08-22_12-20-08/refstack_defcore/rally.log
https://artifacts.opnfv.org/logs/functest/ericsson-virtual2/hunter/2019-08-22_12-20-08/refstack_defcore/rally.conf
https://artifacts.opnfv.org/logs/functest/ericsson-virtual2/hunter/2019-08-22_12-20-08/refstack_defcore/tempest-report.xml
https://artifacts.opnfv.org/logs/functest/ericsson-virtual2/hunter/2019-08-22_12-20-08/rally_full
https://artifacts.opnfv.org/logs/functest/ericsson-virtual2/hunter/2019-08-22_12-20-08/rally_full/gnocchi.json
https://artifacts.opnfv.org/logs/functest/ericsson-virtual2/hunter/2019-08-22_12-20-08/rally_full/keystone.json
https://artifacts.opnfv.org/logs/functest/ericsson-virtual2/hunter/2019-08-22_12-20-08/rally_full/glance.json
https://artifacts.opnfv.org/logs/functest/ericsson-virtual2/hunter/2019-08-22_12-20-08/rally_full/rally_full.xml
https://artifacts.opnfv.org/logs/functest/ericsson-virtual2/hunter/2019-08-22_12-20-08/rally_full/quotas.json
https://artifacts.opnfv.org/logs/functest/ericsson-virtual2/hunter/2019-08-22_12-20-08/rally_full/neutron.json
https://artifacts.opnfv.org/logs/functest/ericsson-virtual2/hunter/2019-08-22_12-20-08/rally_full/heat.json
https://artifacts.opnfv.org/logs/functest/ericsson-virtual2/hunter/2019-08-22_12-20-08/rally_full/nova.json
https://artifacts.opnfv.org/logs/functest/ericsson-virtual2/hunter/2019-08-22_12-20-08/rally_full/authenticate.json
https://artifacts.opnfv.org/logs/functest/ericsson-virtual2/hunter/2019-08-22_12-20-08/rally_full/cinder.json
https://artifacts.opnfv.org/logs/functest/ericsson-virtual2/hunter/2019-08-22_12-20-08/rally_full/rally.log
https://artifacts.opnfv.org/logs/functest/ericsson-virtual2/hunter/2019-08-22_12-20-08/rally_full/rally_full.html
https://artifacts.opnfv.org/logs/functest/ericsson-virtual2/hunter/2019-08-22_12-20-08/functest.log
https://artifacts.opnfv.org/logs/functest/ericsson-virtual2/hunter/2019-08-22_12-20-08/vmtp
https://artifacts.opnfv.org/logs/functest/ericsson-virtual2/hunter/2019-08-22_12-20-08/vmtp/vmtp.html
https://artifacts.opnfv.org/logs/functest/ericsson-virtual2/hunter/2019-08-22_12-20-08/vmtp/vmtp.json
https://artifacts.opnfv.org/logs/functest/ericsson-virtual2/hunter/2019-08-22_12-20-08/vmtp/vmtp.conf
https://artifacts.opnfv.org/logs/functest/ericsson-virtual2/hunter/2019-08-22_12-20-08/heat_ims
https://artifacts.opnfv.org/logs/functest/ericsson-virtual2/hunter/2019-08-22_12-20-08/heat_ims/ims_test_output.txt
https://artifacts.opnfv.org/logs/functest/ericsson-virtual2/hunter/2019-08-22_12-20-08/juju_epc
https://artifacts.opnfv.org/logs/functest/ericsson-virtual2/hunter/2019-08-22_12-20-08/juju_epc/clouds.yaml
https://artifacts.opnfv.org/logs/functest/ericsson-virtual2/hunter/2019-08-22_12-20-08/juju_epc/credentials.yaml
https://artifacts.opnfv.org/logs/functest/ericsson-virtual2/hunter/2019-08-22_12-20-08/functest.debug.log
https://artifacts.opnfv.org/logs/functest/ericsson-virtual2/hunter/2019-08-22_12-20-08/patrole
https://artifacts.opnfv.org/logs/functest/ericsson-virtual2/hunter/2019-08-22_12-20-08/patrole/test_list.txt
https://artifacts.opnfv.org/logs/functest/ericsson-virtual2/hunter/2019-08-22_12-20-08/patrole/tempest.debug.log
https://artifacts.opnfv.org/logs/functest/ericsson-virtual2/hunter/2019-08-22_12-20-08/patrole/test_raw_list.txt
https://artifacts.opnfv.org/logs/functest/ericsson-virtual2/hunter/2019-08-22_12-20-08/patrole/tempest.conf
https://artifacts.opnfv.org/logs/functest/ericsson-virtual2/hunter/2019-08-22_12-20-08/patrole/tempest-report.html
https://artifacts.opnfv.org/logs/functest/ericsson-virtual2/hunter/2019-08-22_12-20-08/patrole/tempest.log
https://artifacts.opnfv.org/logs/functest/ericsson-virtual2/hunter/2019-08-22_12-20-08/patrole/rally.log
https://artifacts.opnfv.org/logs/functest/ericsson-virtual2/hunter/2019-08-22_12-20-08/patrole/rally.conf
https://artifacts.opnfv.org/logs/functest/ericsson-virtual2/hunter/2019-08-22_12-20-08/patrole/tempest-report.xml
https://artifacts.opnfv.org/logs/functest/ericsson-virtual2/hunter/2019-08-22_12-20-08/barbican
https://artifacts.opnfv.org/logs/functest/ericsson-virtual2/hunter/2019-08-22_12-20-08/barbican/test_list.txt
https://artifacts.opnfv.org/logs/functest/ericsson-virtual2/hunter/2019-08-22_12-20-08/barbican/tempest.debug.log
https://artifacts.opnfv.org/logs/functest/ericsson-virtual2/hunter/2019-08-22_12-20-08/barbican/test_raw_list.txt
https://artifacts.opnfv.org/logs/functest/ericsson-virtual2/hunter/2019-08-22_12-20-08/barbican/tempest.conf
https://artifacts.opnfv.org/logs/functest/ericsson-virtual2/hunter/2019-08-22_12-20-08/barbican/tempest-report.html
https://artifacts.opnfv.org/logs/functest/ericsson-virtual2/hunter/2019-08-22_12-20-08/barbican/tempest.log
https://artifacts.opnfv.org/logs/functest/ericsson-virtual2/hunter/2019-08-22_12-20-08/barbican/rally.log
https://artifacts.opnfv.org/logs/functest/ericsson-virtual2/hunter/2019-08-22_12-20-08/barbican/rally.conf
https://artifacts.opnfv.org/logs/functest/ericsson-virtual2/hunter/2019-08-22_12-20-08/barbican/tempest-report.xml
https://artifacts.opnfv.org/logs/functest/ericsson-virtual2/hunter/2019-08-22_12-20-08/tempest_scenario
https://artifacts.opnfv.org/logs/functest/ericsson-virtual2/hunter/2019-08-22_12-20-08/tempest_scenario/test_list.txt
https://artifacts.opnfv.org/logs/functest/ericsson-virtual2/hunter/2019-08-22_12-20-08/tempest_scenario/tempest.debug.log
https://artifacts.opnfv.org/logs/functest/ericsson-virtual2/hunter/2019-08-22_12-20-08/tempest_scenario/test_raw_list.txt
https://artifacts.opnfv.org/logs/functest/ericsson-virtual2/hunter/2019-08-22_12-20-08/tempest_scenario/tempest.conf
https://artifacts.opnfv.org/logs/functest/ericsson-virtual2/hunter/2019-08-22_12-20-08/tempest_scenario/tempest-report.html
https://artifacts.opnfv.org/logs/functest/ericsson-virtual2/hunter/2019-08-22_12-20-08/tempest_scenario/tempest.log
https://artifacts.opnfv.org/logs/functest/ericsson-virtual2/hunter/2019-08-22_12-20-08/tempest_scenario/rally.log
https://artifacts.opnfv.org/logs/functest/ericsson-virtual2/hunter/2019-08-22_12-20-08/tempest_scenario/rally.conf
https://artifacts.opnfv.org/logs/functest/ericsson-virtual2/hunter/2019-08-22_12-20-08/tempest_scenario/tempest-report.xml
https://artifacts.opnfv.org/logs/functest/ericsson-virtual2/hunter/2019-08-22_12-20-08/tempest_full
https://artifacts.opnfv.org/logs/functest/ericsson-virtual2/hunter/2019-08-22_12-20-08/tempest_full/test_list.txt
https://artifacts.opnfv.org/logs/functest/ericsson-virtual2/hunter/2019-08-22_12-20-08/tempest_full/tempest.debug.log
https://artifacts.opnfv.org/logs/functest/ericsson-virtual2/hunter/2019-08-22_12-20-08/tempest_full/test_raw_list.txt
https://artifacts.opnfv.org/logs/functest/ericsson-virtual2/hunter/2019-08-22_12-20-08/tempest_full/tempest.conf
https://artifacts.opnfv.org/logs/functest/ericsson-virtual2/hunter/2019-08-22_12-20-08/tempest_full/tempest-report.html
https://artifacts.opnfv.org/logs/functest/ericsson-virtual2/hunter/2019-08-22_12-20-08/tempest_full/tempest.log
https://artifacts.opnfv.org/logs/functest/ericsson-virtual2/hunter/2019-08-22_12-20-08/tempest_full/rally.log
https://artifacts.opnfv.org/logs/functest/ericsson-virtual2/hunter/2019-08-22_12-20-08/tempest_full/rally.conf
https://artifacts.opnfv.org/logs/functest/ericsson-virtual2/hunter/2019-08-22_12-20-08/tempest_full/tempest-report.xml
https://artifacts.opnfv.org/logs/functest/ericsson-virtual2/hunter/2019-08-22_12-20-08/shaker
https://artifacts.opnfv.org/logs/functest/ericsson-virtual2/hunter/2019-08-22_12-20-08/neutron-tempest-plugin-api
https://artifacts.opnfv.org/logs/functest/ericsson-virtual2/hunter/2019-08-22_12-20-08/neutron-tempest-plugin-api/test_list.txt
https://artifacts.opnfv.org/logs/functest/ericsson-virtual2/hunter/2019-08-22_12-20-08/neutron-tempest-plugin-api/tempest.debug.log
https://artifacts.opnfv.org/logs/functest/ericsson-virtual2/hunter/2019-08-22_12-20-08/neutron-tempest-plugin-api/test_raw_list.txt
https://artifacts.opnfv.org/logs/functest/ericsson-virtual2/hunter/2019-08-22_12-20-08/neutron-tempest-plugin-api/tempest.conf
https://artifacts.opnfv.org/logs/functest/ericsson-virtual2/hunter/2019-08-22_12-20-08/neutron-tempest-plugin-api/tempest-report.html
https://artifacts.opnfv.org/logs/functest/ericsson-virtual2/hunter/2019-08-22_12-20-08/neutron-tempest-plugin-api/tempest.log
https://artifacts.opnfv.org/logs/functest/ericsson-virtual2/hunter/2019-08-22_12-20-08/neutron-tempest-plugin-api/rally.log
https://artifacts.opnfv.org/logs/functest/ericsson-virtual2/hunter/2019-08-22_12-20-08/neutron-tempest-plugin-api/rally.conf
https://artifacts.opnfv.org/logs/functest/ericsson-virtual2/hunter/2019-08-22_12-20-08/neutron-tempest-plugin-api/tempest-report.xml
https://artifacts.opnfv.org/logs/functest/ericsson-virtual2/hunter/2019-08-22_12-20-08/neutron_trunk
https://artifacts.opnfv.org/logs/functest/ericsson-virtual2/hunter/2019-08-22_12-20-08/neutron_trunk/test_list.txt
https://artifacts.opnfv.org/logs/functest/ericsson-virtual2/hunter/2019-08-22_12-20-08/neutron_trunk/tempest.debug.log
https://artifacts.opnfv.org/logs/functest/ericsson-virtual2/hunter/2019-08-22_12-20-08/neutron_trunk/test_raw_list.txt
https://artifacts.opnfv.org/logs/functest/ericsson-virtual2/hunter/2019-08-22_12-20-08/neutron_trunk/tempest.conf
https://artifacts.opnfv.org/logs/functest/ericsson-virtual2/hunter/2019-08-22_12-20-08/neutron_trunk/tempest-report.html
https://artifacts.opnfv.org/logs/functest/ericsson-virtual2/hunter/2019-08-22_12-20-08/neutron_trunk/tempest.log
https://artifacts.opnfv.org/logs/functest/ericsson-virtual2/hunter/2019-08-22_12-20-08/neutron_trunk/rally.log
https://artifacts.opnfv.org/logs/functest/ericsson-virtual2/hunter/2019-08-22_12-20-08/neutron_trunk/rally.conf
https://artifacts.opnfv.org/logs/functest/ericsson-virtual2/hunter/2019-08-22_12-20-08/neutron_trunk/tempest-report.xml
https://artifacts.opnfv.org/logs/functest/ericsson-virtual2/hunter/2019-08-22_12-20-08/return_value
https://artifacts.opnfv.org/logs/functest/ericsson-virtual2/hunter/2019-08-22_12-20-08/odl
https://artifacts.opnfv.org/logs/functest/ericsson-virtual2/hunter/2019-08-22_12-20-08/odl/output.xml
https://artifacts.opnfv.org/logs/functest/ericsson-virtual2/hunter/2019-08-22_12-20-08/odl/report.html
https://artifacts.opnfv.org/logs/functest/ericsson-virtual2/hunter/2019-08-22_12-20-08/odl/xunit.xml
https://artifacts.opnfv.org/logs/functest/ericsson-virtual2/hunter/2019-08-22_12-20-08/odl/log.html
https://artifacts.opnfv.org/logs/functest/ericsson-virtual2/hunter/2019-08-22_12-20-08/rally_sanity
https://artifacts.opnfv.org/logs/functest/ericsson-virtual2/hunter/2019-08-22_12-20-08/rally_sanity/gnocchi.json
https://artifacts.opnfv.org/logs/functest/ericsson-virtual2/hunter/2019-08-22_12-20-08/rally_sanity/keystone.json
https://artifacts.opnfv.org/logs/functest/ericsson-virtual2/hunter/2019-08-22_12-20-08/rally_sanity/glance.json
https://artifacts.opnfv.org/logs/functest/ericsson-virtual2/hunter/2019-08-22_12-20-08/rally_sanity/rally_sanity.xml
https://artifacts.opnfv.org/logs/functest/ericsson-virtual2/hunter/2019-08-22_12-20-08/rally_sanity/rally_sanity.html
https://artifacts.opnfv.org/logs/functest/ericsson-virtual2/hunter/2019-08-22_12-20-08/rally_sanity/quotas.json
https://artifacts.opnfv.org/logs/functest/ericsson-virtual2/hunter/2019-08-22_12-20-08/rally_sanity/neutron.json
https://artifacts.opnfv.org/logs/functest/ericsson-virtual2/hunter/2019-08-22_12-20-08/rally_sanity/heat.json
https://artifacts.opnfv.org/logs/functest/ericsson-virtual2/hunter/2019-08-22_12-20-08/rally_sanity/nova.json
https://artifacts.opnfv.org/logs/functest/ericsson-virtual2/hunter/2019-08-22_12-20-08/rally_sanity/authenticate.json
https://artifacts.opnfv.org/logs/functest/ericsson-virtual2/hunter/2019-08-22_12-20-08/rally_sanity/cinder.json
https://artifacts.opnfv.org/logs/functest/ericsson-virtual2/hunter/2019-08-22_12-20-08/rally_sanity/rally.log
[functest-fuel-virtual-daily-hunter] $ /bin/bash /tmp/jenkins250738662497912888.sh
Build step 'Execute shell' marked build as failure
New run name is '635 Suite: daily Scenario: os-odl-ovs-noha'
Email was triggered for: Failure - Any
Sending email for trigger: Failure - Any
Request made to compress build log
Sending email to: tbramwell@linuxfoundation.org agardner@linuxfoundation.org rgrigar@linuxfoundation.org
Finished: FAILURE