FailedConsole Output

Started by upstream project "fuel-os-odl-ovs-noha-virtual-daily-hunter" build number 117
originally caused by:
 Started by timer
Running as SYSTEM
[EnvInject] - Loading node environment variables.
Building remotely on ericsson-virtual2 (fuel-virtual ci-resource opnfv-sysinfo) in workspace /home/jenkins/opnfv/slave_root/workspace/functest-fuel-virtual-daily-hunter
using credential d42411ac011ad6f3dd2e1fa34eaa5d87f910eb2e
Wiping out workspace first.
Cloning the remote Git repository
Cloning repository https://gerrit.opnfv.org/gerrit/functest
 > git init /home/jenkins/opnfv/slave_root/workspace/functest-fuel-virtual-daily-hunter # timeout=10
Fetching upstream changes from https://gerrit.opnfv.org/gerrit/functest
 > git --version # timeout=10
using GIT_SSH to set credentials Jenkins Master SSH
 > git fetch --tags --progress https://gerrit.opnfv.org/gerrit/functest +refs/heads/*:refs/remotes/origin/* # timeout=15
 > git config remote.origin.url https://gerrit.opnfv.org/gerrit/functest # timeout=10
 > git config --add remote.origin.fetch +refs/heads/*:refs/remotes/origin/* # timeout=10
 > git config remote.origin.url https://gerrit.opnfv.org/gerrit/functest # timeout=10
Fetching upstream changes from https://gerrit.opnfv.org/gerrit/functest
using GIT_SSH to set credentials Jenkins Master SSH
 > git fetch --tags --progress https://gerrit.opnfv.org/gerrit/functest +refs/heads/*:refs/remotes/origin/* # timeout=15
 > git rev-parse refs/remotes/origin/stable/hunter^{commit} # timeout=10
 > git rev-parse refs/remotes/origin/origin/stable/hunter^{commit} # timeout=10
Checking out Revision f8800b23d406c8acad7acc62035d5425d7358338 (refs/remotes/origin/stable/hunter)
 > git config core.sparsecheckout # timeout=10
 > git checkout -f f8800b23d406c8acad7acc62035d5425d7358338 # timeout=15
Commit message: "Clean orphan security groups"
 > git rev-list --no-walk f8800b23d406c8acad7acc62035d5425d7358338 # timeout=10
Run condition [Regular expression match] enabling prebuild for step [Execute shell]
Run condition [Regular expression match] enabling prebuild for step [Execute shell]
No emails were triggered.
New run name is '630 Suite: daily Scenario: os-odl-ovs-noha'
[description-setter] Description set: Built on ericsson-virtual2
[functest-fuel-virtual-daily-hunter] $ /bin/bash /tmp/jenkins4487822046305517442.sh
Cleaning up docker containers/images...
Regular expression run condition: Expression=[os-.*], Label=[os-odl-ovs-noha]
Run condition [Regular expression match] enabling perform for step [Execute shell]
[functest-fuel-virtual-daily-hunter] $ /usr/bin/env bash /tmp/jenkins7007036929558747298.sh
Map mcp ssh_key
<13>Aug 21 10:32:19 fetch_os_creds.info: Fetching rc file...
<13>Aug 21 10:32:19 fetch_os_creds.info: Verifying connectivity to 10.20.0.2...
<13>Aug 21 10:32:19 fetch_os_creds.info: 10.20.0.2 is reachable!
<13>Aug 21 10:32:20 fetch_os_creds.info: ... from controller 172.16.10.36 ...
Warning: Permanently added '172.16.10.36' (ECDSA) to the list of known hosts.
-------- Credentials: --------

export OS_IDENTITY_API_VERSION=3
export OS_PROJECT_DOMAIN_NAME=Default
export OS_USER_DOMAIN_NAME=Default
export OS_PROJECT_NAME=admin
export OS_TENANT_NAME=admin
export OS_USERNAME=admin
export OS_PASSWORD=opnfv_secret
export OS_REGION_NAME=RegionOne
export OS_INTERFACE=internal
export OS_ENDPOINT_TYPE="internal"
export OS_CACERT="/etc/ssl/certs/ca-certificates.crt"
export SDN_CONTROLLER_USER=admin
export SDN_CONTROLLER_RESTCONFPORT=8282
export SDN_CONTROLLER_PASSWORD=admin
export SDN_CONTROLLER_WEBPORT=8282
export SDN_CONTROLLER_IP=10.16.0.107
export VOLUME_DEVICE_NAME=sdc
export OS_AUTH_URL=http://172.16.10.36:35357/v3
Functest: Start Docker and prepare environment
Functest: Download images that will be used by test cases
+ wget_opts='-N --tries=1 --connect-timeout=30'
+ '[' -t 1 ']'
+ wget_opts='-N --tries=1 --connect-timeout=30 --progress=dot:giga'
+ cat
+ wget -N --tries=1 --connect-timeout=30 --progress=dot:giga -i - -P /home/jenkins/opnfv/functest/images
--2019-08-21 10:32:20--  http://download.cirros-cloud.net/0.4.0/cirros-0.4.0-x86_64-disk.img
Resolving download.cirros-cloud.net (download.cirros-cloud.net)... 64.90.42.85, 2607:f298:6:a036::bd6:a72a
Connecting to download.cirros-cloud.net (download.cirros-cloud.net)|64.90.42.85|:80... connected.
HTTP request sent, awaiting response... 304 Not Modified
File ‘/home/jenkins/opnfv/functest/images/cirros-0.4.0-x86_64-disk.img’ not modified on server. Omitting download.

--2019-08-21 10:32:20--  https://cloud-images.ubuntu.com/releases/14.04/release/ubuntu-14.04-server-cloudimg-amd64-disk1.img
Resolving cloud-images.ubuntu.com (cloud-images.ubuntu.com)... 91.189.88.89, 2001:67c:1560:8001::8001
Connecting to cloud-images.ubuntu.com (cloud-images.ubuntu.com)|91.189.88.89|:443... connected.
HTTP request sent, awaiting response... 302 Found
Location: https://cloud-images.ubuntu.com/releases/trusty/release/ubuntu-14.04-server-cloudimg-amd64-disk1.img [following]
--2019-08-21 10:32:21--  https://cloud-images.ubuntu.com/releases/trusty/release/ubuntu-14.04-server-cloudimg-amd64-disk1.img
Reusing existing connection to cloud-images.ubuntu.com:443.
HTTP request sent, awaiting response... 304 Not Modified
File ‘/home/jenkins/opnfv/functest/images/ubuntu-14.04-server-cloudimg-amd64-disk1.img’ not modified on server. Omitting download.

--2019-08-21 10:32:21--  https://cloud-images.ubuntu.com/releases/16.04/release/ubuntu-16.04-server-cloudimg-amd64-disk1.img
Reusing existing connection to cloud-images.ubuntu.com:443.
HTTP request sent, awaiting response... 302 Found
Location: https://cloud-images.ubuntu.com/releases/xenial/release/ubuntu-16.04-server-cloudimg-amd64-disk1.img [following]
--2019-08-21 10:32:21--  https://cloud-images.ubuntu.com/releases/xenial/release/ubuntu-16.04-server-cloudimg-amd64-disk1.img
Reusing existing connection to cloud-images.ubuntu.com:443.
HTTP request sent, awaiting response... 304 Not Modified
File ‘/home/jenkins/opnfv/functest/images/ubuntu-16.04-server-cloudimg-amd64-disk1.img’ not modified on server. Omitting download.

--2019-08-21 10:32:21--  http://download.cirros-cloud.net/0.4.0/cirros-0.4.0-aarch64-disk.img
Connecting to download.cirros-cloud.net (download.cirros-cloud.net)|64.90.42.85|:80... connected.
HTTP request sent, awaiting response... 304 Not Modified
File ‘/home/jenkins/opnfv/functest/images/cirros-0.4.0-aarch64-disk.img’ not modified on server. Omitting download.

--2019-08-21 10:32:21--  https://cloud-images.ubuntu.com/releases/14.04/release/ubuntu-14.04-server-cloudimg-arm64-uefi1.img
Connecting to cloud-images.ubuntu.com (cloud-images.ubuntu.com)|91.189.88.89|:443... connected.
HTTP request sent, awaiting response... 302 Found
Location: https://cloud-images.ubuntu.com/releases/trusty/release/ubuntu-14.04-server-cloudimg-arm64-uefi1.img [following]
--2019-08-21 10:32:21--  https://cloud-images.ubuntu.com/releases/trusty/release/ubuntu-14.04-server-cloudimg-arm64-uefi1.img
Reusing existing connection to cloud-images.ubuntu.com:443.
HTTP request sent, awaiting response... 304 Not Modified
File ‘/home/jenkins/opnfv/functest/images/ubuntu-14.04-server-cloudimg-arm64-uefi1.img’ not modified on server. Omitting download.

--2019-08-21 10:32:21--  http://repository.cloudifysource.org/cloudify/19.01.24/community-release/cloudify-docker-manager-community-19.01.24.tar
Resolving repository.cloudifysource.org (repository.cloudifysource.org)... 13.35.87.3, 13.35.87.120, 13.35.87.74, ...
Connecting to repository.cloudifysource.org (repository.cloudifysource.org)|13.35.87.3|:80... connected.
HTTP request sent, awaiting response... 304 Not Modified
File ‘/home/jenkins/opnfv/functest/images/cloudify-docker-manager-community-19.01.24.tar’ not modified on server. Omitting download.

--2019-08-21 10:32:22--  http://testresults.opnfv.org/functest/vyos-1.1.8-amd64.qcow2
Resolving testresults.opnfv.org (testresults.opnfv.org)... 104.154.71.112
Connecting to testresults.opnfv.org (testresults.opnfv.org)|104.154.71.112|:80... connected.
HTTP request sent, awaiting response... 304 Not Modified
File ‘/home/jenkins/opnfv/functest/images/vyos-1.1.8-amd64.qcow2’ not modified on server. Omitting download.

--2019-08-21 10:32:22--  http://testresults.opnfv.org/functest/shaker-image.qcow2
Reusing existing connection to testresults.opnfv.org:80.
HTTP request sent, awaiting response... 304 Not Modified
File ‘/home/jenkins/opnfv/functest/images/shaker-image.qcow2’ not modified on server. Omitting download.

--2019-08-21 10:32:22--  http://testresults.opnfv.org/functest/shaker-image-arm64.qcow2
Reusing existing connection to testresults.opnfv.org:80.
HTTP request sent, awaiting response... 304 Not Modified
File ‘/home/jenkins/opnfv/functest/images/shaker-image-arm64.qcow2’ not modified on server. Omitting download.

Warning: Permanently added '10.20.0.2' (ECDSA) to the list of known hosts.
tempest_conf.yaml:
---
compute-feature-enabled:
    shelve: false
    vnc_console: false
    spice_console: true
identity-feature-enabled:
    api_v2: false
    api_v2_admin: false
image-feature-enabled:
    api_v2: true
    api_v1: false
volume:
    storage_protocol: iSCSI
volume-feature-enabled:
    backup: false
compute:
    max_microversion: 2.65
Functest: Pulling Functest Docker image opnfv/functest-healthcheck:hunter ...
Running Functest tier 'healthcheck'. CMD: docker run --rm  -e INSTALLER_TYPE=fuel -e INSTALLER_IP=10.20.0.2     -e NODE_NAME=ericsson-virtual2 -e DEPLOY_SCENARIO=os-odl-ovs-noha     -e BUILD_TAG=jenkins-functest-fuel-virtual-daily-hunter-630 -e DEPLOY_TYPE=virt -e CI_LOOP=daily     -e TEST_DB_URL=http://testresults.opnfv.org/test/api/v1/results -e ENERGY_RECORDER_API_URL=http://energy.opnfv.fr/resources     -e DEBUG=true -e POD_ARCH=x86_64 -e BLOCK_MIGRATION=false -e SDN_CONTROLLER_RESTCONFPORT=8080 -e IMAGE_PROPERTIES=hw_disk_bus:scsi,hw_scsi_model:virtio-scsi,hw_mem_page_size:large -e FLAVOR_EXTRA_SPECS=hw:mem_page_size:large -v /home/jenkins/opnfv/functest/images:/home/opnfv/functest/images -v /home/jenkins/opnfv/functest/results/hunter:/home/opnfv/functest/results -v /var/lib/opnfv/mcp.rsa:/root/.ssh/id_rsa       -v /home/jenkins/opnfv-openrc.sh:/home/opnfv/functest/conf/env_file      -v /tmp/tmp.tzsOFUXpLd:/usr/lib/python2.7/site-packages/functest/opnfv_tests/openstack/tempest/custom_tests/tempest_conf.yaml  opnfv/functest-healthcheck:hunter /bin/bash -c 'run_tests -r -t all'
2019-08-21 08:32:40,349 - xtesting.ci.run_tests - INFO - Deployment description:

+--------------------------------------+----------------------------------------------------------+
|               ENV VAR                |                          VALUE                           |
+--------------------------------------+----------------------------------------------------------+
|              BUILD_TAG               |      jenkins-functest-fuel-virtual-daily-hunter-630      |
|             TEST_DB_URL              |     http://testresults.opnfv.org/test/api/v1/results     |
|     ENERGY_RECORDER_API_PASSWORD     |                                                          |
|               CI_LOOP                |                          daily                           |
|                DEBUG                 |                           true                           |
|            INSTALLER_TYPE            |                           fuel                           |
|       ENERGY_RECORDER_API_URL        |             http://energy.opnfv.fr/resources             |
|           DEPLOY_SCENARIO            |                     os-odl-ovs-noha                      |
|       ENERGY_RECORDER_API_USER       |                                                          |
|              NODE_NAME               |                    ericsson-virtual2                     |
+--------------------------------------+----------------------------------------------------------+

2019-08-21 08:32:40,354 - xtesting.ci.run_tests - INFO - Sourcing env file /var/lib/xtesting/conf/env_file


export OS_IDENTITY_API_VERSION=3
export OS_PROJECT_DOMAIN_NAME=Default
export OS_USER_DOMAIN_NAME=Default
export OS_PROJECT_NAME=admin
export OS_TENANT_NAME=admin
export OS_USERNAME=admin
export OS_PASSWORD=opnfv_secret
export OS_REGION_NAME=RegionOne
export OS_INTERFACE=internal
export OS_ENDPOINT_TYPE="internal"
export OS_CACERT="/etc/ssl/certs/ca-certificates.crt"
export SDN_CONTROLLER_USER=admin
export SDN_CONTROLLER_RESTCONFPORT=8282
export SDN_CONTROLLER_PASSWORD=admin
export SDN_CONTROLLER_WEBPORT=8282
export SDN_CONTROLLER_IP=10.16.0.107
export VOLUME_DEVICE_NAME=sdc
export OS_AUTH_URL=http://172.16.10.36:35357/v3

2019-08-21 08:32:40,355 - xtesting.ci.run_tests - INFO - TESTS TO BE EXECUTED:

+---------------------+---------------+-------------------------------------------------+------------------------------------------+
|        TIERS        |     ORDER     |                   DESCRIPTION                   |                TESTCASES                 |
+---------------------+---------------+-------------------------------------------------+------------------------------------------+
|     healthcheck     |       0       |     First tier to be executed to verify the     |     connection_check tenantnetwork1      |
|                     |               |           basic operations in the VIM.          |     tenantnetwork2 vmready1 vmready2     |
|                     |               |                                                 |      singlevm1 singlevm2 vping_ssh       |
|                     |               |                                                 |      vping_userdata cinder_test odl      |
|                     |               |                                                 |              tempest_smoke               |
+---------------------+---------------+-------------------------------------------------+------------------------------------------+

2019-08-21 08:32:40,386 - xtesting.ci.run_tests - INFO - Loading test case 'connection_check'...
2019-08-21 08:32:40,690 - xtesting.ci.run_tests - INFO - Running test case 'connection_check'...
2019-08-21 08:32:44,074 - xtesting.core.testcase - INFO - The results were successfully pushed to DB
2019-08-21 08:32:44,074 - xtesting.ci.run_tests - INFO - Test result:

+--------------------------+------------------+------------------+----------------+
|        TEST CASE         |     PROJECT      |     DURATION     |     RESULT     |
+--------------------------+------------------+------------------+----------------+
|     connection_check     |     functest     |      00:03       |      PASS      |
+--------------------------+------------------+------------------+----------------+

2019-08-21 08:32:44,107 - xtesting.ci.run_tests - INFO - Loading test case 'tenantnetwork1'...
2019-08-21 08:32:45,453 - xtesting.ci.run_tests - INFO - Running test case 'tenantnetwork1'...
2019-08-21 08:32:50,602 - xtesting.core.testcase - INFO - The results were successfully pushed to DB
2019-08-21 08:32:50,602 - xtesting.ci.run_tests - INFO - Test result:

+------------------------+------------------+------------------+----------------+
|       TEST CASE        |     PROJECT      |     DURATION     |     RESULT     |
+------------------------+------------------+------------------+----------------+
|     tenantnetwork1     |     functest     |      00:05       |      PASS      |
+------------------------+------------------+------------------+----------------+

2019-08-21 08:32:58,326 - xtesting.ci.run_tests - INFO - Loading test case 'tenantnetwork2'...
2019-08-21 08:33:00,203 - xtesting.ci.run_tests - INFO - Running test case 'tenantnetwork2'...
2019-08-21 08:33:06,418 - xtesting.core.testcase - INFO - The results were successfully pushed to DB
2019-08-21 08:33:06,419 - xtesting.ci.run_tests - INFO - Test result:

+------------------------+------------------+------------------+----------------+
|       TEST CASE        |     PROJECT      |     DURATION     |     RESULT     |
+------------------------+------------------+------------------+----------------+
|     tenantnetwork2     |     functest     |      00:06       |      PASS      |
+------------------------+------------------+------------------+----------------+

2019-08-21 08:33:15,164 - xtesting.ci.run_tests - INFO - Loading test case 'vmready1'...
2019-08-21 08:33:16,020 - xtesting.ci.run_tests - INFO - Running test case 'vmready1'...
2019-08-21 08:33:23,751 - xtesting.core.testcase - INFO - The results were successfully pushed to DB
2019-08-21 08:33:23,751 - xtesting.ci.run_tests - INFO - Test result:

+-------------------+------------------+------------------+----------------+
|     TEST CASE     |     PROJECT      |     DURATION     |     RESULT     |
+-------------------+------------------+------------------+----------------+
|      vmready1     |     functest     |      00:07       |      PASS      |
+-------------------+------------------+------------------+----------------+

2019-08-21 08:33:31,823 - xtesting.ci.run_tests - INFO - Loading test case 'vmready2'...
2019-08-21 08:33:33,597 - xtesting.ci.run_tests - INFO - Running test case 'vmready2'...
2019-08-21 08:33:40,724 - xtesting.core.testcase - INFO - The results were successfully pushed to DB
2019-08-21 08:33:40,724 - xtesting.ci.run_tests - INFO - Test result:

+-------------------+------------------+------------------+----------------+
|     TEST CASE     |     PROJECT      |     DURATION     |     RESULT     |
+-------------------+------------------+------------------+----------------+
|      vmready2     |     functest     |      00:07       |      PASS      |
+-------------------+------------------+------------------+----------------+

2019-08-21 08:33:49,937 - xtesting.ci.run_tests - INFO - Loading test case 'singlevm1'...
2019-08-21 08:33:50,700 - xtesting.ci.run_tests - INFO - Running test case 'singlevm1'...
2019-08-21 08:34:32,123 - xtesting.core.testcase - INFO - The results were successfully pushed to DB
2019-08-21 08:34:32,123 - xtesting.ci.run_tests - INFO - Test result:

+-------------------+------------------+------------------+----------------+
|     TEST CASE     |     PROJECT      |     DURATION     |     RESULT     |
+-------------------+------------------+------------------+----------------+
|     singlevm1     |     functest     |      00:41       |      PASS      |
+-------------------+------------------+------------------+----------------+

2019-08-21 08:34:45,014 - xtesting.ci.run_tests - INFO - Loading test case 'singlevm2'...
2019-08-21 08:34:46,669 - xtesting.ci.run_tests - INFO - Running test case 'singlevm2'...
2019-08-21 08:35:18,937 - xtesting.core.testcase - INFO - The results were successfully pushed to DB
2019-08-21 08:35:18,938 - xtesting.ci.run_tests - INFO - Test result:

+-------------------+------------------+------------------+----------------+
|     TEST CASE     |     PROJECT      |     DURATION     |     RESULT     |
+-------------------+------------------+------------------+----------------+
|     singlevm2     |     functest     |      00:32       |      PASS      |
+-------------------+------------------+------------------+----------------+

2019-08-21 08:35:31,778 - xtesting.ci.run_tests - INFO - Loading test case 'vping_ssh'...
2019-08-21 08:35:33,535 - xtesting.ci.run_tests - INFO - Running test case 'vping_ssh'...
2019-08-21 08:36:14,983 - xtesting.core.testcase - INFO - The results were successfully pushed to DB
2019-08-21 08:36:14,983 - xtesting.ci.run_tests - INFO - Test result:

+-------------------+------------------+------------------+----------------+
|     TEST CASE     |     PROJECT      |     DURATION     |     RESULT     |
+-------------------+------------------+------------------+----------------+
|     vping_ssh     |     functest     |      00:41       |      PASS      |
+-------------------+------------------+------------------+----------------+

2019-08-21 08:36:30,728 - xtesting.ci.run_tests - INFO - Loading test case 'vping_userdata'...
2019-08-21 08:36:32,580 - xtesting.ci.run_tests - INFO - Running test case 'vping_userdata'...
2019-08-21 08:37:10,223 - xtesting.core.testcase - INFO - The results were successfully pushed to DB
2019-08-21 08:37:10,223 - xtesting.ci.run_tests - INFO - Test result:

+------------------------+------------------+------------------+----------------+
|       TEST CASE        |     PROJECT      |     DURATION     |     RESULT     |
+------------------------+------------------+------------------+----------------+
|     vping_userdata     |     functest     |      00:37       |      PASS      |
+------------------------+------------------+------------------+----------------+

2019-08-21 08:37:24,303 - xtesting.ci.run_tests - INFO - Loading test case 'cinder_test'...
2019-08-21 08:37:26,143 - xtesting.ci.run_tests - INFO - Running test case 'cinder_test'...
2019-08-21 08:39:03,851 - xtesting.core.testcase - INFO - The results were successfully pushed to DB
2019-08-21 08:39:03,851 - xtesting.ci.run_tests - INFO - Test result:

+---------------------+------------------+------------------+----------------+
|      TEST CASE      |     PROJECT      |     DURATION     |     RESULT     |
+---------------------+------------------+------------------+----------------+
|     cinder_test     |     functest     |      01:37       |      PASS      |
+---------------------+------------------+------------------+----------------+

2019-08-21 08:39:23,119 - xtesting.ci.run_tests - INFO - Loading test case 'odl'...
2019-08-21 08:39:23,332 - xtesting.ci.run_tests - INFO - Running test case 'odl'...
[ WARN ] Deprecation Warning: Use Post Request in the future
2019-08-21 08:39:42,513 - xtesting.core.robotframework - INFO - 
==============================================================================
Basic & Neutron                                                               
==============================================================================
Basic & Neutron.Basic                                                         
==============================================================================
Basic & Neutron.Basic.Restconf Modules :: Test suite to verify Restconf is OK.
==============================================================================
Get Controller Modules :: Get the restconf modules, check 200 stat... | PASS |
------------------------------------------------------------------------------
Basic & Neutron.Basic.Restconf Modules :: Test suite to verify Res... | PASS |
1 critical test, 1 passed, 0 failed
1 test total, 1 passed, 0 failed
==============================================================================
Basic & Neutron.Basic                                                 | PASS |
1 critical test, 1 passed, 0 failed
1 test total, 1 passed, 0 failed
==============================================================================
Basic & Neutron.Neutron :: Test suite for Neutron Plugin                      
==============================================================================
Basic & Neutron.Neutron.Reachability                                          
==============================================================================
Get the complete list of networks :: Get the complete list of netw... | PASS |
------------------------------------------------------------------------------
Get the complete list of subnets :: Get the complete list of subnets  | PASS |
------------------------------------------------------------------------------
Get the complete list of ports :: Get the complete list of ports      | PASS |
------------------------------------------------------------------------------
Basic & Neutron.Neutron.Reachability                                  | PASS |
3 critical tests, 3 passed, 0 failed
3 tests total, 3 passed, 0 failed
==============================================================================
Basic & Neutron.Neutron.Networks :: Checking Network created in OpenStack a...
==============================================================================
Check OpenStack Networks :: Checking OpenStack Neutron for known n... | PASS |
------------------------------------------------------------------------------
Check OpenDaylight Networks :: Checking OpenDaylight Neutron API f... | PASS |
------------------------------------------------------------------------------
Create Network :: Create new network in OpenStack                     | PASS |
------------------------------------------------------------------------------
Check Network :: Check network created in OpenDaylight                | PASS |
------------------------------------------------------------------------------
Basic & Neutron.Neutron.Networks :: Checking Network created in Op... | PASS |
4 critical tests, 4 passed, 0 failed
4 tests total, 4 passed, 0 failed
==============================================================================
Basic & Neutron.Neutron.Subnets :: Checking Subnets created in OpenStack ar...
==============================================================================
Check OpenStack Subnets :: Checking OpenStack Neutron for known su... | PASS |
------------------------------------------------------------------------------
Check OpenDaylight subnets :: Checking OpenDaylight Neutron API fo... | PASS |
------------------------------------------------------------------------------
Create New subnet :: Create new subnet in OpenStack                   | PASS |
------------------------------------------------------------------------------
Check New subnet :: Check new subnet created in OpenDaylight          | PASS |
------------------------------------------------------------------------------
Basic & Neutron.Neutron.Subnets :: Checking Subnets created in Ope... | PASS |
4 critical tests, 4 passed, 0 failed
4 tests total, 4 passed, 0 failed
==============================================================================
Basic & Neutron.Neutron.Ports :: Checking Port created in OpenStack are pus...
==============================================================================
Check OpenStack ports :: Checking OpenStack Neutron for known ports   | PASS |
------------------------------------------------------------------------------
Check OpenDaylight ports :: Checking OpenDaylight Neutron API for ... | PASS |
------------------------------------------------------------------------------
Create New Port :: Create new port in OpenStack                       | PASS |
------------------------------------------------------------------------------
Check New Port :: Check new port created in OpenDaylight              | PASS |
------------------------------------------------------------------------------
Basic & Neutron.Neutron.Ports :: Checking Port created in OpenStac... | PASS |
4 critical tests, 4 passed, 0 failed
4 tests total, 4 passed, 0 failed
==============================================================================
Basic & Neutron.Neutron.Delete Ports :: Checking Port deleted in OpenStack ...
==============================================================================
Delete New Port :: Delete previously created port in OpenStack        | PASS |
------------------------------------------------------------------------------
Check Port Deleted :: Check port deleted in OpenDaylight              | PASS |
------------------------------------------------------------------------------
Basic & Neutron.Neutron.Delete Ports :: Checking Port deleted in O... | PASS |
2 critical tests, 2 passed, 0 failed
2 tests total, 2 passed, 0 failed
==============================================================================
Basic & Neutron.Neutron.Delete Subnets :: Checking Subnets deleted in OpenS...
==============================================================================
Delete New subnet :: Delete previously created subnet in OpenStack    | PASS |
------------------------------------------------------------------------------
Check New subnet deleted :: Check subnet deleted in OpenDaylight      | PASS |
------------------------------------------------------------------------------
Basic & Neutron.Neutron.Delete Subnets :: Checking Subnets deleted... | PASS |
2 critical tests, 2 passed, 0 failed
2 tests total, 2 passed, 0 failed
==============================================================================
Basic & Neutron.Neutron.Delete Networks :: Checking Network deleted in Open...
==============================================================================
Delete Network :: Delete network in OpenStack                         | PASS |
------------------------------------------------------------------------------
Check Network deleted :: Check network deleted in OpenDaylight        | PASS |
------------------------------------------------------------------------------
Basic & Neutron.Neutron.Delete Networks :: Checking Network delete... | PASS |
2 critical tests, 2 passed, 0 failed
2 tests total, 2 passed, 0 failed
==============================================================================
Basic & Neutron.Neutron :: Test suite for Neutron Plugin              | PASS |
21 critical tests, 21 passed, 0 failed
21 tests total, 21 passed, 0 failed
==============================================================================
Basic & Neutron                                                       | PASS |
22 critical tests, 22 passed, 0 failed
22 tests total, 22 passed, 0 failed
==============================================================================
Output:  /home/opnfv/functest/results/odl/output.xml

2019-08-21 08:39:42,538 - xtesting.core.robotframework - INFO - Results were successfully parsed
2019-08-21 08:39:42,670 - xtesting.core.robotframework - INFO - Results were successfully generated
2019-08-21 08:39:42,948 - xtesting.core.testcase - INFO - The results were successfully pushed to DB
2019-08-21 08:39:42,949 - xtesting.ci.run_tests - INFO - Test result:

+-------------------+------------------+------------------+----------------+
|     TEST CASE     |     PROJECT      |     DURATION     |     RESULT     |
+-------------------+------------------+------------------+----------------+
|        odl        |     functest     |      00:19       |      PASS      |
+-------------------+------------------+------------------+----------------+

2019-08-21 08:39:42,981 - xtesting.ci.run_tests - INFO - Loading test case 'tempest_smoke'...
2019-08-21 08:39:46,032 - xtesting.ci.run_tests - INFO - Running test case 'tempest_smoke'...
2019-08-21 08:44:20,468 - xtesting.core.testcase - INFO - The results were successfully pushed to DB
2019-08-21 08:44:20,468 - xtesting.ci.run_tests - INFO - Test result:

+-----------------------+------------------+------------------+----------------+
|       TEST CASE       |     PROJECT      |     DURATION     |     RESULT     |
+-----------------------+------------------+------------------+----------------+
|     tempest_smoke     |     functest     |      04:34       |      PASS      |
+-----------------------+------------------+------------------+----------------+

2019-08-21 08:44:29,393 - xtesting.ci.run_tests - INFO - Xtesting report:

+--------------------------+------------------+---------------------+------------------+----------------+
|        TEST CASE         |     PROJECT      |         TIER        |     DURATION     |     RESULT     |
+--------------------------+------------------+---------------------+------------------+----------------+
|     connection_check     |     functest     |     healthcheck     |      00:03       |      PASS      |
|      tenantnetwork1      |     functest     |     healthcheck     |      00:05       |      PASS      |
|      tenantnetwork2      |     functest     |     healthcheck     |      00:06       |      PASS      |
|         vmready1         |     functest     |     healthcheck     |      00:07       |      PASS      |
|         vmready2         |     functest     |     healthcheck     |      00:07       |      PASS      |
|        singlevm1         |     functest     |     healthcheck     |      00:41       |      PASS      |
|        singlevm2         |     functest     |     healthcheck     |      00:32       |      PASS      |
|        vping_ssh         |     functest     |     healthcheck     |      00:41       |      PASS      |
|      vping_userdata      |     functest     |     healthcheck     |      00:37       |      PASS      |
|       cinder_test        |     functest     |     healthcheck     |      01:37       |      PASS      |
|           odl            |     functest     |     healthcheck     |      00:19       |      PASS      |
|      tempest_smoke       |     functest     |     healthcheck     |      04:34       |      PASS      |
+--------------------------+------------------+---------------------+------------------+----------------+

2019-08-21 08:44:29,401 - xtesting.ci.run_tests - INFO - Execution exit value: Result.EX_OK
Functest: Pulling Functest Docker image opnfv/functest-smoke:hunter ...
Running Functest tier 'smoke'. CMD: docker run --rm  -e INSTALLER_TYPE=fuel -e INSTALLER_IP=10.20.0.2     -e NODE_NAME=ericsson-virtual2 -e DEPLOY_SCENARIO=os-odl-ovs-noha     -e BUILD_TAG=jenkins-functest-fuel-virtual-daily-hunter-630 -e DEPLOY_TYPE=virt -e CI_LOOP=daily     -e TEST_DB_URL=http://testresults.opnfv.org/test/api/v1/results -e ENERGY_RECORDER_API_URL=http://energy.opnfv.fr/resources     -e DEBUG=true -e POD_ARCH=x86_64 -e BLOCK_MIGRATION=false -e SDN_CONTROLLER_RESTCONFPORT=8080 -e IMAGE_PROPERTIES=hw_disk_bus:scsi,hw_scsi_model:virtio-scsi,hw_mem_page_size:large -e FLAVOR_EXTRA_SPECS=hw:mem_page_size:large -v /home/jenkins/opnfv/functest/images:/home/opnfv/functest/images -v /home/jenkins/opnfv/functest/results/hunter:/home/opnfv/functest/results -v /var/lib/opnfv/mcp.rsa:/root/.ssh/id_rsa       -v /home/jenkins/opnfv-openrc.sh:/home/opnfv/functest/conf/env_file      -v /tmp/tmp.tzsOFUXpLd:/usr/lib/python2.7/site-packages/functest/opnfv_tests/openstack/tempest/custom_tests/tempest_conf.yaml  opnfv/functest-smoke:hunter /bin/bash -c 'run_tests -r -t all'
2019-08-21 08:44:41,574 - xtesting.ci.run_tests - INFO - Deployment description:

+--------------------------------------+----------------------------------------------------------+
|               ENV VAR                |                          VALUE                           |
+--------------------------------------+----------------------------------------------------------+
|              BUILD_TAG               |      jenkins-functest-fuel-virtual-daily-hunter-630      |
|             TEST_DB_URL              |     http://testresults.opnfv.org/test/api/v1/results     |
|     ENERGY_RECORDER_API_PASSWORD     |                                                          |
|               CI_LOOP                |                          daily                           |
|                DEBUG                 |                           true                           |
|            INSTALLER_TYPE            |                           fuel                           |
|       ENERGY_RECORDER_API_URL        |             http://energy.opnfv.fr/resources             |
|           DEPLOY_SCENARIO            |                     os-odl-ovs-noha                      |
|       ENERGY_RECORDER_API_USER       |                                                          |
|              NODE_NAME               |                    ericsson-virtual2                     |
+--------------------------------------+----------------------------------------------------------+

2019-08-21 08:44:41,579 - xtesting.ci.run_tests - INFO - Sourcing env file /var/lib/xtesting/conf/env_file


export OS_IDENTITY_API_VERSION=3
export OS_PROJECT_DOMAIN_NAME=Default
export OS_USER_DOMAIN_NAME=Default
export OS_PROJECT_NAME=admin
export OS_TENANT_NAME=admin
export OS_USERNAME=admin
export OS_PASSWORD=opnfv_secret
export OS_REGION_NAME=RegionOne
export OS_INTERFACE=internal
export OS_ENDPOINT_TYPE="internal"
export OS_CACERT="/etc/ssl/certs/ca-certificates.crt"
export SDN_CONTROLLER_USER=admin
export SDN_CONTROLLER_RESTCONFPORT=8282
export SDN_CONTROLLER_PASSWORD=admin
export SDN_CONTROLLER_WEBPORT=8282
export SDN_CONTROLLER_IP=10.16.0.107
export VOLUME_DEVICE_NAME=sdc
export OS_AUTH_URL=http://172.16.10.36:35357/v3

2019-08-21 08:44:41,580 - xtesting.ci.run_tests - INFO - TESTS TO BE EXECUTED:

+---------------+---------------+------------------------------------------+-------------------------------------------------+
|     TIERS     |     ORDER     |               DESCRIPTION                |                    TESTCASES                    |
+---------------+---------------+------------------------------------------+-------------------------------------------------+
|     smoke     |       1       |     Set of basic Functional tests to     |     neutron-tempest-plugin-api rally_sanity     |
|               |               |      validate the OPNFV scenarios.       |          refstack_defcore tempest_full          |
|               |               |                                          |      tempest_scenario patrole neutron_trunk     |
|               |               |                                          |         networking-bgpvpn networking-sfc        |
|               |               |                                          |                     barbican                    |
+---------------+---------------+------------------------------------------+-------------------------------------------------+

2019-08-21 08:44:41,616 - xtesting.ci.run_tests - INFO - Loading test case 'neutron-tempest-plugin-api'...
2019-08-21 08:44:45,502 - xtesting.ci.run_tests - INFO - Running test case 'neutron-tempest-plugin-api'...
2019-08-21 08:56:20,434 - xtesting.core.testcase - INFO - The results were successfully pushed to DB
2019-08-21 08:56:20,434 - xtesting.ci.run_tests - INFO - Test result:

+------------------------------------+------------------+------------------+----------------+
|             TEST CASE              |     PROJECT      |     DURATION     |     RESULT     |
+------------------------------------+------------------+------------------+----------------+
|     neutron-tempest-plugin-api     |     functest     |      11:34       |      FAIL      |
+------------------------------------+------------------+------------------+----------------+

2019-08-21 08:56:30,773 - xtesting.ci.run_tests - ERROR - The test case 'neutron-tempest-plugin-api' failed.
2019-08-21 08:56:30,811 - xtesting.ci.run_tests - INFO - Loading test case 'rally_sanity'...
2019-08-21 08:56:33,406 - xtesting.ci.run_tests - INFO - Running test case 'rally_sanity'...
2019-08-21 09:15:04,067 - xtesting.core.testcase - INFO - The results were successfully pushed to DB
2019-08-21 09:15:04,068 - xtesting.ci.run_tests - INFO - Test result:

+----------------------+------------------+------------------+----------------+
|      TEST CASE       |     PROJECT      |     DURATION     |     RESULT     |
+----------------------+------------------+------------------+----------------+
|     rally_sanity     |     functest     |      18:30       |      FAIL      |
+----------------------+------------------+------------------+----------------+

2019-08-21 09:15:13,688 - xtesting.ci.run_tests - ERROR - The test case 'rally_sanity' failed.
2019-08-21 09:15:13,725 - xtesting.ci.run_tests - INFO - Loading test case 'refstack_defcore'...
2019-08-21 09:15:17,006 - xtesting.ci.run_tests - INFO - Running test case 'refstack_defcore'...
2019-08-21 09:23:13,658 - xtesting.core.testcase - INFO - The results were successfully pushed to DB
2019-08-21 09:23:13,658 - xtesting.ci.run_tests - INFO - Test result:

+--------------------------+------------------+------------------+----------------+
|        TEST CASE         |     PROJECT      |     DURATION     |     RESULT     |
+--------------------------+------------------+------------------+----------------+
|     refstack_defcore     |     functest     |      07:56       |      PASS      |
+--------------------------+------------------+------------------+----------------+

2019-08-21 09:23:23,546 - xtesting.ci.run_tests - INFO - Loading test case 'tempest_full'...
2019-08-21 09:23:26,829 - xtesting.ci.run_tests - INFO - Running test case 'tempest_full'...
2019-08-21 10:08:41,567 - xtesting.core.testcase - INFO - The results were successfully pushed to DB
2019-08-21 10:08:41,568 - xtesting.ci.run_tests - INFO - Test result:

+----------------------+------------------+------------------+----------------+
|      TEST CASE       |     PROJECT      |     DURATION     |     RESULT     |
+----------------------+------------------+------------------+----------------+
|     tempest_full     |     functest     |      45:14       |      FAIL      |
+----------------------+------------------+------------------+----------------+

2019-08-21 10:08:52,865 - xtesting.ci.run_tests - ERROR - The test case 'tempest_full' failed.
2019-08-21 10:08:52,905 - xtesting.ci.run_tests - INFO - Loading test case 'tempest_scenario'...
2019-08-21 10:08:56,351 - xtesting.ci.run_tests - INFO - Running test case 'tempest_scenario'...
2019-08-21 10:18:40,710 - xtesting.core.testcase - INFO - The results were successfully pushed to DB
2019-08-21 10:18:40,710 - xtesting.ci.run_tests - INFO - Test result:

+--------------------------+------------------+------------------+----------------+
|        TEST CASE         |     PROJECT      |     DURATION     |     RESULT     |
+--------------------------+------------------+------------------+----------------+
|     tempest_scenario     |     functest     |      09:44       |      PASS      |
+--------------------------+------------------+------------------+----------------+

2019-08-21 10:18:50,520 - xtesting.ci.run_tests - INFO - Loading test case 'patrole'...
2019-08-21 10:18:53,841 - xtesting.ci.run_tests - INFO - Running test case 'patrole'...
2019-08-21 10:22:03,372 - xtesting.core.testcase - INFO - The results were successfully pushed to DB
2019-08-21 10:22:03,373 - xtesting.ci.run_tests - INFO - Test result:

+-------------------+------------------+------------------+----------------+
|     TEST CASE     |     PROJECT      |     DURATION     |     RESULT     |
+-------------------+------------------+------------------+----------------+
|      patrole      |     functest     |      03:09       |      PASS      |
+-------------------+------------------+------------------+----------------+

2019-08-21 10:22:12,701 - xtesting.ci.run_tests - INFO - Loading test case 'neutron_trunk'...
2019-08-21 10:22:16,031 - xtesting.ci.run_tests - INFO - Running test case 'neutron_trunk'...
2019-08-21 10:24:54,945 - xtesting.core.testcase - INFO - The results were successfully pushed to DB
2019-08-21 10:24:54,945 - xtesting.ci.run_tests - INFO - Test result:

+-----------------------+------------------+------------------+----------------+
|       TEST CASE       |     PROJECT      |     DURATION     |     RESULT     |
+-----------------------+------------------+------------------+----------------+
|     neutron_trunk     |     functest     |      02:39       |      PASS      |
+-----------------------+------------------+------------------+----------------+

2019-08-21 10:25:04,239 - xtesting.ci.run_tests - INFO - Loading test case 'networking-bgpvpn'...
2019-08-21 10:25:07,444 - functest.opnfv_tests.openstack.tempest.tempest - WARNING - Cannot find Neutron extension: bgpvpn
2019-08-21 10:25:07,960 - xtesting.ci.run_tests - INFO - Skipping test case 'networking-bgpvpn'...
2019-08-21 10:25:07,960 - xtesting.ci.run_tests - INFO - Test result:

+---------------------------+------------------+------------------+----------------+
|         TEST CASE         |     PROJECT      |     DURATION     |     RESULT     |
+---------------------------+------------------+------------------+----------------+
|     networking-bgpvpn     |     functest     |      00:00       |      SKIP      |
+---------------------------+------------------+------------------+----------------+

2019-08-21 10:25:07,998 - xtesting.ci.run_tests - INFO - Loading test case 'networking-sfc'...
2019-08-21 10:25:11,203 - functest.opnfv_tests.openstack.tempest.tempest - WARNING - Cannot find Neutron extension: sfc
2019-08-21 10:25:11,739 - xtesting.ci.run_tests - INFO - Skipping test case 'networking-sfc'...
2019-08-21 10:25:11,739 - xtesting.ci.run_tests - INFO - Test result:

+------------------------+------------------+------------------+----------------+
|       TEST CASE        |     PROJECT      |     DURATION     |     RESULT     |
+------------------------+------------------+------------------+----------------+
|     networking-sfc     |     functest     |      00:00       |      SKIP      |
+------------------------+------------------+------------------+----------------+

2019-08-21 10:25:11,775 - xtesting.ci.run_tests - INFO - Loading test case 'barbican'...
2019-08-21 10:25:15,171 - xtesting.ci.run_tests - INFO - Running test case 'barbican'...
2019-08-21 10:27:57,809 - xtesting.core.testcase - INFO - The results were successfully pushed to DB
2019-08-21 10:27:57,809 - xtesting.ci.run_tests - INFO - Test result:

+-------------------+------------------+------------------+----------------+
|     TEST CASE     |     PROJECT      |     DURATION     |     RESULT     |
+-------------------+------------------+------------------+----------------+
|      barbican     |     functest     |      02:42       |      PASS      |
+-------------------+------------------+------------------+----------------+

2019-08-21 10:28:07,219 - xtesting.ci.run_tests - INFO - Xtesting report:

+------------------------------------+------------------+---------------+------------------+----------------+
|             TEST CASE              |     PROJECT      |      TIER     |     DURATION     |     RESULT     |
+------------------------------------+------------------+---------------+------------------+----------------+
|     neutron-tempest-plugin-api     |     functest     |     smoke     |      11:34       |      FAIL      |
|            rally_sanity            |     functest     |     smoke     |      18:30       |      FAIL      |
|          refstack_defcore          |     functest     |     smoke     |      07:56       |      PASS      |
|            tempest_full            |     functest     |     smoke     |      45:14       |      FAIL      |
|          tempest_scenario          |     functest     |     smoke     |      09:44       |      PASS      |
|              patrole               |     functest     |     smoke     |      03:09       |      PASS      |
|           neutron_trunk            |     functest     |     smoke     |      02:39       |      PASS      |
|         networking-bgpvpn          |     functest     |     smoke     |      00:00       |      SKIP      |
|           networking-sfc           |     functest     |     smoke     |      00:00       |      SKIP      |
|              barbican              |     functest     |     smoke     |      02:42       |      PASS      |
+------------------------------------+------------------+---------------+------------------+----------------+

2019-08-21 10:28:07,226 - xtesting.ci.run_tests - INFO - Execution exit value: Result.EX_ERROR
Functest: Pulling Functest Docker image opnfv/functest-benchmarking:hunter ...
Running Functest tier 'benchmarking'. CMD: docker run --rm  -e INSTALLER_TYPE=fuel -e INSTALLER_IP=10.20.0.2     -e NODE_NAME=ericsson-virtual2 -e DEPLOY_SCENARIO=os-odl-ovs-noha     -e BUILD_TAG=jenkins-functest-fuel-virtual-daily-hunter-630 -e DEPLOY_TYPE=virt -e CI_LOOP=daily     -e TEST_DB_URL=http://testresults.opnfv.org/test/api/v1/results -e ENERGY_RECORDER_API_URL=http://energy.opnfv.fr/resources     -e DEBUG=true -e POD_ARCH=x86_64 -e BLOCK_MIGRATION=false -e SDN_CONTROLLER_RESTCONFPORT=8080 -e IMAGE_PROPERTIES=hw_disk_bus:scsi,hw_scsi_model:virtio-scsi,hw_mem_page_size:large -e FLAVOR_EXTRA_SPECS=hw:mem_page_size:large -v /home/jenkins/opnfv/functest/images:/home/opnfv/functest/images -v /home/jenkins/opnfv/functest/results/hunter:/home/opnfv/functest/results -v /var/lib/opnfv/mcp.rsa:/root/.ssh/id_rsa       -v /home/jenkins/opnfv-openrc.sh:/home/opnfv/functest/conf/env_file      -v /tmp/tmp.tzsOFUXpLd:/usr/lib/python2.7/site-packages/functest/opnfv_tests/openstack/tempest/custom_tests/tempest_conf.yaml  opnfv/functest-benchmarking:hunter /bin/bash -c 'run_tests -r -t all'
2019-08-21 10:28:13,448 - xtesting.ci.run_tests - INFO - Deployment description:

+--------------------------------------+----------------------------------------------------------+
|               ENV VAR                |                          VALUE                           |
+--------------------------------------+----------------------------------------------------------+
|              BUILD_TAG               |      jenkins-functest-fuel-virtual-daily-hunter-630      |
|             TEST_DB_URL              |     http://testresults.opnfv.org/test/api/v1/results     |
|     ENERGY_RECORDER_API_PASSWORD     |                                                          |
|               CI_LOOP                |                          daily                           |
|                DEBUG                 |                           true                           |
|            INSTALLER_TYPE            |                           fuel                           |
|       ENERGY_RECORDER_API_URL        |             http://energy.opnfv.fr/resources             |
|           DEPLOY_SCENARIO            |                     os-odl-ovs-noha                      |
|       ENERGY_RECORDER_API_USER       |                                                          |
|              NODE_NAME               |                    ericsson-virtual2                     |
+--------------------------------------+----------------------------------------------------------+

2019-08-21 10:28:13,453 - xtesting.ci.run_tests - INFO - Sourcing env file /var/lib/xtesting/conf/env_file


export OS_IDENTITY_API_VERSION=3
export OS_PROJECT_DOMAIN_NAME=Default
export OS_USER_DOMAIN_NAME=Default
export OS_PROJECT_NAME=admin
export OS_TENANT_NAME=admin
export OS_USERNAME=admin
export OS_PASSWORD=opnfv_secret
export OS_REGION_NAME=RegionOne
export OS_INTERFACE=internal
export OS_ENDPOINT_TYPE="internal"
export OS_CACERT="/etc/ssl/certs/ca-certificates.crt"
export SDN_CONTROLLER_USER=admin
export SDN_CONTROLLER_RESTCONFPORT=8282
export SDN_CONTROLLER_PASSWORD=admin
export SDN_CONTROLLER_WEBPORT=8282
export SDN_CONTROLLER_IP=10.16.0.107
export VOLUME_DEVICE_NAME=sdc
export OS_AUTH_URL=http://172.16.10.36:35357/v3

2019-08-21 10:28:13,454 - xtesting.ci.run_tests - INFO - TESTS TO BE EXECUTED:

+----------------------+---------------+-------------------------------------------------+-------------------------------------------+
|        TIERS         |     ORDER     |                   DESCRIPTION                   |                 TESTCASES                 |
+----------------------+---------------+-------------------------------------------------+-------------------------------------------+
|     benchmarking     |       2       |     Run several OpenStack performance tools     |     rally_full rally_jobs vmtp shaker     |
|                      |               |     https://docs.openstack.org/performance-     |                                           |
|                      |               |       docs/latest/methodologies/tools.html      |                                           |
+----------------------+---------------+-------------------------------------------------+-------------------------------------------+

2019-08-21 10:28:13,467 - xtesting.ci.run_tests - INFO - Loading test case 'rally_full'...
2019-08-21 10:28:16,371 - xtesting.ci.run_tests - INFO - Running test case 'rally_full'...
2019-08-21 12:10:30,202 - xtesting.core.testcase - INFO - The results were successfully pushed to DB
2019-08-21 12:10:30,202 - xtesting.ci.run_tests - INFO - Test result:

+--------------------+------------------+------------------+----------------+
|     TEST CASE      |     PROJECT      |     DURATION     |     RESULT     |
+--------------------+------------------+------------------+----------------+
|     rally_full     |     functest     |      102:14      |      FAIL      |
+--------------------+------------------+------------------+----------------+

2019-08-21 12:10:41,382 - xtesting.ci.run_tests - ERROR - The test case 'rally_full' failed.
2019-08-21 12:10:41,394 - xtesting.ci.run_tests - INFO - Loading test case 'rally_jobs'...
2019-08-21 12:10:43,625 - xtesting.ci.run_tests - INFO - Running test case 'rally_jobs'...
2019-08-21 13:00:31,421 - xtesting.core.testcase - INFO - The results were successfully pushed to DB
2019-08-21 13:00:31,422 - xtesting.ci.run_tests - INFO - Test result:

+--------------------+------------------+------------------+----------------+
|     TEST CASE      |     PROJECT      |     DURATION     |     RESULT     |
+--------------------+------------------+------------------+----------------+
|     rally_jobs     |     functest     |      49:47       |      PASS      |
+--------------------+------------------+------------------+----------------+

2019-08-21 13:00:42,382 - xtesting.ci.run_tests - INFO - Loading test case 'vmtp'...
2019-08-21 13:00:44,953 - xtesting.ci.run_tests - INFO - Running test case 'vmtp'...
2019-08-21 13:35:26,704 - functest.opnfv_tests.openstack.vmtp.vmtp - ERROR - Exception when calling ['vmtp_genchart', '-c', '/home/opnfv/functest/results/vmtp/vmtp.html', '/home/opnfv/functest/results/vmtp/vmtp.json']
Error: No such file %s: /home/opnfv/functest/results/vmtp/vmtp.json

2019-08-21 13:35:27,001 - xtesting.core.testcase - INFO - The results were successfully pushed to DB
2019-08-21 13:35:27,001 - xtesting.ci.run_tests - INFO - Test result:

+-------------------+------------------+------------------+----------------+
|     TEST CASE     |     PROJECT      |     DURATION     |     RESULT     |
+-------------------+------------------+------------------+----------------+
|        vmtp       |     functest     |      34:42       |      FAIL      |
+-------------------+------------------+------------------+----------------+

2019-08-21 13:35:27,845 - functest.core.tenantnetwork - ERROR - cannot clean all resources
Traceback (most recent call last):
  File "/usr/lib/python2.7/site-packages/functest/core/tenantnetwork.py", line 282, in clean
    self.cloud.delete_router(self.router.id)
  File "/usr/lib/python2.7/site-packages/shade/openstackcloud.py", line 4156, in delete_router
    error_message="Error deleting router {0}".format(name_or_id))
  File "/usr/lib/python2.7/site-packages/keystoneauth1/adapter.py", line 343, in delete
    return self.request(url, 'DELETE', **kwargs)
  File "/usr/lib/python2.7/site-packages/openstack/_adapter.py", line 164, in request
    return _json_response(response, error_message=error_message)
  File "/usr/lib/python2.7/site-packages/openstack/_adapter.py", line 95, in _json_response
    exceptions.raise_from_response(response, error_message=error_message)
  File "/usr/lib/python2.7/site-packages/openstack/exceptions.py", line 229, in raise_from_response
    http_status=http_status, request_id=request_id
ConflictException: Error deleting router 113a91b6-b47d-4ca1-9eab-32a31f0bafe3: Client Error for url: http://172.16.10.36:9696/v2.0/routers/113a91b6-b47d-4ca1-9eab-32a31f0bafe3.json, Router 113a91b6-b47d-4ca1-9eab-32a31f0bafe3 still has ports
2019-08-21 13:35:30,069 - xtesting.ci.run_tests - ERROR - The test case 'vmtp' failed.
2019-08-21 13:35:30,092 - xtesting.ci.run_tests - INFO - Loading test case 'shaker'...
2019-08-21 13:35:32,699 - xtesting.ci.run_tests - INFO - Running test case 'shaker'...
2019-08-21 14:37:05,630 - functest.opnfv_tests.openstack.shaker.shaker - ERROR - cannot get report files
Traceback (most recent call last):
  File "/usr/lib/python2.7/site-packages/functest/opnfv_tests/openstack/shaker/shaker.py", line 125, in execute
    scpc.get('report.json', self.res_dir)
  File "/usr/lib/python2.7/site-packages/scp.py", line 217, in get
    self._recv_all()
  File "/usr/lib/python2.7/site-packages/scp.py", line 367, in _recv_all
    raise SCPException(asunicode(msg[1:]))
SCPException: scp: report.json: No such file or directory
2019-08-21 14:37:05,912 - xtesting.core.testcase - INFO - The results were successfully pushed to DB
2019-08-21 14:37:05,912 - xtesting.ci.run_tests - INFO - Test result:

+-------------------+------------------+------------------+----------------+
|     TEST CASE     |     PROJECT      |     DURATION     |     RESULT     |
+-------------------+------------------+------------------+----------------+
|       shaker      |     functest     |      61:33       |      FAIL      |
+-------------------+------------------+------------------+----------------+

2019-08-21 14:37:23,907 - xtesting.ci.run_tests - ERROR - The test case 'shaker' failed.
2019-08-21 14:37:23,907 - xtesting.ci.run_tests - INFO - Xtesting report:

+--------------------+------------------+----------------------+------------------+----------------+
|     TEST CASE      |     PROJECT      |         TIER         |     DURATION     |     RESULT     |
+--------------------+------------------+----------------------+------------------+----------------+
|     rally_full     |     functest     |     benchmarking     |      102:14      |      FAIL      |
|     rally_jobs     |     functest     |     benchmarking     |      49:47       |      PASS      |
|        vmtp        |     functest     |     benchmarking     |      34:42       |      FAIL      |
|       shaker       |     functest     |     benchmarking     |      61:33       |      FAIL      |
+--------------------+------------------+----------------------+------------------+----------------+

2019-08-21 14:37:23,911 - xtesting.ci.run_tests - INFO - Execution exit value: Result.EX_ERROR
Functest: Pulling Functest Docker image opnfv/functest-features:hunter ...
Running Functest tier 'features'. CMD: docker run --rm  -e INSTALLER_TYPE=fuel -e INSTALLER_IP=10.20.0.2     -e NODE_NAME=ericsson-virtual2 -e DEPLOY_SCENARIO=os-odl-ovs-noha     -e BUILD_TAG=jenkins-functest-fuel-virtual-daily-hunter-630 -e DEPLOY_TYPE=virt -e CI_LOOP=daily     -e TEST_DB_URL=http://testresults.opnfv.org/test/api/v1/results -e ENERGY_RECORDER_API_URL=http://energy.opnfv.fr/resources     -e DEBUG=true -e POD_ARCH=x86_64 -e BLOCK_MIGRATION=false -e SDN_CONTROLLER_RESTCONFPORT=8080 -e IMAGE_PROPERTIES=hw_disk_bus:scsi,hw_scsi_model:virtio-scsi,hw_mem_page_size:large -e FLAVOR_EXTRA_SPECS=hw:mem_page_size:large -v /home/jenkins/opnfv/functest/images:/home/opnfv/functest/images -v /home/jenkins/opnfv/functest/results/hunter:/home/opnfv/functest/results -v /var/lib/opnfv/mcp.rsa:/root/.ssh/id_rsa       -v /home/jenkins/opnfv-openrc.sh:/home/opnfv/functest/conf/env_file      -v /tmp/tmp.tzsOFUXpLd:/usr/lib/python2.7/site-packages/functest/opnfv_tests/openstack/tempest/custom_tests/tempest_conf.yaml  opnfv/functest-features:hunter /bin/bash -c 'run_tests -r -t all'
2019-08-21 14:37:37,798 - xtesting.ci.run_tests - INFO - Deployment description:

+--------------------------------------+----------------------------------------------------------+
|               ENV VAR                |                          VALUE                           |
+--------------------------------------+----------------------------------------------------------+
|              BUILD_TAG               |      jenkins-functest-fuel-virtual-daily-hunter-630      |
|             TEST_DB_URL              |     http://testresults.opnfv.org/test/api/v1/results     |
|     ENERGY_RECORDER_API_PASSWORD     |                                                          |
|               CI_LOOP                |                          daily                           |
|                DEBUG                 |                           true                           |
|            INSTALLER_TYPE            |                           fuel                           |
|       ENERGY_RECORDER_API_URL        |             http://energy.opnfv.fr/resources             |
|           DEPLOY_SCENARIO            |                     os-odl-ovs-noha                      |
|       ENERGY_RECORDER_API_USER       |                                                          |
|              NODE_NAME               |                    ericsson-virtual2                     |
+--------------------------------------+----------------------------------------------------------+

2019-08-21 14:37:37,803 - xtesting.ci.run_tests - INFO - Sourcing env file /var/lib/xtesting/conf/env_file


export OS_IDENTITY_API_VERSION=3
export OS_PROJECT_DOMAIN_NAME=Default
export OS_USER_DOMAIN_NAME=Default
export OS_PROJECT_NAME=admin
export OS_TENANT_NAME=admin
export OS_USERNAME=admin
export OS_PASSWORD=opnfv_secret
export OS_REGION_NAME=RegionOne
export OS_INTERFACE=internal
export OS_ENDPOINT_TYPE="internal"
export OS_CACERT="/etc/ssl/certs/ca-certificates.crt"
export SDN_CONTROLLER_USER=admin
export SDN_CONTROLLER_RESTCONFPORT=8282
export SDN_CONTROLLER_PASSWORD=admin
export SDN_CONTROLLER_WEBPORT=8282
export SDN_CONTROLLER_IP=10.16.0.107
export VOLUME_DEVICE_NAME=sdc
export OS_AUTH_URL=http://172.16.10.36:35357/v3

2019-08-21 14:37:37,804 - xtesting.ci.run_tests - INFO - TESTS TO BE EXECUTED:

+------------------+---------------+-------------------------------------------+-----------------------------+
|      TIERS       |     ORDER     |                DESCRIPTION                |          TESTCASES          |
+------------------+---------------+-------------------------------------------+-----------------------------+
|     features     |       3       |     Test suites from feature projects     |     doctor-notification     |
|                  |               |           integrated in functest          |                             |
+------------------+---------------+-------------------------------------------+-----------------------------+

2019-08-21 14:37:37,821 - xtesting.ci.run_tests - INFO - Loading test case 'doctor-notification'...
2019-08-21 14:37:37,895 - xtesting.ci.run_tests - INFO - Running test case 'doctor-notification'...
2019-08-21 14:37:37,895 - xtesting.core.feature - INFO - Calling doctor-test
2019-08-21 14:40:50,811 - xtesting.core.testcase - INFO - The results were successfully pushed to DB
2019-08-21 14:40:50,811 - xtesting.ci.run_tests - INFO - Test result:

+-----------------------------+-----------------+------------------+----------------+
|          TEST CASE          |     PROJECT     |     DURATION     |     RESULT     |
+-----------------------------+-----------------+------------------+----------------+
|     doctor-notification     |      doctor     |      03:13       |      PASS      |
+-----------------------------+-----------------+------------------+----------------+

2019-08-21 14:40:50,814 - xtesting.ci.run_tests - INFO - Xtesting report:

+-----------------------------+-------------------+------------------+------------------+----------------+
|          TEST CASE          |      PROJECT      |       TIER       |     DURATION     |     RESULT     |
+-----------------------------+-------------------+------------------+------------------+----------------+
|     doctor-notification     |       doctor      |     features     |      03:13       |      PASS      |
|       functest-odl-sfc      |        sfc        |     features     |      00:00       |      SKIP      |
|      barometercollectd      |     barometer     |     features     |      00:00       |      SKIP      |
|             vgpu            |      functest     |     features     |      00:00       |      SKIP      |
|         stor4nfv_os         |      stor4nfv     |     features     |      00:00       |      SKIP      |
+-----------------------------+-------------------+------------------+------------------+----------------+

2019-08-21 14:40:50,817 - xtesting.ci.run_tests - INFO - Execution exit value: Result.EX_OK
Functest: Pulling Functest Docker image opnfv/functest-vnf:hunter ...
Running Functest tier 'vnf'. CMD: docker run --rm  -e INSTALLER_TYPE=fuel -e INSTALLER_IP=10.20.0.2     -e NODE_NAME=ericsson-virtual2 -e DEPLOY_SCENARIO=os-odl-ovs-noha     -e BUILD_TAG=jenkins-functest-fuel-virtual-daily-hunter-630 -e DEPLOY_TYPE=virt -e CI_LOOP=daily     -e TEST_DB_URL=http://testresults.opnfv.org/test/api/v1/results -e ENERGY_RECORDER_API_URL=http://energy.opnfv.fr/resources     -e DEBUG=true -e POD_ARCH=x86_64 -e BLOCK_MIGRATION=false -e SDN_CONTROLLER_RESTCONFPORT=8080 -e IMAGE_PROPERTIES=hw_disk_bus:scsi,hw_scsi_model:virtio-scsi,hw_mem_page_size:large -e FLAVOR_EXTRA_SPECS=hw:mem_page_size:large -v /home/jenkins/opnfv/functest/images:/home/opnfv/functest/images -v /home/jenkins/opnfv/functest/results/hunter:/home/opnfv/functest/results -v /var/lib/opnfv/mcp.rsa:/root/.ssh/id_rsa       -v /home/jenkins/opnfv-openrc.sh:/home/opnfv/functest/conf/env_file      -v /tmp/tmp.tzsOFUXpLd:/usr/lib/python2.7/site-packages/functest/opnfv_tests/openstack/tempest/custom_tests/tempest_conf.yaml  opnfv/functest-vnf:hunter /bin/bash -c 'run_tests -r -t all'
2019-08-21 14:41:16,434 - xtesting.ci.run_tests - INFO - Deployment description:

+--------------------------------------+----------------------------------------------------------+
|               ENV VAR                |                          VALUE                           |
+--------------------------------------+----------------------------------------------------------+
|              BUILD_TAG               |      jenkins-functest-fuel-virtual-daily-hunter-630      |
|             TEST_DB_URL              |     http://testresults.opnfv.org/test/api/v1/results     |
|     ENERGY_RECORDER_API_PASSWORD     |                                                          |
|               CI_LOOP                |                          daily                           |
|                DEBUG                 |                           true                           |
|            INSTALLER_TYPE            |                           fuel                           |
|       ENERGY_RECORDER_API_URL        |             http://energy.opnfv.fr/resources             |
|           DEPLOY_SCENARIO            |                     os-odl-ovs-noha                      |
|       ENERGY_RECORDER_API_USER       |                                                          |
|              NODE_NAME               |                    ericsson-virtual2                     |
+--------------------------------------+----------------------------------------------------------+

2019-08-21 14:41:16,439 - xtesting.ci.run_tests - INFO - Sourcing env file /var/lib/xtesting/conf/env_file


export OS_IDENTITY_API_VERSION=3
export OS_PROJECT_DOMAIN_NAME=Default
export OS_USER_DOMAIN_NAME=Default
export OS_PROJECT_NAME=admin
export OS_TENANT_NAME=admin
export OS_USERNAME=admin
export OS_PASSWORD=opnfv_secret
export OS_REGION_NAME=RegionOne
export OS_INTERFACE=internal
export OS_ENDPOINT_TYPE="internal"
export OS_CACERT="/etc/ssl/certs/ca-certificates.crt"
export SDN_CONTROLLER_USER=admin
export SDN_CONTROLLER_RESTCONFPORT=8282
export SDN_CONTROLLER_PASSWORD=admin
export SDN_CONTROLLER_WEBPORT=8282
export SDN_CONTROLLER_IP=10.16.0.107
export VOLUME_DEVICE_NAME=sdc
export OS_AUTH_URL=http://172.16.10.36:35357/v3

2019-08-21 14:41:16,441 - xtesting.ci.run_tests - INFO - TESTS TO BE EXECUTED:

+---------------+---------------+---------------------------------------+----------------------------------------+
|     TIERS     |     ORDER     |              DESCRIPTION              |               TESTCASES                |
+---------------+---------------+---------------------------------------+----------------------------------------+
|      vnf      |       4       |     Collection of VNF test cases.     |     cloudify cloudify_ims heat_ims     |
|               |               |                                       |         vyos_vrouter juju_epc          |
+---------------+---------------+---------------------------------------+----------------------------------------+

2019-08-21 14:41:16,453 - xtesting.ci.run_tests - INFO - Loading test case 'cloudify'...
2019-08-21 14:41:18,709 - xtesting.ci.run_tests - INFO - Running test case 'cloudify'...
2019-08-21 14:46:42,586 - functest.core.cloudify - INFO - Attemps running status of the Manager
2019-08-21 14:47:13,186 - functest.core.cloudify - INFO - The current manager status is running
2019-08-21 14:47:13,751 - functest.core.cloudify - INFO - Secrets API successfully reached
2019-08-21 14:47:13,751 - functest.core.cloudify - INFO - Cloudify Manager is up and running
2019-08-21 14:47:14,079 - xtesting.core.testcase - INFO - The results were successfully pushed to DB
2019-08-21 14:47:14,079 - xtesting.ci.run_tests - INFO - Test result:

+-------------------+------------------+------------------+----------------+
|     TEST CASE     |     PROJECT      |     DURATION     |     RESULT     |
+-------------------+------------------+------------------+----------------+
|      cloudify     |     functest     |      05:55       |      PASS      |
+-------------------+------------------+------------------+----------------+

2019-08-21 14:47:29,568 - xtesting.ci.run_tests - INFO - Loading test case 'cloudify_ims'...
2019-08-21 14:47:31,835 - xtesting.ci.run_tests - INFO - Running test case 'cloudify_ims'...
2019-08-21 14:52:49,965 - functest.core.cloudify - INFO - Attemps running status of the Manager
2019-08-21 14:53:20,409 - functest.core.cloudify - INFO - The current manager status is running
2019-08-21 14:53:20,880 - functest.core.cloudify - INFO - Secrets API successfully reached
2019-08-21 14:53:20,880 - functest.core.cloudify - INFO - Cloudify Manager is up and running
2019-08-21 14:53:22,833 - functest.core.cloudify - INFO - Put private keypair in manager
2019-08-21 14:57:15,397 - functest.core.singlevm - ERROR - Cannot run cloudify_ims
Traceback (most recent call last):
  File "/usr/lib/python2.7/site-packages/functest/core/singlevm.py", line 468, in run
    if not self.execute():
  File "/usr/lib/python2.7/site-packages/functest/opnfv_tests/vnf/ims/cloudify_ims.py", line 166, in execute
    if self.deploy_vnf() and self.test_vnf():
  File "/usr/lib/python2.7/site-packages/functest/opnfv_tests/vnf/ims/cloudify_ims.py", line 217, in deploy_vnf
    self.cfy_client, execution, self.__logger, timeout=3600)
  File "/usr/lib/python2.7/site-packages/functest/core/cloudify.py", line 182, in wait_for_execution
    sort='@timestamp').items
  File "/usr/lib/python2.7/site-packages/cloudify_rest_client/events.py", line 77, in list
    response = self.api.get(uri, _include=_include, params=params)
  File "/usr/lib/python2.7/site-packages/cloudify_rest_client/client.py", line 252, in get
    timeout=timeout)
  File "/usr/lib/python2.7/site-packages/cloudify_rest_client/client.py", line 233, in do_request
    'SSL, but the client does'.format(e)
ConnectionError: HTTPConnectionPool(host='10.16.0.114', port=80): Max retries exceeded with url: /api/v3.1/events?_offset=375&type=cloudify_event&type=cloudify_log&execution_id=7823e046-f78e-46b7-b3e9-c8596a35ffb6&_sort=%40timestamp&_size=50 (Caused by NewConnectionError('<urllib3.connection.HTTPConnection object at 0x7f5202c7ad90>: Failed to establish a new connection: [Errno 110] Operation timed out',))
This can happen when the manager is not working with SSL, but the client does
2019-08-21 14:57:15,709 - xtesting.core.testcase - INFO - The results were successfully pushed to DB
2019-08-21 14:57:15,709 - xtesting.ci.run_tests - INFO - Test result:

+----------------------+------------------+------------------+----------------+
|      TEST CASE       |     PROJECT      |     DURATION     |     RESULT     |
+----------------------+------------------+------------------+----------------+
|     cloudify_ims     |     functest     |      09:44       |      FAIL      |
+----------------------+------------------+------------------+----------------+

2019-08-21 14:57:15,712 - functest.core.cloudify - INFO - Deleting the current deployment
2019-08-21 14:59:26,468 - functest.core.cloudify - ERROR - Some issue during the undeployment ..
Traceback (most recent call last):
  File "/usr/lib/python2.7/site-packages/functest/core/cloudify.py", line 143, in kill_existing_execution
    exec_list = self.cfy_client.executions.list()
  File "/usr/lib/python2.7/site-packages/cloudify_rest_client/executions.py", line 139, in list
    _include=_include)
  File "/usr/lib/python2.7/site-packages/cloudify_rest_client/client.py", line 252, in get
    timeout=timeout)
  File "/usr/lib/python2.7/site-packages/cloudify_rest_client/client.py", line 233, in do_request
    'SSL, but the client does'.format(e)
ConnectionError: HTTPConnectionPool(host='10.16.0.114', port=80): Max retries exceeded with url: /api/v3.1/executions?_include_system_workflows=False (Caused by NewConnectionError('<urllib3.connection.HTTPConnection object at 0x7f5202c91610>: Failed to establish a new connection: [Errno 110] Operation timed out',))
This can happen when the manager is not working with SSL, but the client does
2019-08-21 14:59:37,820 - functest.core.tenantnetwork - ERROR - cannot clean all resources
Traceback (most recent call last):
  File "/usr/lib/python2.7/site-packages/functest/core/tenantnetwork.py", line 284, in clean
    self.cloud.delete_subnet(self.subnet.id)
  File "/usr/lib/python2.7/site-packages/shade/openstackcloud.py", line 7680, in delete_subnet
    "/subnets/{subnet_id}.json".format(subnet_id=subnet['id']))
  File "/usr/lib/python2.7/site-packages/keystoneauth1/adapter.py", line 343, in delete
    return self.request(url, 'DELETE', **kwargs)
  File "/usr/lib/python2.7/site-packages/openstack/_adapter.py", line 164, in request
    return _json_response(response, error_message=error_message)
  File "/usr/lib/python2.7/site-packages/openstack/_adapter.py", line 95, in _json_response
    exceptions.raise_from_response(response, error_message=error_message)
  File "/usr/lib/python2.7/site-packages/openstack/exceptions.py", line 229, in raise_from_response
    http_status=http_status, request_id=request_id
ConflictException: ConflictException: 409: Client Error for url: http://172.16.10.36:9696/v2.0/subnets/a61fe842-07d2-4397-b9b5-62734a8147fa.json, Unable to complete operation on subnet a61fe842-07d2-4397-b9b5-62734a8147fa: One or more ports have an IP allocation from this subnet.
2019-08-21 14:59:40,181 - functest.core.tenantnetwork - ERROR - Cannot clean all resources
Traceback (most recent call last):
  File "/usr/lib/python2.7/site-packages/functest/core/tenantnetwork.py", line 129, in clean
    self.orig_cloud.delete_security_group(sec_id)
  File "/usr/lib/python2.7/site-packages/shade/openstackcloud.py", line 7987, in delete_security_group
    name_or_id)
  File "/usr/lib/python2.7/site-packages/keystoneauth1/adapter.py", line 343, in delete
    return self.request(url, 'DELETE', **kwargs)
  File "/usr/lib/python2.7/site-packages/openstack/_adapter.py", line 164, in request
    return _json_response(response, error_message=error_message)
  File "/usr/lib/python2.7/site-packages/openstack/_adapter.py", line 95, in _json_response
    exceptions.raise_from_response(response, error_message=error_message)
  File "/usr/lib/python2.7/site-packages/openstack/exceptions.py", line 229, in raise_from_response
    http_status=http_status, request_id=request_id
ConflictException: Error deleting security group 9bf5af92-597c-4188-995c-035763a79347: Client Error for url: http://172.16.10.36:9696/v2.0/security-groups/9bf5af92-597c-4188-995c-035763a79347.json, Security Group 9bf5af92-597c-4188-995c-035763a79347 in use.
2019-08-21 14:59:40,181 - xtesting.ci.run_tests - ERROR - The test case 'cloudify_ims' failed.
2019-08-21 14:59:40,192 - xtesting.ci.run_tests - INFO - Loading test case 'heat_ims'...
2019-08-21 14:59:42,147 - xtesting.ci.run_tests - INFO - Running test case 'heat_ims'...
2019-08-21 15:25:37,633 - functest.opnfv_tests.vnf.ims.heat_ims - ERROR - Cannot run heat_ims
Traceback (most recent call last):
  File "/usr/lib/python2.7/site-packages/functest/opnfv_tests/vnf/ims/heat_ims.py", line 143, in run
    if not self.execute():
  File "/usr/lib/python2.7/site-packages/functest/opnfv_tests/vnf/ims/heat_ims.py", line 120, in execute
    if self.deploy_vnf() and self.test_vnf():
  File "/usr/lib/python2.7/site-packages/functest/opnfv_tests/vnf/ims/heat_ims.py", line 188, in deploy_vnf
    self._monit()
  File "/usr/lib/python2.7/site-packages/functest/opnfv_tests/vnf/ims/heat_ims.py", line 163, in _monit
    key_filename=self.key_filename, timeout=timeout)
  File "/usr/lib/python2.7/site-packages/paramiko/client.py", line 329, in connect
    to_try = list(self._families_and_addresses(hostname, port))
  File "/usr/lib/python2.7/site-packages/paramiko/client.py", line 200, in _families_and_addresses
    hostname, port, socket.AF_UNSPEC, socket.SOCK_STREAM)
gaierror: [Errno -2] Name does not resolve
2019-08-21 15:25:37,943 - xtesting.core.testcase - INFO - The results were successfully pushed to DB
2019-08-21 15:25:37,943 - xtesting.ci.run_tests - INFO - Test result:

+-------------------+------------------+------------------+----------------+
|     TEST CASE     |     PROJECT      |     DURATION     |     RESULT     |
+-------------------+------------------+------------------+----------------+
|      heat_ims     |     functest     |      25:55       |      FAIL      |
+-------------------+------------------+------------------+----------------+

2019-08-21 15:26:50,492 - xtesting.ci.run_tests - ERROR - The test case 'heat_ims' failed.
2019-08-21 15:26:50,502 - xtesting.ci.run_tests - INFO - Loading test case 'vyos_vrouter'...
2019-08-21 15:26:52,917 - xtesting.ci.run_tests - INFO - Running test case 'vyos_vrouter'...
2019-08-21 15:32:15,788 - functest.core.cloudify - INFO - Attemps running status of the Manager
2019-08-21 15:32:46,303 - functest.core.cloudify - INFO - The current manager status is running
2019-08-21 15:32:46,880 - functest.core.cloudify - INFO - Secrets API successfully reached
2019-08-21 15:32:46,880 - functest.core.cloudify - INFO - Cloudify Manager is up and running
2019-08-21 15:32:46,880 - functest.core.cloudify - INFO - Put private keypair in manager
2019-08-21 15:35:15,473 - xtesting.core.testcase - INFO - The results were successfully pushed to DB
2019-08-21 15:35:15,474 - xtesting.ci.run_tests - INFO - Test result:

+----------------------+------------------+------------------+----------------+
|      TEST CASE       |     PROJECT      |     DURATION     |     RESULT     |
+----------------------+------------------+------------------+----------------+
|     vyos_vrouter     |     functest     |      08:22       |      FAIL      |
+----------------------+------------------+------------------+----------------+

2019-08-21 15:35:15,479 - functest.core.cloudify - INFO - Deleting the current deployment
2019-08-21 15:37:46,188 - xtesting.ci.run_tests - ERROR - The test case 'vyos_vrouter' failed.
2019-08-21 15:37:46,199 - xtesting.ci.run_tests - INFO - Loading test case 'juju_epc'...
2019-08-21 15:37:48,330 - xtesting.ci.run_tests - INFO - Running test case 'juju_epc'...
2019-08-21 15:51:01,673 - functest.opnfv_tests.vnf.epc.juju_epc - ERROR - Exception with Juju VNF Deployment: ['timeout', '-t', '4800', 'juju-wait']
ERROR:root:ERROR dial tcp 252.12.0.1:17070: context deadline exceeded

ERROR:root:juju status --format=json failed: 1

2019-08-21 15:51:02,000 - xtesting.core.testcase - INFO - The results were successfully pushed to DB
2019-08-21 15:51:02,000 - xtesting.ci.run_tests - INFO - Test result:

+-------------------+------------------+------------------+----------------+
|     TEST CASE     |     PROJECT      |     DURATION     |     RESULT     |
+-------------------+------------------+------------------+----------------+
|      juju_epc     |     functest     |      13:13       |      FAIL      |
+-------------------+------------------+------------------+----------------+

2019-08-21 16:01:02,105 - functest.opnfv_tests.vnf.epc.juju_epc - ERROR - Exception with Juju Cleanup: ['juju', 'debug-log', '--replay', '--no-tail']
ERROR dial tcp 192.168.120.12:17070: i/o timeout

2019-08-21 16:01:10,141 - functest.core.tenantnetwork - ERROR - cannot clean all resources
Traceback (most recent call last):
  File "/usr/lib/python2.7/site-packages/functest/core/tenantnetwork.py", line 284, in clean
    self.cloud.delete_subnet(self.subnet.id)
  File "/usr/lib/python2.7/site-packages/shade/openstackcloud.py", line 7680, in delete_subnet
    "/subnets/{subnet_id}.json".format(subnet_id=subnet['id']))
  File "/usr/lib/python2.7/site-packages/keystoneauth1/adapter.py", line 343, in delete
    return self.request(url, 'DELETE', **kwargs)
  File "/usr/lib/python2.7/site-packages/openstack/_adapter.py", line 164, in request
    return _json_response(response, error_message=error_message)
  File "/usr/lib/python2.7/site-packages/openstack/_adapter.py", line 95, in _json_response
    exceptions.raise_from_response(response, error_message=error_message)
  File "/usr/lib/python2.7/site-packages/openstack/exceptions.py", line 229, in raise_from_response
    http_status=http_status, request_id=request_id
ConflictException: ConflictException: 409: Client Error for url: http://172.16.10.36:9696/v2.0/subnets/dcd1a8f4-3cdc-4617-bc20-6956fa4b824f.json, Unable to complete operation on subnet dcd1a8f4-3cdc-4617-bc20-6956fa4b824f: One or more ports have an IP allocation from this subnet.
2019-08-21 16:01:16,102 - functest.core.tenantnetwork - ERROR - Cannot clean all resources
Traceback (most recent call last):
  File "/usr/lib/python2.7/site-packages/functest/core/tenantnetwork.py", line 129, in clean
    self.orig_cloud.delete_security_group(sec_id)
  File "/usr/lib/python2.7/site-packages/shade/openstackcloud.py", line 7987, in delete_security_group
    name_or_id)
  File "/usr/lib/python2.7/site-packages/keystoneauth1/adapter.py", line 343, in delete
    return self.request(url, 'DELETE', **kwargs)
  File "/usr/lib/python2.7/site-packages/openstack/_adapter.py", line 164, in request
    return _json_response(response, error_message=error_message)
  File "/usr/lib/python2.7/site-packages/openstack/_adapter.py", line 95, in _json_response
    exceptions.raise_from_response(response, error_message=error_message)
  File "/usr/lib/python2.7/site-packages/openstack/exceptions.py", line 229, in raise_from_response
    http_status=http_status, request_id=request_id
ConflictException: Error deleting security group beb07bae-0207-4d19-b817-9922a4185c7a: Client Error for url: http://172.16.10.36:9696/v2.0/security-groups/beb07bae-0207-4d19-b817-9922a4185c7a.json, Security Group beb07bae-0207-4d19-b817-9922a4185c7a in use.
2019-08-21 16:01:16,103 - xtesting.ci.run_tests - ERROR - The test case 'juju_epc' failed.
2019-08-21 16:01:16,104 - xtesting.ci.run_tests - INFO - Xtesting report:

+----------------------+------------------+--------------+------------------+----------------+
|      TEST CASE       |     PROJECT      |     TIER     |     DURATION     |     RESULT     |
+----------------------+------------------+--------------+------------------+----------------+
|       cloudify       |     functest     |     vnf      |      05:55       |      PASS      |
|     cloudify_ims     |     functest     |     vnf      |      09:44       |      FAIL      |
|       heat_ims       |     functest     |     vnf      |      25:55       |      FAIL      |
|     vyos_vrouter     |     functest     |     vnf      |      08:22       |      FAIL      |
|       juju_epc       |     functest     |     vnf      |      13:13       |      FAIL      |
+----------------------+------------------+--------------+------------------+----------------+

2019-08-21 16:01:16,108 - xtesting.ci.run_tests - INFO - Execution exit value: Result.EX_ERROR
Regular expression run condition: Expression=[k8-.*], Label=[os-odl-ovs-noha]
Run condition [Regular expression match] preventing perform for step [Execute shell]
[functest-fuel-virtual-daily-hunter] $ /bin/bash /tmp/jenkins4660829808792348638.sh
Uploading logs to artifact logs/functest/ericsson-virtual2/hunter/2019-08-21_16-01-17
Logs can be found in https://artifacts.opnfv.org/logs_functest_ericsson-virtual2.html
https://artifacts.opnfv.org/logs/functest/ericsson-virtual2/hunter/2019-08-21_16-01-17/doctor-notification
https://artifacts.opnfv.org/logs/functest/ericsson-virtual2/hunter/2019-08-21_16-01-17/doctor-notification/doctor-notification.log
https://artifacts.opnfv.org/logs/functest/ericsson-virtual2/hunter/2019-08-21_16-01-17/rally_jobs
https://artifacts.opnfv.org/logs/functest/ericsson-virtual2/hunter/2019-08-21_16-01-17/rally_jobs/rally_jobs.xml
https://artifacts.opnfv.org/logs/functest/ericsson-virtual2/hunter/2019-08-21_16-01-17/rally_jobs/neutron.json
https://artifacts.opnfv.org/logs/functest/ericsson-virtual2/hunter/2019-08-21_16-01-17/rally_jobs/rally.log
https://artifacts.opnfv.org/logs/functest/ericsson-virtual2/hunter/2019-08-21_16-01-17/rally_jobs/rally_jobs.html
https://artifacts.opnfv.org/logs/functest/ericsson-virtual2/hunter/2019-08-21_16-01-17/tempest_smoke
https://artifacts.opnfv.org/logs/functest/ericsson-virtual2/hunter/2019-08-21_16-01-17/tempest_smoke/test_list.txt
https://artifacts.opnfv.org/logs/functest/ericsson-virtual2/hunter/2019-08-21_16-01-17/tempest_smoke/tempest.debug.log
https://artifacts.opnfv.org/logs/functest/ericsson-virtual2/hunter/2019-08-21_16-01-17/tempest_smoke/test_raw_list.txt
https://artifacts.opnfv.org/logs/functest/ericsson-virtual2/hunter/2019-08-21_16-01-17/tempest_smoke/tempest.conf
https://artifacts.opnfv.org/logs/functest/ericsson-virtual2/hunter/2019-08-21_16-01-17/tempest_smoke/tempest-report.html
https://artifacts.opnfv.org/logs/functest/ericsson-virtual2/hunter/2019-08-21_16-01-17/tempest_smoke/tempest.log
https://artifacts.opnfv.org/logs/functest/ericsson-virtual2/hunter/2019-08-21_16-01-17/tempest_smoke/rally.log
https://artifacts.opnfv.org/logs/functest/ericsson-virtual2/hunter/2019-08-21_16-01-17/tempest_smoke/rally.conf
https://artifacts.opnfv.org/logs/functest/ericsson-virtual2/hunter/2019-08-21_16-01-17/tempest_smoke/tempest-report.xml
https://artifacts.opnfv.org/logs/functest/ericsson-virtual2/hunter/2019-08-21_16-01-17/refstack_defcore
https://artifacts.opnfv.org/logs/functest/ericsson-virtual2/hunter/2019-08-21_16-01-17/refstack_defcore/test_list.txt
https://artifacts.opnfv.org/logs/functest/ericsson-virtual2/hunter/2019-08-21_16-01-17/refstack_defcore/tempest.debug.log
https://artifacts.opnfv.org/logs/functest/ericsson-virtual2/hunter/2019-08-21_16-01-17/refstack_defcore/test_raw_list.txt
https://artifacts.opnfv.org/logs/functest/ericsson-virtual2/hunter/2019-08-21_16-01-17/refstack_defcore/tempest.conf
https://artifacts.opnfv.org/logs/functest/ericsson-virtual2/hunter/2019-08-21_16-01-17/refstack_defcore/tempest-report.html
https://artifacts.opnfv.org/logs/functest/ericsson-virtual2/hunter/2019-08-21_16-01-17/refstack_defcore/tempest.log
https://artifacts.opnfv.org/logs/functest/ericsson-virtual2/hunter/2019-08-21_16-01-17/refstack_defcore/rally.log
https://artifacts.opnfv.org/logs/functest/ericsson-virtual2/hunter/2019-08-21_16-01-17/refstack_defcore/rally.conf
https://artifacts.opnfv.org/logs/functest/ericsson-virtual2/hunter/2019-08-21_16-01-17/refstack_defcore/tempest-report.xml
https://artifacts.opnfv.org/logs/functest/ericsson-virtual2/hunter/2019-08-21_16-01-17/rally_full
https://artifacts.opnfv.org/logs/functest/ericsson-virtual2/hunter/2019-08-21_16-01-17/rally_full/gnocchi.json
https://artifacts.opnfv.org/logs/functest/ericsson-virtual2/hunter/2019-08-21_16-01-17/rally_full/keystone.json
https://artifacts.opnfv.org/logs/functest/ericsson-virtual2/hunter/2019-08-21_16-01-17/rally_full/glance.json
https://artifacts.opnfv.org/logs/functest/ericsson-virtual2/hunter/2019-08-21_16-01-17/rally_full/rally_full.xml
https://artifacts.opnfv.org/logs/functest/ericsson-virtual2/hunter/2019-08-21_16-01-17/rally_full/quotas.json
https://artifacts.opnfv.org/logs/functest/ericsson-virtual2/hunter/2019-08-21_16-01-17/rally_full/neutron.json
https://artifacts.opnfv.org/logs/functest/ericsson-virtual2/hunter/2019-08-21_16-01-17/rally_full/heat.json
https://artifacts.opnfv.org/logs/functest/ericsson-virtual2/hunter/2019-08-21_16-01-17/rally_full/nova.json
https://artifacts.opnfv.org/logs/functest/ericsson-virtual2/hunter/2019-08-21_16-01-17/rally_full/authenticate.json
https://artifacts.opnfv.org/logs/functest/ericsson-virtual2/hunter/2019-08-21_16-01-17/rally_full/cinder.json
https://artifacts.opnfv.org/logs/functest/ericsson-virtual2/hunter/2019-08-21_16-01-17/rally_full/rally.log
https://artifacts.opnfv.org/logs/functest/ericsson-virtual2/hunter/2019-08-21_16-01-17/rally_full/rally_full.html
https://artifacts.opnfv.org/logs/functest/ericsson-virtual2/hunter/2019-08-21_16-01-17/functest.log
https://artifacts.opnfv.org/logs/functest/ericsson-virtual2/hunter/2019-08-21_16-01-17/vmtp
https://artifacts.opnfv.org/logs/functest/ericsson-virtual2/hunter/2019-08-21_16-01-17/vmtp/vmtp.conf
https://artifacts.opnfv.org/logs/functest/ericsson-virtual2/hunter/2019-08-21_16-01-17/juju_epc
https://artifacts.opnfv.org/logs/functest/ericsson-virtual2/hunter/2019-08-21_16-01-17/juju_epc/clouds.yaml
https://artifacts.opnfv.org/logs/functest/ericsson-virtual2/hunter/2019-08-21_16-01-17/juju_epc/credentials.yaml
https://artifacts.opnfv.org/logs/functest/ericsson-virtual2/hunter/2019-08-21_16-01-17/functest.debug.log
https://artifacts.opnfv.org/logs/functest/ericsson-virtual2/hunter/2019-08-21_16-01-17/patrole
https://artifacts.opnfv.org/logs/functest/ericsson-virtual2/hunter/2019-08-21_16-01-17/patrole/test_list.txt
https://artifacts.opnfv.org/logs/functest/ericsson-virtual2/hunter/2019-08-21_16-01-17/patrole/tempest.debug.log
https://artifacts.opnfv.org/logs/functest/ericsson-virtual2/hunter/2019-08-21_16-01-17/patrole/test_raw_list.txt
https://artifacts.opnfv.org/logs/functest/ericsson-virtual2/hunter/2019-08-21_16-01-17/patrole/tempest.conf
https://artifacts.opnfv.org/logs/functest/ericsson-virtual2/hunter/2019-08-21_16-01-17/patrole/tempest-report.html
https://artifacts.opnfv.org/logs/functest/ericsson-virtual2/hunter/2019-08-21_16-01-17/patrole/tempest.log
https://artifacts.opnfv.org/logs/functest/ericsson-virtual2/hunter/2019-08-21_16-01-17/patrole/rally.log
https://artifacts.opnfv.org/logs/functest/ericsson-virtual2/hunter/2019-08-21_16-01-17/patrole/rally.conf
https://artifacts.opnfv.org/logs/functest/ericsson-virtual2/hunter/2019-08-21_16-01-17/patrole/tempest-report.xml
https://artifacts.opnfv.org/logs/functest/ericsson-virtual2/hunter/2019-08-21_16-01-17/barbican
https://artifacts.opnfv.org/logs/functest/ericsson-virtual2/hunter/2019-08-21_16-01-17/barbican/test_list.txt
https://artifacts.opnfv.org/logs/functest/ericsson-virtual2/hunter/2019-08-21_16-01-17/barbican/tempest.debug.log
https://artifacts.opnfv.org/logs/functest/ericsson-virtual2/hunter/2019-08-21_16-01-17/barbican/test_raw_list.txt
https://artifacts.opnfv.org/logs/functest/ericsson-virtual2/hunter/2019-08-21_16-01-17/barbican/tempest.conf
https://artifacts.opnfv.org/logs/functest/ericsson-virtual2/hunter/2019-08-21_16-01-17/barbican/tempest-report.html
https://artifacts.opnfv.org/logs/functest/ericsson-virtual2/hunter/2019-08-21_16-01-17/barbican/tempest.log
https://artifacts.opnfv.org/logs/functest/ericsson-virtual2/hunter/2019-08-21_16-01-17/barbican/rally.log
https://artifacts.opnfv.org/logs/functest/ericsson-virtual2/hunter/2019-08-21_16-01-17/barbican/rally.conf
https://artifacts.opnfv.org/logs/functest/ericsson-virtual2/hunter/2019-08-21_16-01-17/barbican/tempest-report.xml
https://artifacts.opnfv.org/logs/functest/ericsson-virtual2/hunter/2019-08-21_16-01-17/tempest_scenario
https://artifacts.opnfv.org/logs/functest/ericsson-virtual2/hunter/2019-08-21_16-01-17/tempest_scenario/test_list.txt
https://artifacts.opnfv.org/logs/functest/ericsson-virtual2/hunter/2019-08-21_16-01-17/tempest_scenario/tempest.debug.log
https://artifacts.opnfv.org/logs/functest/ericsson-virtual2/hunter/2019-08-21_16-01-17/tempest_scenario/test_raw_list.txt
https://artifacts.opnfv.org/logs/functest/ericsson-virtual2/hunter/2019-08-21_16-01-17/tempest_scenario/tempest.conf
https://artifacts.opnfv.org/logs/functest/ericsson-virtual2/hunter/2019-08-21_16-01-17/tempest_scenario/tempest-report.html
https://artifacts.opnfv.org/logs/functest/ericsson-virtual2/hunter/2019-08-21_16-01-17/tempest_scenario/tempest.log
https://artifacts.opnfv.org/logs/functest/ericsson-virtual2/hunter/2019-08-21_16-01-17/tempest_scenario/rally.log
https://artifacts.opnfv.org/logs/functest/ericsson-virtual2/hunter/2019-08-21_16-01-17/tempest_scenario/rally.conf
https://artifacts.opnfv.org/logs/functest/ericsson-virtual2/hunter/2019-08-21_16-01-17/tempest_scenario/tempest-report.xml
https://artifacts.opnfv.org/logs/functest/ericsson-virtual2/hunter/2019-08-21_16-01-17/tempest_full
https://artifacts.opnfv.org/logs/functest/ericsson-virtual2/hunter/2019-08-21_16-01-17/tempest_full/test_list.txt
https://artifacts.opnfv.org/logs/functest/ericsson-virtual2/hunter/2019-08-21_16-01-17/tempest_full/tempest.debug.log
https://artifacts.opnfv.org/logs/functest/ericsson-virtual2/hunter/2019-08-21_16-01-17/tempest_full/test_raw_list.txt
https://artifacts.opnfv.org/logs/functest/ericsson-virtual2/hunter/2019-08-21_16-01-17/tempest_full/tempest.conf
https://artifacts.opnfv.org/logs/functest/ericsson-virtual2/hunter/2019-08-21_16-01-17/tempest_full/tempest-report.html
https://artifacts.opnfv.org/logs/functest/ericsson-virtual2/hunter/2019-08-21_16-01-17/tempest_full/tempest.log
https://artifacts.opnfv.org/logs/functest/ericsson-virtual2/hunter/2019-08-21_16-01-17/tempest_full/rally.log
https://artifacts.opnfv.org/logs/functest/ericsson-virtual2/hunter/2019-08-21_16-01-17/tempest_full/rally.conf
https://artifacts.opnfv.org/logs/functest/ericsson-virtual2/hunter/2019-08-21_16-01-17/tempest_full/tempest-report.xml
https://artifacts.opnfv.org/logs/functest/ericsson-virtual2/hunter/2019-08-21_16-01-17/shaker
https://artifacts.opnfv.org/logs/functest/ericsson-virtual2/hunter/2019-08-21_16-01-17/neutron-tempest-plugin-api
https://artifacts.opnfv.org/logs/functest/ericsson-virtual2/hunter/2019-08-21_16-01-17/neutron-tempest-plugin-api/test_list.txt
https://artifacts.opnfv.org/logs/functest/ericsson-virtual2/hunter/2019-08-21_16-01-17/neutron-tempest-plugin-api/tempest.debug.log
https://artifacts.opnfv.org/logs/functest/ericsson-virtual2/hunter/2019-08-21_16-01-17/neutron-tempest-plugin-api/test_raw_list.txt
https://artifacts.opnfv.org/logs/functest/ericsson-virtual2/hunter/2019-08-21_16-01-17/neutron-tempest-plugin-api/tempest.conf
https://artifacts.opnfv.org/logs/functest/ericsson-virtual2/hunter/2019-08-21_16-01-17/neutron-tempest-plugin-api/tempest-report.html
https://artifacts.opnfv.org/logs/functest/ericsson-virtual2/hunter/2019-08-21_16-01-17/neutron-tempest-plugin-api/tempest.log
https://artifacts.opnfv.org/logs/functest/ericsson-virtual2/hunter/2019-08-21_16-01-17/neutron-tempest-plugin-api/rally.log
https://artifacts.opnfv.org/logs/functest/ericsson-virtual2/hunter/2019-08-21_16-01-17/neutron-tempest-plugin-api/rally.conf
https://artifacts.opnfv.org/logs/functest/ericsson-virtual2/hunter/2019-08-21_16-01-17/neutron-tempest-plugin-api/tempest-report.xml
https://artifacts.opnfv.org/logs/functest/ericsson-virtual2/hunter/2019-08-21_16-01-17/neutron_trunk
https://artifacts.opnfv.org/logs/functest/ericsson-virtual2/hunter/2019-08-21_16-01-17/neutron_trunk/test_list.txt
https://artifacts.opnfv.org/logs/functest/ericsson-virtual2/hunter/2019-08-21_16-01-17/neutron_trunk/tempest.debug.log
https://artifacts.opnfv.org/logs/functest/ericsson-virtual2/hunter/2019-08-21_16-01-17/neutron_trunk/test_raw_list.txt
https://artifacts.opnfv.org/logs/functest/ericsson-virtual2/hunter/2019-08-21_16-01-17/neutron_trunk/tempest.conf
https://artifacts.opnfv.org/logs/functest/ericsson-virtual2/hunter/2019-08-21_16-01-17/neutron_trunk/tempest-report.html
https://artifacts.opnfv.org/logs/functest/ericsson-virtual2/hunter/2019-08-21_16-01-17/neutron_trunk/tempest.log
https://artifacts.opnfv.org/logs/functest/ericsson-virtual2/hunter/2019-08-21_16-01-17/neutron_trunk/rally.log
https://artifacts.opnfv.org/logs/functest/ericsson-virtual2/hunter/2019-08-21_16-01-17/neutron_trunk/rally.conf
https://artifacts.opnfv.org/logs/functest/ericsson-virtual2/hunter/2019-08-21_16-01-17/neutron_trunk/tempest-report.xml
https://artifacts.opnfv.org/logs/functest/ericsson-virtual2/hunter/2019-08-21_16-01-17/return_value
https://artifacts.opnfv.org/logs/functest/ericsson-virtual2/hunter/2019-08-21_16-01-17/odl
https://artifacts.opnfv.org/logs/functest/ericsson-virtual2/hunter/2019-08-21_16-01-17/odl/output.xml
https://artifacts.opnfv.org/logs/functest/ericsson-virtual2/hunter/2019-08-21_16-01-17/odl/report.html
https://artifacts.opnfv.org/logs/functest/ericsson-virtual2/hunter/2019-08-21_16-01-17/odl/xunit.xml
https://artifacts.opnfv.org/logs/functest/ericsson-virtual2/hunter/2019-08-21_16-01-17/odl/log.html
https://artifacts.opnfv.org/logs/functest/ericsson-virtual2/hunter/2019-08-21_16-01-17/rally_sanity
https://artifacts.opnfv.org/logs/functest/ericsson-virtual2/hunter/2019-08-21_16-01-17/rally_sanity/gnocchi.json
https://artifacts.opnfv.org/logs/functest/ericsson-virtual2/hunter/2019-08-21_16-01-17/rally_sanity/keystone.json
https://artifacts.opnfv.org/logs/functest/ericsson-virtual2/hunter/2019-08-21_16-01-17/rally_sanity/glance.json
https://artifacts.opnfv.org/logs/functest/ericsson-virtual2/hunter/2019-08-21_16-01-17/rally_sanity/rally_sanity.xml
https://artifacts.opnfv.org/logs/functest/ericsson-virtual2/hunter/2019-08-21_16-01-17/rally_sanity/rally_sanity.html
https://artifacts.opnfv.org/logs/functest/ericsson-virtual2/hunter/2019-08-21_16-01-17/rally_sanity/quotas.json
https://artifacts.opnfv.org/logs/functest/ericsson-virtual2/hunter/2019-08-21_16-01-17/rally_sanity/neutron.json
https://artifacts.opnfv.org/logs/functest/ericsson-virtual2/hunter/2019-08-21_16-01-17/rally_sanity/heat.json
https://artifacts.opnfv.org/logs/functest/ericsson-virtual2/hunter/2019-08-21_16-01-17/rally_sanity/nova.json
https://artifacts.opnfv.org/logs/functest/ericsson-virtual2/hunter/2019-08-21_16-01-17/rally_sanity/authenticate.json
https://artifacts.opnfv.org/logs/functest/ericsson-virtual2/hunter/2019-08-21_16-01-17/rally_sanity/cinder.json
https://artifacts.opnfv.org/logs/functest/ericsson-virtual2/hunter/2019-08-21_16-01-17/rally_sanity/rally.log
[functest-fuel-virtual-daily-hunter] $ /bin/bash /tmp/jenkins7093978235556785799.sh
Build step 'Execute shell' marked build as failure
New run name is '630 Suite: daily Scenario: os-odl-ovs-noha'
Email was triggered for: Failure - Any
Sending email for trigger: Failure - Any
Request made to compress build log
Sending email to: tbramwell@linuxfoundation.org agardner@linuxfoundation.org rgrigar@linuxfoundation.org
Finished: FAILURE