FailedConsole Output

Started by upstream project "fuel-os-odl-ovs-noha-virtual-daily-hunter" build number 116
originally caused by:
 Started by timer
Running as SYSTEM
[EnvInject] - Loading node environment variables.
Building remotely on ericsson-virtual1 (fuel-virtual ci-resource opnfv-sysinfo) in workspace /home/jenkins/opnfv/slave_root/workspace/functest-fuel-virtual-daily-hunter
using credential d42411ac011ad6f3dd2e1fa34eaa5d87f910eb2e
Wiping out workspace first.
Cloning the remote Git repository
Cloning repository https://gerrit.opnfv.org/gerrit/functest
 > git init /home/jenkins/opnfv/slave_root/workspace/functest-fuel-virtual-daily-hunter # timeout=10
Fetching upstream changes from https://gerrit.opnfv.org/gerrit/functest
 > git --version # timeout=10
using GIT_SSH to set credentials Jenkins Master SSH
 > git fetch --tags --progress https://gerrit.opnfv.org/gerrit/functest +refs/heads/*:refs/remotes/origin/* # timeout=15
 > git config remote.origin.url https://gerrit.opnfv.org/gerrit/functest # timeout=10
 > git config --add remote.origin.fetch +refs/heads/*:refs/remotes/origin/* # timeout=10
 > git config remote.origin.url https://gerrit.opnfv.org/gerrit/functest # timeout=10
Fetching upstream changes from https://gerrit.opnfv.org/gerrit/functest
using GIT_SSH to set credentials Jenkins Master SSH
 > git fetch --tags --progress https://gerrit.opnfv.org/gerrit/functest +refs/heads/*:refs/remotes/origin/* # timeout=15
 > git rev-parse refs/remotes/origin/stable/hunter^{commit} # timeout=10
 > git rev-parse refs/remotes/origin/origin/stable/hunter^{commit} # timeout=10
Checking out Revision f8800b23d406c8acad7acc62035d5425d7358338 (refs/remotes/origin/stable/hunter)
 > git config core.sparsecheckout # timeout=10
 > git checkout -f f8800b23d406c8acad7acc62035d5425d7358338 # timeout=15
Commit message: "Clean orphan security groups"
 > git rev-list --no-walk 288bed88ffb21b0978d7b21f333c5026eacbee61 # timeout=10
Run condition [Regular expression match] enabling prebuild for step [Execute shell]
Run condition [Regular expression match] enabling prebuild for step [Execute shell]
No emails were triggered.
New run name is '624 Suite: daily Scenario: os-odl-ovs-noha'
[description-setter] Description set: Built on ericsson-virtual1
[functest-fuel-virtual-daily-hunter] $ /bin/bash /tmp/jenkins7099712130715680675.sh
Cleaning up docker containers/images...
Regular expression run condition: Expression=[os-.*], Label=[os-odl-ovs-noha]
Run condition [Regular expression match] enabling perform for step [Execute shell]
[functest-fuel-virtual-daily-hunter] $ /usr/bin/env bash /tmp/jenkins3088485686154490688.sh
Map mcp ssh_key
<13>Aug 20 10:10:10 fetch_os_creds.info: Fetching rc file...
<13>Aug 20 10:10:10 fetch_os_creds.info: Verifying connectivity to 10.20.0.2...
<13>Aug 20 10:10:10 fetch_os_creds.info: 10.20.0.2 is reachable!
<13>Aug 20 10:10:11 fetch_os_creds.info: ... from controller 172.16.10.36 ...
Warning: Permanently added '172.16.10.36' (ECDSA) to the list of known hosts.
-------- Credentials: --------

export OS_IDENTITY_API_VERSION=3
export OS_PROJECT_DOMAIN_NAME=Default
export OS_USER_DOMAIN_NAME=Default
export OS_PROJECT_NAME=admin
export OS_TENANT_NAME=admin
export OS_USERNAME=admin
export OS_PASSWORD=opnfv_secret
export OS_REGION_NAME=RegionOne
export OS_INTERFACE=internal
export OS_ENDPOINT_TYPE="internal"
export OS_CACERT="/etc/ssl/certs/ca-certificates.crt"
export SDN_CONTROLLER_USER=admin
export SDN_CONTROLLER_RESTCONFPORT=8282
export SDN_CONTROLLER_PASSWORD=admin
export SDN_CONTROLLER_WEBPORT=8282
export SDN_CONTROLLER_IP=10.16.0.107
export VOLUME_DEVICE_NAME=sdc
export OS_AUTH_URL=http://172.16.10.36:35357/v3
Functest: Start Docker and prepare environment
Functest: Download images that will be used by test cases
+ wget_opts='-N --tries=1 --connect-timeout=30'
+ '[' -t 1 ']'
+ wget_opts='-N --tries=1 --connect-timeout=30 --progress=dot:giga'
+ cat
+ wget -N --tries=1 --connect-timeout=30 --progress=dot:giga -i - -P /home/jenkins/opnfv/functest/images
--2019-08-20 10:10:11--  http://download.cirros-cloud.net/0.4.0/cirros-0.4.0-x86_64-disk.img
Resolving download.cirros-cloud.net (download.cirros-cloud.net)... 64.90.42.85, 2607:f298:6:a036::bd6:a72a
Connecting to download.cirros-cloud.net (download.cirros-cloud.net)|64.90.42.85|:80... connected.
HTTP request sent, awaiting response... 304 Not Modified
File ‘/home/jenkins/opnfv/functest/images/cirros-0.4.0-x86_64-disk.img’ not modified on server. Omitting download.

--2019-08-20 10:10:12--  https://cloud-images.ubuntu.com/releases/14.04/release/ubuntu-14.04-server-cloudimg-amd64-disk1.img
Resolving cloud-images.ubuntu.com (cloud-images.ubuntu.com)... 91.189.88.89, 2001:67c:1560:8001::8001
Connecting to cloud-images.ubuntu.com (cloud-images.ubuntu.com)|91.189.88.89|:443... connected.
HTTP request sent, awaiting response... 302 Found
Location: https://cloud-images.ubuntu.com/releases/trusty/release/ubuntu-14.04-server-cloudimg-amd64-disk1.img [following]
--2019-08-20 10:10:12--  https://cloud-images.ubuntu.com/releases/trusty/release/ubuntu-14.04-server-cloudimg-amd64-disk1.img
Reusing existing connection to cloud-images.ubuntu.com:443.
HTTP request sent, awaiting response... 304 Not Modified
File ‘/home/jenkins/opnfv/functest/images/ubuntu-14.04-server-cloudimg-amd64-disk1.img’ not modified on server. Omitting download.

--2019-08-20 10:10:12--  https://cloud-images.ubuntu.com/releases/16.04/release/ubuntu-16.04-server-cloudimg-amd64-disk1.img
Reusing existing connection to cloud-images.ubuntu.com:443.
HTTP request sent, awaiting response... 302 Found
Location: https://cloud-images.ubuntu.com/releases/xenial/release/ubuntu-16.04-server-cloudimg-amd64-disk1.img [following]
--2019-08-20 10:10:12--  https://cloud-images.ubuntu.com/releases/xenial/release/ubuntu-16.04-server-cloudimg-amd64-disk1.img
Reusing existing connection to cloud-images.ubuntu.com:443.
HTTP request sent, awaiting response... 304 Not Modified
File ‘/home/jenkins/opnfv/functest/images/ubuntu-16.04-server-cloudimg-amd64-disk1.img’ not modified on server. Omitting download.

--2019-08-20 10:10:12--  http://download.cirros-cloud.net/0.4.0/cirros-0.4.0-aarch64-disk.img
Connecting to download.cirros-cloud.net (download.cirros-cloud.net)|64.90.42.85|:80... connected.
HTTP request sent, awaiting response... 304 Not Modified
File ‘/home/jenkins/opnfv/functest/images/cirros-0.4.0-aarch64-disk.img’ not modified on server. Omitting download.

--2019-08-20 10:10:12--  https://cloud-images.ubuntu.com/releases/14.04/release/ubuntu-14.04-server-cloudimg-arm64-uefi1.img
Connecting to cloud-images.ubuntu.com (cloud-images.ubuntu.com)|91.189.88.89|:443... connected.
HTTP request sent, awaiting response... 302 Found
Location: https://cloud-images.ubuntu.com/releases/trusty/release/ubuntu-14.04-server-cloudimg-arm64-uefi1.img [following]
--2019-08-20 10:10:13--  https://cloud-images.ubuntu.com/releases/trusty/release/ubuntu-14.04-server-cloudimg-arm64-uefi1.img
Reusing existing connection to cloud-images.ubuntu.com:443.
HTTP request sent, awaiting response... 304 Not Modified
File ‘/home/jenkins/opnfv/functest/images/ubuntu-14.04-server-cloudimg-arm64-uefi1.img’ not modified on server. Omitting download.

--2019-08-20 10:10:13--  http://repository.cloudifysource.org/cloudify/19.01.24/community-release/cloudify-docker-manager-community-19.01.24.tar
Resolving repository.cloudifysource.org (repository.cloudifysource.org)... 99.86.255.61, 99.86.255.119, 99.86.255.139, ...
Connecting to repository.cloudifysource.org (repository.cloudifysource.org)|99.86.255.61|:80... connected.
HTTP request sent, awaiting response... 304 Not Modified
File ‘/home/jenkins/opnfv/functest/images/cloudify-docker-manager-community-19.01.24.tar’ not modified on server. Omitting download.

--2019-08-20 10:10:13--  http://testresults.opnfv.org/functest/vyos-1.1.8-amd64.qcow2
Resolving testresults.opnfv.org (testresults.opnfv.org)... 104.154.71.112
Connecting to testresults.opnfv.org (testresults.opnfv.org)|104.154.71.112|:80... connected.
HTTP request sent, awaiting response... 304 Not Modified
File ‘/home/jenkins/opnfv/functest/images/vyos-1.1.8-amd64.qcow2’ not modified on server. Omitting download.

--2019-08-20 10:10:13--  http://testresults.opnfv.org/functest/shaker-image.qcow2
Reusing existing connection to testresults.opnfv.org:80.
HTTP request sent, awaiting response... 304 Not Modified
File ‘/home/jenkins/opnfv/functest/images/shaker-image.qcow2’ not modified on server. Omitting download.

--2019-08-20 10:10:13--  http://testresults.opnfv.org/functest/shaker-image-arm64.qcow2
Reusing existing connection to testresults.opnfv.org:80.
HTTP request sent, awaiting response... 304 Not Modified
File ‘/home/jenkins/opnfv/functest/images/shaker-image-arm64.qcow2’ not modified on server. Omitting download.

Warning: Permanently added '10.20.0.2' (ECDSA) to the list of known hosts.
tempest_conf.yaml:
---
compute-feature-enabled:
    shelve: false
    vnc_console: false
    spice_console: true
identity-feature-enabled:
    api_v2: false
    api_v2_admin: false
image-feature-enabled:
    api_v2: true
    api_v1: false
volume:
    storage_protocol: iSCSI
volume-feature-enabled:
    backup: false
compute:
    max_microversion: 2.65
Functest: Pulling Functest Docker image opnfv/functest-healthcheck:hunter ...
Running Functest tier 'healthcheck'. CMD: docker run --rm  -e INSTALLER_TYPE=fuel -e INSTALLER_IP=10.20.0.2     -e NODE_NAME=ericsson-virtual1 -e DEPLOY_SCENARIO=os-odl-ovs-noha     -e BUILD_TAG=jenkins-functest-fuel-virtual-daily-hunter-624 -e DEPLOY_TYPE=virt -e CI_LOOP=daily     -e TEST_DB_URL=http://testresults.opnfv.org/test/api/v1/results -e ENERGY_RECORDER_API_URL=http://energy.opnfv.fr/resources     -e DEBUG=true -e POD_ARCH=x86_64 -e BLOCK_MIGRATION=false -e SDN_CONTROLLER_RESTCONFPORT=8080 -e IMAGE_PROPERTIES=hw_disk_bus:scsi,hw_scsi_model:virtio-scsi,hw_mem_page_size:large -e FLAVOR_EXTRA_SPECS=hw:mem_page_size:large -v /home/jenkins/opnfv/functest/images:/home/opnfv/functest/images -v /home/jenkins/opnfv/functest/results/hunter:/home/opnfv/functest/results -v /var/lib/opnfv/mcp.rsa:/root/.ssh/id_rsa       -v /home/jenkins/opnfv-openrc.sh:/home/opnfv/functest/conf/env_file      -v /tmp/tmp.cZ5b6X5yd6:/usr/lib/python2.7/site-packages/functest/opnfv_tests/openstack/tempest/custom_tests/tempest_conf.yaml  opnfv/functest-healthcheck:hunter /bin/bash -c 'run_tests -r -t all'
2019-08-20 08:10:30,766 - xtesting.ci.run_tests - INFO - Deployment description:

+--------------------------------------+----------------------------------------------------------+
|               ENV VAR                |                          VALUE                           |
+--------------------------------------+----------------------------------------------------------+
|              BUILD_TAG               |      jenkins-functest-fuel-virtual-daily-hunter-624      |
|             TEST_DB_URL              |     http://testresults.opnfv.org/test/api/v1/results     |
|     ENERGY_RECORDER_API_PASSWORD     |                                                          |
|               CI_LOOP                |                          daily                           |
|                DEBUG                 |                           true                           |
|            INSTALLER_TYPE            |                           fuel                           |
|       ENERGY_RECORDER_API_URL        |             http://energy.opnfv.fr/resources             |
|           DEPLOY_SCENARIO            |                     os-odl-ovs-noha                      |
|       ENERGY_RECORDER_API_USER       |                                                          |
|              NODE_NAME               |                    ericsson-virtual1                     |
+--------------------------------------+----------------------------------------------------------+

2019-08-20 08:10:30,771 - xtesting.ci.run_tests - INFO - Sourcing env file /var/lib/xtesting/conf/env_file


export OS_IDENTITY_API_VERSION=3
export OS_PROJECT_DOMAIN_NAME=Default
export OS_USER_DOMAIN_NAME=Default
export OS_PROJECT_NAME=admin
export OS_TENANT_NAME=admin
export OS_USERNAME=admin
export OS_PASSWORD=opnfv_secret
export OS_REGION_NAME=RegionOne
export OS_INTERFACE=internal
export OS_ENDPOINT_TYPE="internal"
export OS_CACERT="/etc/ssl/certs/ca-certificates.crt"
export SDN_CONTROLLER_USER=admin
export SDN_CONTROLLER_RESTCONFPORT=8282
export SDN_CONTROLLER_PASSWORD=admin
export SDN_CONTROLLER_WEBPORT=8282
export SDN_CONTROLLER_IP=10.16.0.107
export VOLUME_DEVICE_NAME=sdc
export OS_AUTH_URL=http://172.16.10.36:35357/v3

2019-08-20 08:10:30,772 - xtesting.ci.run_tests - INFO - TESTS TO BE EXECUTED:

+---------------------+---------------+-------------------------------------------------+------------------------------------------+
|        TIERS        |     ORDER     |                   DESCRIPTION                   |                TESTCASES                 |
+---------------------+---------------+-------------------------------------------------+------------------------------------------+
|     healthcheck     |       0       |     First tier to be executed to verify the     |     connection_check tenantnetwork1      |
|                     |               |           basic operations in the VIM.          |     tenantnetwork2 vmready1 vmready2     |
|                     |               |                                                 |      singlevm1 singlevm2 vping_ssh       |
|                     |               |                                                 |      vping_userdata cinder_test odl      |
|                     |               |                                                 |              tempest_smoke               |
+---------------------+---------------+-------------------------------------------------+------------------------------------------+

2019-08-20 08:10:30,803 - xtesting.ci.run_tests - INFO - Loading test case 'connection_check'...
2019-08-20 08:10:31,113 - xtesting.ci.run_tests - INFO - Running test case 'connection_check'...
2019-08-20 08:10:34,824 - xtesting.core.testcase - INFO - The results were successfully pushed to DB
2019-08-20 08:10:34,825 - xtesting.ci.run_tests - INFO - Test result:

+--------------------------+------------------+------------------+----------------+
|        TEST CASE         |     PROJECT      |     DURATION     |     RESULT     |
+--------------------------+------------------+------------------+----------------+
|     connection_check     |     functest     |      00:03       |      PASS      |
+--------------------------+------------------+------------------+----------------+

2019-08-20 08:10:34,859 - xtesting.ci.run_tests - INFO - Loading test case 'tenantnetwork1'...
2019-08-20 08:10:36,253 - xtesting.ci.run_tests - INFO - Running test case 'tenantnetwork1'...
2019-08-20 08:10:42,811 - xtesting.core.testcase - INFO - The results were successfully pushed to DB
2019-08-20 08:10:42,812 - xtesting.ci.run_tests - INFO - Test result:

+------------------------+------------------+------------------+----------------+
|       TEST CASE        |     PROJECT      |     DURATION     |     RESULT     |
+------------------------+------------------+------------------+----------------+
|     tenantnetwork1     |     functest     |      00:06       |      PASS      |
+------------------------+------------------+------------------+----------------+

2019-08-20 08:10:51,869 - xtesting.ci.run_tests - INFO - Loading test case 'tenantnetwork2'...
2019-08-20 08:10:53,828 - xtesting.ci.run_tests - INFO - Running test case 'tenantnetwork2'...
2019-08-20 08:11:00,377 - xtesting.core.testcase - INFO - The results were successfully pushed to DB
2019-08-20 08:11:00,378 - xtesting.ci.run_tests - INFO - Test result:

+------------------------+------------------+------------------+----------------+
|       TEST CASE        |     PROJECT      |     DURATION     |     RESULT     |
+------------------------+------------------+------------------+----------------+
|     tenantnetwork2     |     functest     |      00:06       |      PASS      |
+------------------------+------------------+------------------+----------------+

2019-08-20 08:11:10,366 - xtesting.ci.run_tests - INFO - Loading test case 'vmready1'...
2019-08-20 08:11:11,458 - xtesting.ci.run_tests - INFO - Running test case 'vmready1'...
2019-08-20 08:11:21,077 - xtesting.core.testcase - INFO - The results were successfully pushed to DB
2019-08-20 08:11:21,077 - xtesting.ci.run_tests - INFO - Test result:

+-------------------+------------------+------------------+----------------+
|     TEST CASE     |     PROJECT      |     DURATION     |     RESULT     |
+-------------------+------------------+------------------+----------------+
|      vmready1     |     functest     |      00:09       |      PASS      |
+-------------------+------------------+------------------+----------------+

2019-08-20 08:11:30,060 - xtesting.ci.run_tests - INFO - Loading test case 'vmready2'...
2019-08-20 08:11:31,729 - xtesting.ci.run_tests - INFO - Running test case 'vmready2'...
2019-08-20 08:11:39,929 - xtesting.core.testcase - INFO - The results were successfully pushed to DB
2019-08-20 08:11:39,930 - xtesting.ci.run_tests - INFO - Test result:

+-------------------+------------------+------------------+----------------+
|     TEST CASE     |     PROJECT      |     DURATION     |     RESULT     |
+-------------------+------------------+------------------+----------------+
|      vmready2     |     functest     |      00:08       |      PASS      |
+-------------------+------------------+------------------+----------------+

2019-08-20 08:11:51,054 - xtesting.ci.run_tests - INFO - Loading test case 'singlevm1'...
2019-08-20 08:11:51,806 - xtesting.ci.run_tests - INFO - Running test case 'singlevm1'...
2019-08-20 08:12:34,952 - xtesting.core.testcase - INFO - The results were successfully pushed to DB
2019-08-20 08:12:34,953 - xtesting.ci.run_tests - INFO - Test result:

+-------------------+------------------+------------------+----------------+
|     TEST CASE     |     PROJECT      |     DURATION     |     RESULT     |
+-------------------+------------------+------------------+----------------+
|     singlevm1     |     functest     |      00:43       |      PASS      |
+-------------------+------------------+------------------+----------------+

2019-08-20 08:12:47,110 - xtesting.ci.run_tests - INFO - Loading test case 'singlevm2'...
2019-08-20 08:12:48,739 - xtesting.ci.run_tests - INFO - Running test case 'singlevm2'...
2019-08-20 08:13:22,039 - xtesting.core.testcase - INFO - The results were successfully pushed to DB
2019-08-20 08:13:22,039 - xtesting.ci.run_tests - INFO - Test result:

+-------------------+------------------+------------------+----------------+
|     TEST CASE     |     PROJECT      |     DURATION     |     RESULT     |
+-------------------+------------------+------------------+----------------+
|     singlevm2     |     functest     |      00:33       |      PASS      |
+-------------------+------------------+------------------+----------------+

2019-08-20 08:13:35,306 - xtesting.ci.run_tests - INFO - Loading test case 'vping_ssh'...
2019-08-20 08:13:37,034 - xtesting.ci.run_tests - INFO - Running test case 'vping_ssh'...
2019-08-20 08:14:34,096 - xtesting.core.testcase - INFO - The results were successfully pushed to DB
2019-08-20 08:14:34,096 - xtesting.ci.run_tests - INFO - Test result:

+-------------------+------------------+------------------+----------------+
|     TEST CASE     |     PROJECT      |     DURATION     |     RESULT     |
+-------------------+------------------+------------------+----------------+
|     vping_ssh     |     functest     |      00:57       |      PASS      |
+-------------------+------------------+------------------+----------------+

2019-08-20 08:14:50,678 - xtesting.ci.run_tests - INFO - Loading test case 'vping_userdata'...
2019-08-20 08:14:52,539 - xtesting.ci.run_tests - INFO - Running test case 'vping_userdata'...
2019-08-20 08:15:38,834 - xtesting.core.testcase - INFO - The results were successfully pushed to DB
2019-08-20 08:15:38,835 - xtesting.ci.run_tests - INFO - Test result:

+------------------------+------------------+------------------+----------------+
|       TEST CASE        |     PROJECT      |     DURATION     |     RESULT     |
+------------------------+------------------+------------------+----------------+
|     vping_userdata     |     functest     |      00:46       |      PASS      |
+------------------------+------------------+------------------+----------------+

2019-08-20 08:15:53,882 - xtesting.ci.run_tests - INFO - Loading test case 'cinder_test'...
2019-08-20 08:15:55,984 - xtesting.ci.run_tests - INFO - Running test case 'cinder_test'...
2019-08-20 08:17:47,242 - xtesting.core.testcase - INFO - The results were successfully pushed to DB
2019-08-20 08:17:47,242 - xtesting.ci.run_tests - INFO - Test result:

+---------------------+------------------+------------------+----------------+
|      TEST CASE      |     PROJECT      |     DURATION     |     RESULT     |
+---------------------+------------------+------------------+----------------+
|     cinder_test     |     functest     |      01:51       |      PASS      |
+---------------------+------------------+------------------+----------------+

2019-08-20 08:18:07,267 - xtesting.ci.run_tests - INFO - Loading test case 'odl'...
2019-08-20 08:18:07,475 - xtesting.ci.run_tests - INFO - Running test case 'odl'...
[ WARN ] Deprecation Warning: Use Post Request in the future
2019-08-20 08:18:26,634 - xtesting.core.robotframework - INFO - 
==============================================================================
Basic & Neutron                                                               
==============================================================================
Basic & Neutron.Basic                                                         
==============================================================================
Basic & Neutron.Basic.Restconf Modules :: Test suite to verify Restconf is OK.
==============================================================================
Get Controller Modules :: Get the restconf modules, check 200 stat... | PASS |
------------------------------------------------------------------------------
Basic & Neutron.Basic.Restconf Modules :: Test suite to verify Res... | PASS |
1 critical test, 1 passed, 0 failed
1 test total, 1 passed, 0 failed
==============================================================================
Basic & Neutron.Basic                                                 | PASS |
1 critical test, 1 passed, 0 failed
1 test total, 1 passed, 0 failed
==============================================================================
Basic & Neutron.Neutron :: Test suite for Neutron Plugin                      
==============================================================================
Basic & Neutron.Neutron.Reachability                                          
==============================================================================
Get the complete list of networks :: Get the complete list of netw... | PASS |
------------------------------------------------------------------------------
Get the complete list of subnets :: Get the complete list of subnets  | PASS |
------------------------------------------------------------------------------
Get the complete list of ports :: Get the complete list of ports      | PASS |
------------------------------------------------------------------------------
Basic & Neutron.Neutron.Reachability                                  | PASS |
3 critical tests, 3 passed, 0 failed
3 tests total, 3 passed, 0 failed
==============================================================================
Basic & Neutron.Neutron.Networks :: Checking Network created in OpenStack a...
==============================================================================
Check OpenStack Networks :: Checking OpenStack Neutron for known n... | PASS |
------------------------------------------------------------------------------
Check OpenDaylight Networks :: Checking OpenDaylight Neutron API f... | PASS |
------------------------------------------------------------------------------
Create Network :: Create new network in OpenStack                     | PASS |
------------------------------------------------------------------------------
Check Network :: Check network created in OpenDaylight                | PASS |
------------------------------------------------------------------------------
Basic & Neutron.Neutron.Networks :: Checking Network created in Op... | PASS |
4 critical tests, 4 passed, 0 failed
4 tests total, 4 passed, 0 failed
==============================================================================
Basic & Neutron.Neutron.Subnets :: Checking Subnets created in OpenStack ar...
==============================================================================
Check OpenStack Subnets :: Checking OpenStack Neutron for known su... | PASS |
------------------------------------------------------------------------------
Check OpenDaylight subnets :: Checking OpenDaylight Neutron API fo... | PASS |
------------------------------------------------------------------------------
Create New subnet :: Create new subnet in OpenStack                   | PASS |
------------------------------------------------------------------------------
Check New subnet :: Check new subnet created in OpenDaylight          | PASS |
------------------------------------------------------------------------------
Basic & Neutron.Neutron.Subnets :: Checking Subnets created in Ope... | PASS |
4 critical tests, 4 passed, 0 failed
4 tests total, 4 passed, 0 failed
==============================================================================
Basic & Neutron.Neutron.Ports :: Checking Port created in OpenStack are pus...
==============================================================================
Check OpenStack ports :: Checking OpenStack Neutron for known ports   | PASS |
------------------------------------------------------------------------------
Check OpenDaylight ports :: Checking OpenDaylight Neutron API for ... | PASS |
------------------------------------------------------------------------------
Create New Port :: Create new port in OpenStack                       | PASS |
------------------------------------------------------------------------------
Check New Port :: Check new port created in OpenDaylight              | PASS |
------------------------------------------------------------------------------
Basic & Neutron.Neutron.Ports :: Checking Port created in OpenStac... | PASS |
4 critical tests, 4 passed, 0 failed
4 tests total, 4 passed, 0 failed
==============================================================================
Basic & Neutron.Neutron.Delete Ports :: Checking Port deleted in OpenStack ...
==============================================================================
Delete New Port :: Delete previously created port in OpenStack        | PASS |
------------------------------------------------------------------------------
Check Port Deleted :: Check port deleted in OpenDaylight              | PASS |
------------------------------------------------------------------------------
Basic & Neutron.Neutron.Delete Ports :: Checking Port deleted in O... | PASS |
2 critical tests, 2 passed, 0 failed
2 tests total, 2 passed, 0 failed
==============================================================================
Basic & Neutron.Neutron.Delete Subnets :: Checking Subnets deleted in OpenS...
==============================================================================
Delete New subnet :: Delete previously created subnet in OpenStack    | PASS |
------------------------------------------------------------------------------
Check New subnet deleted :: Check subnet deleted in OpenDaylight      | PASS |
------------------------------------------------------------------------------
Basic & Neutron.Neutron.Delete Subnets :: Checking Subnets deleted... | PASS |
2 critical tests, 2 passed, 0 failed
2 tests total, 2 passed, 0 failed
==============================================================================
Basic & Neutron.Neutron.Delete Networks :: Checking Network deleted in Open...
==============================================================================
Delete Network :: Delete network in OpenStack                         | PASS |
------------------------------------------------------------------------------
Check Network deleted :: Check network deleted in OpenDaylight        | PASS |
------------------------------------------------------------------------------
Basic & Neutron.Neutron.Delete Networks :: Checking Network delete... | PASS |
2 critical tests, 2 passed, 0 failed
2 tests total, 2 passed, 0 failed
==============================================================================
Basic & Neutron.Neutron :: Test suite for Neutron Plugin              | PASS |
21 critical tests, 21 passed, 0 failed
21 tests total, 21 passed, 0 failed
==============================================================================
Basic & Neutron                                                       | PASS |
22 critical tests, 22 passed, 0 failed
22 tests total, 22 passed, 0 failed
==============================================================================
Output:  /home/opnfv/functest/results/odl/output.xml

2019-08-20 08:18:26,659 - xtesting.core.robotframework - INFO - Results were successfully parsed
2019-08-20 08:18:26,793 - xtesting.core.robotframework - INFO - Results were successfully generated
2019-08-20 08:18:27,075 - xtesting.core.testcase - INFO - The results were successfully pushed to DB
2019-08-20 08:18:27,075 - xtesting.ci.run_tests - INFO - Test result:

+-------------------+------------------+------------------+----------------+
|     TEST CASE     |     PROJECT      |     DURATION     |     RESULT     |
+-------------------+------------------+------------------+----------------+
|        odl        |     functest     |      00:19       |      PASS      |
+-------------------+------------------+------------------+----------------+

2019-08-20 08:18:27,109 - xtesting.ci.run_tests - INFO - Loading test case 'tempest_smoke'...
2019-08-20 08:18:30,401 - xtesting.ci.run_tests - INFO - Running test case 'tempest_smoke'...
2019-08-20 08:23:14,189 - xtesting.core.testcase - INFO - The results were successfully pushed to DB
2019-08-20 08:23:14,189 - xtesting.ci.run_tests - INFO - Test result:

+-----------------------+------------------+------------------+----------------+
|       TEST CASE       |     PROJECT      |     DURATION     |     RESULT     |
+-----------------------+------------------+------------------+----------------+
|     tempest_smoke     |     functest     |      04:43       |      PASS      |
+-----------------------+------------------+------------------+----------------+

2019-08-20 08:23:24,000 - xtesting.ci.run_tests - INFO - Xtesting report:

+--------------------------+------------------+---------------------+------------------+----------------+
|        TEST CASE         |     PROJECT      |         TIER        |     DURATION     |     RESULT     |
+--------------------------+------------------+---------------------+------------------+----------------+
|     connection_check     |     functest     |     healthcheck     |      00:03       |      PASS      |
|      tenantnetwork1      |     functest     |     healthcheck     |      00:06       |      PASS      |
|      tenantnetwork2      |     functest     |     healthcheck     |      00:06       |      PASS      |
|         vmready1         |     functest     |     healthcheck     |      00:09       |      PASS      |
|         vmready2         |     functest     |     healthcheck     |      00:08       |      PASS      |
|        singlevm1         |     functest     |     healthcheck     |      00:43       |      PASS      |
|        singlevm2         |     functest     |     healthcheck     |      00:33       |      PASS      |
|        vping_ssh         |     functest     |     healthcheck     |      00:57       |      PASS      |
|      vping_userdata      |     functest     |     healthcheck     |      00:46       |      PASS      |
|       cinder_test        |     functest     |     healthcheck     |      01:51       |      PASS      |
|           odl            |     functest     |     healthcheck     |      00:19       |      PASS      |
|      tempest_smoke       |     functest     |     healthcheck     |      04:43       |      PASS      |
+--------------------------+------------------+---------------------+------------------+----------------+

2019-08-20 08:23:24,015 - xtesting.ci.run_tests - INFO - Execution exit value: Result.EX_OK
Functest: Pulling Functest Docker image opnfv/functest-smoke:hunter ...
Running Functest tier 'smoke'. CMD: docker run --rm  -e INSTALLER_TYPE=fuel -e INSTALLER_IP=10.20.0.2     -e NODE_NAME=ericsson-virtual1 -e DEPLOY_SCENARIO=os-odl-ovs-noha     -e BUILD_TAG=jenkins-functest-fuel-virtual-daily-hunter-624 -e DEPLOY_TYPE=virt -e CI_LOOP=daily     -e TEST_DB_URL=http://testresults.opnfv.org/test/api/v1/results -e ENERGY_RECORDER_API_URL=http://energy.opnfv.fr/resources     -e DEBUG=true -e POD_ARCH=x86_64 -e BLOCK_MIGRATION=false -e SDN_CONTROLLER_RESTCONFPORT=8080 -e IMAGE_PROPERTIES=hw_disk_bus:scsi,hw_scsi_model:virtio-scsi,hw_mem_page_size:large -e FLAVOR_EXTRA_SPECS=hw:mem_page_size:large -v /home/jenkins/opnfv/functest/images:/home/opnfv/functest/images -v /home/jenkins/opnfv/functest/results/hunter:/home/opnfv/functest/results -v /var/lib/opnfv/mcp.rsa:/root/.ssh/id_rsa       -v /home/jenkins/opnfv-openrc.sh:/home/opnfv/functest/conf/env_file      -v /tmp/tmp.cZ5b6X5yd6:/usr/lib/python2.7/site-packages/functest/opnfv_tests/openstack/tempest/custom_tests/tempest_conf.yaml  opnfv/functest-smoke:hunter /bin/bash -c 'run_tests -r -t all'
2019-08-20 08:23:37,215 - xtesting.ci.run_tests - INFO - Deployment description:

+--------------------------------------+----------------------------------------------------------+
|               ENV VAR                |                          VALUE                           |
+--------------------------------------+----------------------------------------------------------+
|              BUILD_TAG               |      jenkins-functest-fuel-virtual-daily-hunter-624      |
|             TEST_DB_URL              |     http://testresults.opnfv.org/test/api/v1/results     |
|     ENERGY_RECORDER_API_PASSWORD     |                                                          |
|               CI_LOOP                |                          daily                           |
|                DEBUG                 |                           true                           |
|            INSTALLER_TYPE            |                           fuel                           |
|       ENERGY_RECORDER_API_URL        |             http://energy.opnfv.fr/resources             |
|           DEPLOY_SCENARIO            |                     os-odl-ovs-noha                      |
|       ENERGY_RECORDER_API_USER       |                                                          |
|              NODE_NAME               |                    ericsson-virtual1                     |
+--------------------------------------+----------------------------------------------------------+

2019-08-20 08:23:37,220 - xtesting.ci.run_tests - INFO - Sourcing env file /var/lib/xtesting/conf/env_file


export OS_IDENTITY_API_VERSION=3
export OS_PROJECT_DOMAIN_NAME=Default
export OS_USER_DOMAIN_NAME=Default
export OS_PROJECT_NAME=admin
export OS_TENANT_NAME=admin
export OS_USERNAME=admin
export OS_PASSWORD=opnfv_secret
export OS_REGION_NAME=RegionOne
export OS_INTERFACE=internal
export OS_ENDPOINT_TYPE="internal"
export OS_CACERT="/etc/ssl/certs/ca-certificates.crt"
export SDN_CONTROLLER_USER=admin
export SDN_CONTROLLER_RESTCONFPORT=8282
export SDN_CONTROLLER_PASSWORD=admin
export SDN_CONTROLLER_WEBPORT=8282
export SDN_CONTROLLER_IP=10.16.0.107
export VOLUME_DEVICE_NAME=sdc
export OS_AUTH_URL=http://172.16.10.36:35357/v3

2019-08-20 08:23:37,222 - xtesting.ci.run_tests - INFO - TESTS TO BE EXECUTED:

+---------------+---------------+------------------------------------------+-------------------------------------------------+
|     TIERS     |     ORDER     |               DESCRIPTION                |                    TESTCASES                    |
+---------------+---------------+------------------------------------------+-------------------------------------------------+
|     smoke     |       1       |     Set of basic Functional tests to     |     neutron-tempest-plugin-api rally_sanity     |
|               |               |      validate the OPNFV scenarios.       |          refstack_defcore tempest_full          |
|               |               |                                          |      tempest_scenario patrole neutron_trunk     |
|               |               |                                          |         networking-bgpvpn networking-sfc        |
|               |               |                                          |                     barbican                    |
+---------------+---------------+------------------------------------------+-------------------------------------------------+

2019-08-20 08:23:37,257 - xtesting.ci.run_tests - INFO - Loading test case 'neutron-tempest-plugin-api'...
2019-08-20 08:23:40,964 - xtesting.ci.run_tests - INFO - Running test case 'neutron-tempest-plugin-api'...
2019-08-20 08:35:38,436 - xtesting.core.testcase - INFO - The results were successfully pushed to DB
2019-08-20 08:35:38,436 - xtesting.ci.run_tests - INFO - Test result:

+------------------------------------+------------------+------------------+----------------+
|             TEST CASE              |     PROJECT      |     DURATION     |     RESULT     |
+------------------------------------+------------------+------------------+----------------+
|     neutron-tempest-plugin-api     |     functest     |      11:57       |      FAIL      |
+------------------------------------+------------------+------------------+----------------+

2019-08-20 08:35:48,291 - xtesting.ci.run_tests - ERROR - The test case 'neutron-tempest-plugin-api' failed.
2019-08-20 08:35:48,325 - xtesting.ci.run_tests - INFO - Loading test case 'rally_sanity'...
2019-08-20 08:35:50,671 - xtesting.ci.run_tests - INFO - Running test case 'rally_sanity'...
2019-08-20 08:54:28,461 - xtesting.core.testcase - INFO - The results were successfully pushed to DB
2019-08-20 08:54:28,461 - xtesting.ci.run_tests - INFO - Test result:

+----------------------+------------------+------------------+----------------+
|      TEST CASE       |     PROJECT      |     DURATION     |     RESULT     |
+----------------------+------------------+------------------+----------------+
|     rally_sanity     |     functest     |      18:37       |      FAIL      |
+----------------------+------------------+------------------+----------------+

2019-08-20 08:54:38,421 - xtesting.ci.run_tests - ERROR - The test case 'rally_sanity' failed.
2019-08-20 08:54:38,467 - xtesting.ci.run_tests - INFO - Loading test case 'refstack_defcore'...
2019-08-20 08:54:41,828 - xtesting.ci.run_tests - INFO - Running test case 'refstack_defcore'...
2019-08-20 09:03:07,848 - xtesting.core.testcase - INFO - The results were successfully pushed to DB
2019-08-20 09:03:07,848 - xtesting.ci.run_tests - INFO - Test result:

+--------------------------+------------------+------------------+----------------+
|        TEST CASE         |     PROJECT      |     DURATION     |     RESULT     |
+--------------------------+------------------+------------------+----------------+
|     refstack_defcore     |     functest     |      08:26       |      PASS      |
+--------------------------+------------------+------------------+----------------+

2019-08-20 09:03:18,643 - xtesting.ci.run_tests - INFO - Loading test case 'tempest_full'...
2019-08-20 09:03:22,136 - xtesting.ci.run_tests - INFO - Running test case 'tempest_full'...
2019-08-20 09:55:24,198 - xtesting.core.testcase - INFO - The results were successfully pushed to DB
2019-08-20 09:55:24,199 - xtesting.ci.run_tests - INFO - Test result:

+----------------------+------------------+------------------+----------------+
|      TEST CASE       |     PROJECT      |     DURATION     |     RESULT     |
+----------------------+------------------+------------------+----------------+
|     tempest_full     |     functest     |      52:01       |      FAIL      |
+----------------------+------------------+------------------+----------------+

2019-08-20 09:55:34,835 - xtesting.ci.run_tests - ERROR - The test case 'tempest_full' failed.
2019-08-20 09:55:34,869 - xtesting.ci.run_tests - INFO - Loading test case 'tempest_scenario'...
2019-08-20 09:55:38,073 - xtesting.ci.run_tests - INFO - Running test case 'tempest_scenario'...
2019-08-20 10:05:44,422 - xtesting.core.testcase - INFO - The results were successfully pushed to DB
2019-08-20 10:05:44,422 - xtesting.ci.run_tests - INFO - Test result:

+--------------------------+------------------+------------------+----------------+
|        TEST CASE         |     PROJECT      |     DURATION     |     RESULT     |
+--------------------------+------------------+------------------+----------------+
|     tempest_scenario     |     functest     |      10:06       |      PASS      |
+--------------------------+------------------+------------------+----------------+

2019-08-20 10:05:54,955 - xtesting.ci.run_tests - INFO - Loading test case 'patrole'...
2019-08-20 10:05:58,153 - xtesting.ci.run_tests - INFO - Running test case 'patrole'...
2019-08-20 10:09:07,844 - xtesting.core.testcase - INFO - The results were successfully pushed to DB
2019-08-20 10:09:07,845 - xtesting.ci.run_tests - INFO - Test result:

+-------------------+------------------+------------------+----------------+
|     TEST CASE     |     PROJECT      |     DURATION     |     RESULT     |
+-------------------+------------------+------------------+----------------+
|      patrole      |     functest     |      03:09       |      PASS      |
+-------------------+------------------+------------------+----------------+

2019-08-20 10:09:16,733 - xtesting.ci.run_tests - INFO - Loading test case 'neutron_trunk'...
2019-08-20 10:09:20,068 - xtesting.ci.run_tests - INFO - Running test case 'neutron_trunk'...
2019-08-20 10:11:55,168 - xtesting.core.testcase - INFO - The results were successfully pushed to DB
2019-08-20 10:11:55,168 - xtesting.ci.run_tests - INFO - Test result:

+-----------------------+------------------+------------------+----------------+
|       TEST CASE       |     PROJECT      |     DURATION     |     RESULT     |
+-----------------------+------------------+------------------+----------------+
|     neutron_trunk     |     functest     |      02:35       |      PASS      |
+-----------------------+------------------+------------------+----------------+

2019-08-20 10:12:04,888 - xtesting.ci.run_tests - INFO - Loading test case 'networking-bgpvpn'...
2019-08-20 10:12:08,001 - functest.opnfv_tests.openstack.tempest.tempest - WARNING - Cannot find Neutron extension: bgpvpn
2019-08-20 10:12:08,532 - xtesting.ci.run_tests - INFO - Skipping test case 'networking-bgpvpn'...
2019-08-20 10:12:08,532 - xtesting.ci.run_tests - INFO - Test result:

+---------------------------+------------------+------------------+----------------+
|         TEST CASE         |     PROJECT      |     DURATION     |     RESULT     |
+---------------------------+------------------+------------------+----------------+
|     networking-bgpvpn     |     functest     |      00:00       |      SKIP      |
+---------------------------+------------------+------------------+----------------+

2019-08-20 10:12:08,563 - xtesting.ci.run_tests - INFO - Loading test case 'networking-sfc'...
2019-08-20 10:12:11,784 - functest.opnfv_tests.openstack.tempest.tempest - WARNING - Cannot find Neutron extension: sfc
2019-08-20 10:12:12,314 - xtesting.ci.run_tests - INFO - Skipping test case 'networking-sfc'...
2019-08-20 10:12:12,315 - xtesting.ci.run_tests - INFO - Test result:

+------------------------+------------------+------------------+----------------+
|       TEST CASE        |     PROJECT      |     DURATION     |     RESULT     |
+------------------------+------------------+------------------+----------------+
|     networking-sfc     |     functest     |      00:00       |      SKIP      |
+------------------------+------------------+------------------+----------------+

2019-08-20 10:12:12,350 - xtesting.ci.run_tests - INFO - Loading test case 'barbican'...
2019-08-20 10:12:15,590 - xtesting.ci.run_tests - INFO - Running test case 'barbican'...
2019-08-20 10:14:54,257 - xtesting.core.testcase - INFO - The results were successfully pushed to DB
2019-08-20 10:14:54,257 - xtesting.ci.run_tests - INFO - Test result:

+-------------------+------------------+------------------+----------------+
|     TEST CASE     |     PROJECT      |     DURATION     |     RESULT     |
+-------------------+------------------+------------------+----------------+
|      barbican     |     functest     |      02:38       |      PASS      |
+-------------------+------------------+------------------+----------------+

2019-08-20 10:15:03,707 - xtesting.ci.run_tests - INFO - Xtesting report:

+------------------------------------+------------------+---------------+------------------+----------------+
|             TEST CASE              |     PROJECT      |      TIER     |     DURATION     |     RESULT     |
+------------------------------------+------------------+---------------+------------------+----------------+
|     neutron-tempest-plugin-api     |     functest     |     smoke     |      11:57       |      FAIL      |
|            rally_sanity            |     functest     |     smoke     |      18:37       |      FAIL      |
|          refstack_defcore          |     functest     |     smoke     |      08:26       |      PASS      |
|            tempest_full            |     functest     |     smoke     |      52:01       |      FAIL      |
|          tempest_scenario          |     functest     |     smoke     |      10:06       |      PASS      |
|              patrole               |     functest     |     smoke     |      03:09       |      PASS      |
|           neutron_trunk            |     functest     |     smoke     |      02:35       |      PASS      |
|         networking-bgpvpn          |     functest     |     smoke     |      00:00       |      SKIP      |
|           networking-sfc           |     functest     |     smoke     |      00:00       |      SKIP      |
|              barbican              |     functest     |     smoke     |      02:38       |      PASS      |
+------------------------------------+------------------+---------------+------------------+----------------+

2019-08-20 10:15:03,713 - xtesting.ci.run_tests - INFO - Execution exit value: Result.EX_ERROR
Functest: Pulling Functest Docker image opnfv/functest-benchmarking:hunter ...
Running Functest tier 'benchmarking'. CMD: docker run --rm  -e INSTALLER_TYPE=fuel -e INSTALLER_IP=10.20.0.2     -e NODE_NAME=ericsson-virtual1 -e DEPLOY_SCENARIO=os-odl-ovs-noha     -e BUILD_TAG=jenkins-functest-fuel-virtual-daily-hunter-624 -e DEPLOY_TYPE=virt -e CI_LOOP=daily     -e TEST_DB_URL=http://testresults.opnfv.org/test/api/v1/results -e ENERGY_RECORDER_API_URL=http://energy.opnfv.fr/resources     -e DEBUG=true -e POD_ARCH=x86_64 -e BLOCK_MIGRATION=false -e SDN_CONTROLLER_RESTCONFPORT=8080 -e IMAGE_PROPERTIES=hw_disk_bus:scsi,hw_scsi_model:virtio-scsi,hw_mem_page_size:large -e FLAVOR_EXTRA_SPECS=hw:mem_page_size:large -v /home/jenkins/opnfv/functest/images:/home/opnfv/functest/images -v /home/jenkins/opnfv/functest/results/hunter:/home/opnfv/functest/results -v /var/lib/opnfv/mcp.rsa:/root/.ssh/id_rsa       -v /home/jenkins/opnfv-openrc.sh:/home/opnfv/functest/conf/env_file      -v /tmp/tmp.cZ5b6X5yd6:/usr/lib/python2.7/site-packages/functest/opnfv_tests/openstack/tempest/custom_tests/tempest_conf.yaml  opnfv/functest-benchmarking:hunter /bin/bash -c 'run_tests -r -t all'
2019-08-20 10:15:09,571 - xtesting.ci.run_tests - INFO - Deployment description:

+--------------------------------------+----------------------------------------------------------+
|               ENV VAR                |                          VALUE                           |
+--------------------------------------+----------------------------------------------------------+
|              BUILD_TAG               |      jenkins-functest-fuel-virtual-daily-hunter-624      |
|             TEST_DB_URL              |     http://testresults.opnfv.org/test/api/v1/results     |
|     ENERGY_RECORDER_API_PASSWORD     |                                                          |
|               CI_LOOP                |                          daily                           |
|                DEBUG                 |                           true                           |
|            INSTALLER_TYPE            |                           fuel                           |
|       ENERGY_RECORDER_API_URL        |             http://energy.opnfv.fr/resources             |
|           DEPLOY_SCENARIO            |                     os-odl-ovs-noha                      |
|       ENERGY_RECORDER_API_USER       |                                                          |
|              NODE_NAME               |                    ericsson-virtual1                     |
+--------------------------------------+----------------------------------------------------------+

2019-08-20 10:15:09,576 - xtesting.ci.run_tests - INFO - Sourcing env file /var/lib/xtesting/conf/env_file


export OS_IDENTITY_API_VERSION=3
export OS_PROJECT_DOMAIN_NAME=Default
export OS_USER_DOMAIN_NAME=Default
export OS_PROJECT_NAME=admin
export OS_TENANT_NAME=admin
export OS_USERNAME=admin
export OS_PASSWORD=opnfv_secret
export OS_REGION_NAME=RegionOne
export OS_INTERFACE=internal
export OS_ENDPOINT_TYPE="internal"
export OS_CACERT="/etc/ssl/certs/ca-certificates.crt"
export SDN_CONTROLLER_USER=admin
export SDN_CONTROLLER_RESTCONFPORT=8282
export SDN_CONTROLLER_PASSWORD=admin
export SDN_CONTROLLER_WEBPORT=8282
export SDN_CONTROLLER_IP=10.16.0.107
export VOLUME_DEVICE_NAME=sdc
export OS_AUTH_URL=http://172.16.10.36:35357/v3

2019-08-20 10:15:09,578 - xtesting.ci.run_tests - INFO - TESTS TO BE EXECUTED:

+----------------------+---------------+-------------------------------------------------+-------------------------------------------+
|        TIERS         |     ORDER     |                   DESCRIPTION                   |                 TESTCASES                 |
+----------------------+---------------+-------------------------------------------------+-------------------------------------------+
|     benchmarking     |       2       |     Run several OpenStack performance tools     |     rally_full rally_jobs vmtp shaker     |
|                      |               |     https://docs.openstack.org/performance-     |                                           |
|                      |               |       docs/latest/methodologies/tools.html      |                                           |
+----------------------+---------------+-------------------------------------------------+-------------------------------------------+

2019-08-20 10:15:09,591 - xtesting.ci.run_tests - INFO - Loading test case 'rally_full'...
2019-08-20 10:15:12,288 - xtesting.ci.run_tests - INFO - Running test case 'rally_full'...
2019-08-20 11:59:02,875 - xtesting.core.testcase - INFO - The results were successfully pushed to DB
2019-08-20 11:59:02,875 - xtesting.ci.run_tests - INFO - Test result:

+--------------------+------------------+------------------+----------------+
|     TEST CASE      |     PROJECT      |     DURATION     |     RESULT     |
+--------------------+------------------+------------------+----------------+
|     rally_full     |     functest     |      103:50      |      FAIL      |
+--------------------+------------------+------------------+----------------+

2019-08-20 11:59:14,284 - xtesting.ci.run_tests - ERROR - The test case 'rally_full' failed.
2019-08-20 11:59:14,298 - xtesting.ci.run_tests - INFO - Loading test case 'rally_jobs'...
2019-08-20 11:59:16,597 - xtesting.ci.run_tests - INFO - Running test case 'rally_jobs'...
2019-08-20 12:50:35,673 - xtesting.core.testcase - INFO - The results were successfully pushed to DB
2019-08-20 12:50:35,673 - xtesting.ci.run_tests - INFO - Test result:

+--------------------+------------------+------------------+----------------+
|     TEST CASE      |     PROJECT      |     DURATION     |     RESULT     |
+--------------------+------------------+------------------+----------------+
|     rally_jobs     |     functest     |      51:19       |      PASS      |
+--------------------+------------------+------------------+----------------+

2019-08-20 12:50:46,659 - xtesting.ci.run_tests - INFO - Loading test case 'vmtp'...
2019-08-20 12:50:49,386 - xtesting.ci.run_tests - INFO - Running test case 'vmtp'...
2019-08-20 13:25:14,230 - functest.opnfv_tests.openstack.vmtp.vmtp - ERROR - Exception when calling ['vmtp_genchart', '-c', '/home/opnfv/functest/results/vmtp/vmtp.html', '/home/opnfv/functest/results/vmtp/vmtp.json']
Error: No such file %s: /home/opnfv/functest/results/vmtp/vmtp.json

2019-08-20 13:25:14,549 - xtesting.core.testcase - INFO - The results were successfully pushed to DB
2019-08-20 13:25:14,549 - xtesting.ci.run_tests - INFO - Test result:

+-------------------+------------------+------------------+----------------+
|     TEST CASE     |     PROJECT      |     DURATION     |     RESULT     |
+-------------------+------------------+------------------+----------------+
|        vmtp       |     functest     |      34:25       |      FAIL      |
+-------------------+------------------+------------------+----------------+

2019-08-20 13:25:15,831 - functest.core.tenantnetwork - ERROR - cannot clean all resources
Traceback (most recent call last):
  File "/usr/lib/python2.7/site-packages/functest/core/tenantnetwork.py", line 282, in clean
    self.cloud.delete_router(self.router.id)
  File "/usr/lib/python2.7/site-packages/shade/openstackcloud.py", line 4156, in delete_router
    error_message="Error deleting router {0}".format(name_or_id))
  File "/usr/lib/python2.7/site-packages/keystoneauth1/adapter.py", line 343, in delete
    return self.request(url, 'DELETE', **kwargs)
  File "/usr/lib/python2.7/site-packages/openstack/_adapter.py", line 164, in request
    return _json_response(response, error_message=error_message)
  File "/usr/lib/python2.7/site-packages/openstack/_adapter.py", line 95, in _json_response
    exceptions.raise_from_response(response, error_message=error_message)
  File "/usr/lib/python2.7/site-packages/openstack/exceptions.py", line 229, in raise_from_response
    http_status=http_status, request_id=request_id
ConflictException: Error deleting router 10d0f888-5ab9-4f99-904f-a58c16fdabce: Client Error for url: http://172.16.10.36:9696/v2.0/routers/10d0f888-5ab9-4f99-904f-a58c16fdabce.json, Router 10d0f888-5ab9-4f99-904f-a58c16fdabce still has ports
2019-08-20 13:25:17,981 - xtesting.ci.run_tests - ERROR - The test case 'vmtp' failed.
2019-08-20 13:25:17,993 - xtesting.ci.run_tests - INFO - Loading test case 'shaker'...
2019-08-20 13:25:20,361 - xtesting.ci.run_tests - INFO - Running test case 'shaker'...
2019-08-20 14:26:57,393 - functest.opnfv_tests.openstack.shaker.shaker - ERROR - cannot get report files
Traceback (most recent call last):
  File "/usr/lib/python2.7/site-packages/functest/opnfv_tests/openstack/shaker/shaker.py", line 125, in execute
    scpc.get('report.json', self.res_dir)
  File "/usr/lib/python2.7/site-packages/scp.py", line 217, in get
    self._recv_all()
  File "/usr/lib/python2.7/site-packages/scp.py", line 367, in _recv_all
    raise SCPException(asunicode(msg[1:]))
SCPException: scp: report.json: No such file or directory
2019-08-20 14:26:57,724 - xtesting.core.testcase - INFO - The results were successfully pushed to DB
2019-08-20 14:26:57,724 - xtesting.ci.run_tests - INFO - Test result:

+-------------------+------------------+------------------+----------------+
|     TEST CASE     |     PROJECT      |     DURATION     |     RESULT     |
+-------------------+------------------+------------------+----------------+
|       shaker      |     functest     |      61:37       |      FAIL      |
+-------------------+------------------+------------------+----------------+

2019-08-20 14:27:16,851 - xtesting.ci.run_tests - ERROR - The test case 'shaker' failed.
2019-08-20 14:27:16,851 - xtesting.ci.run_tests - INFO - Xtesting report:

+--------------------+------------------+----------------------+------------------+----------------+
|     TEST CASE      |     PROJECT      |         TIER         |     DURATION     |     RESULT     |
+--------------------+------------------+----------------------+------------------+----------------+
|     rally_full     |     functest     |     benchmarking     |      103:50      |      FAIL      |
|     rally_jobs     |     functest     |     benchmarking     |      51:19       |      PASS      |
|        vmtp        |     functest     |     benchmarking     |      34:25       |      FAIL      |
|       shaker       |     functest     |     benchmarking     |      61:37       |      FAIL      |
+--------------------+------------------+----------------------+------------------+----------------+

2019-08-20 14:27:16,855 - xtesting.ci.run_tests - INFO - Execution exit value: Result.EX_ERROR
Functest: Pulling Functest Docker image opnfv/functest-features:hunter ...
Running Functest tier 'features'. CMD: docker run --rm  -e INSTALLER_TYPE=fuel -e INSTALLER_IP=10.20.0.2     -e NODE_NAME=ericsson-virtual1 -e DEPLOY_SCENARIO=os-odl-ovs-noha     -e BUILD_TAG=jenkins-functest-fuel-virtual-daily-hunter-624 -e DEPLOY_TYPE=virt -e CI_LOOP=daily     -e TEST_DB_URL=http://testresults.opnfv.org/test/api/v1/results -e ENERGY_RECORDER_API_URL=http://energy.opnfv.fr/resources     -e DEBUG=true -e POD_ARCH=x86_64 -e BLOCK_MIGRATION=false -e SDN_CONTROLLER_RESTCONFPORT=8080 -e IMAGE_PROPERTIES=hw_disk_bus:scsi,hw_scsi_model:virtio-scsi,hw_mem_page_size:large -e FLAVOR_EXTRA_SPECS=hw:mem_page_size:large -v /home/jenkins/opnfv/functest/images:/home/opnfv/functest/images -v /home/jenkins/opnfv/functest/results/hunter:/home/opnfv/functest/results -v /var/lib/opnfv/mcp.rsa:/root/.ssh/id_rsa       -v /home/jenkins/opnfv-openrc.sh:/home/opnfv/functest/conf/env_file      -v /tmp/tmp.cZ5b6X5yd6:/usr/lib/python2.7/site-packages/functest/opnfv_tests/openstack/tempest/custom_tests/tempest_conf.yaml  opnfv/functest-features:hunter /bin/bash -c 'run_tests -r -t all'
2019-08-20 14:27:32,951 - xtesting.ci.run_tests - INFO - Deployment description:

+--------------------------------------+----------------------------------------------------------+
|               ENV VAR                |                          VALUE                           |
+--------------------------------------+----------------------------------------------------------+
|              BUILD_TAG               |      jenkins-functest-fuel-virtual-daily-hunter-624      |
|             TEST_DB_URL              |     http://testresults.opnfv.org/test/api/v1/results     |
|     ENERGY_RECORDER_API_PASSWORD     |                                                          |
|               CI_LOOP                |                          daily                           |
|                DEBUG                 |                           true                           |
|            INSTALLER_TYPE            |                           fuel                           |
|       ENERGY_RECORDER_API_URL        |             http://energy.opnfv.fr/resources             |
|           DEPLOY_SCENARIO            |                     os-odl-ovs-noha                      |
|       ENERGY_RECORDER_API_USER       |                                                          |
|              NODE_NAME               |                    ericsson-virtual1                     |
+--------------------------------------+----------------------------------------------------------+

2019-08-20 14:27:32,956 - xtesting.ci.run_tests - INFO - Sourcing env file /var/lib/xtesting/conf/env_file


export OS_IDENTITY_API_VERSION=3
export OS_PROJECT_DOMAIN_NAME=Default
export OS_USER_DOMAIN_NAME=Default
export OS_PROJECT_NAME=admin
export OS_TENANT_NAME=admin
export OS_USERNAME=admin
export OS_PASSWORD=opnfv_secret
export OS_REGION_NAME=RegionOne
export OS_INTERFACE=internal
export OS_ENDPOINT_TYPE="internal"
export OS_CACERT="/etc/ssl/certs/ca-certificates.crt"
export SDN_CONTROLLER_USER=admin
export SDN_CONTROLLER_RESTCONFPORT=8282
export SDN_CONTROLLER_PASSWORD=admin
export SDN_CONTROLLER_WEBPORT=8282
export SDN_CONTROLLER_IP=10.16.0.107
export VOLUME_DEVICE_NAME=sdc
export OS_AUTH_URL=http://172.16.10.36:35357/v3

2019-08-20 14:27:32,957 - xtesting.ci.run_tests - INFO - TESTS TO BE EXECUTED:

+------------------+---------------+-------------------------------------------+-----------------------------+
|      TIERS       |     ORDER     |                DESCRIPTION                |          TESTCASES          |
+------------------+---------------+-------------------------------------------+-----------------------------+
|     features     |       3       |     Test suites from feature projects     |     doctor-notification     |
|                  |               |           integrated in functest          |                             |
+------------------+---------------+-------------------------------------------+-----------------------------+

2019-08-20 14:27:32,973 - xtesting.ci.run_tests - INFO - Loading test case 'doctor-notification'...
2019-08-20 14:27:33,047 - xtesting.ci.run_tests - INFO - Running test case 'doctor-notification'...
2019-08-20 14:27:33,047 - xtesting.core.feature - INFO - Calling doctor-test
2019-08-20 14:30:54,966 - xtesting.core.testcase - INFO - The results were successfully pushed to DB
2019-08-20 14:30:54,967 - xtesting.ci.run_tests - INFO - Test result:

+-----------------------------+-----------------+------------------+----------------+
|          TEST CASE          |     PROJECT     |     DURATION     |     RESULT     |
+-----------------------------+-----------------+------------------+----------------+
|     doctor-notification     |      doctor     |      03:22       |      PASS      |
+-----------------------------+-----------------+------------------+----------------+

2019-08-20 14:30:54,969 - xtesting.ci.run_tests - INFO - Xtesting report:

+-----------------------------+-------------------+------------------+------------------+----------------+
|          TEST CASE          |      PROJECT      |       TIER       |     DURATION     |     RESULT     |
+-----------------------------+-------------------+------------------+------------------+----------------+
|     doctor-notification     |       doctor      |     features     |      03:22       |      PASS      |
|       functest-odl-sfc      |        sfc        |     features     |      00:00       |      SKIP      |
|      barometercollectd      |     barometer     |     features     |      00:00       |      SKIP      |
|             vgpu            |      functest     |     features     |      00:00       |      SKIP      |
|         stor4nfv_os         |      stor4nfv     |     features     |      00:00       |      SKIP      |
+-----------------------------+-------------------+------------------+------------------+----------------+

2019-08-20 14:30:54,973 - xtesting.ci.run_tests - INFO - Execution exit value: Result.EX_OK
Functest: Pulling Functest Docker image opnfv/functest-vnf:hunter ...
Running Functest tier 'vnf'. CMD: docker run --rm  -e INSTALLER_TYPE=fuel -e INSTALLER_IP=10.20.0.2     -e NODE_NAME=ericsson-virtual1 -e DEPLOY_SCENARIO=os-odl-ovs-noha     -e BUILD_TAG=jenkins-functest-fuel-virtual-daily-hunter-624 -e DEPLOY_TYPE=virt -e CI_LOOP=daily     -e TEST_DB_URL=http://testresults.opnfv.org/test/api/v1/results -e ENERGY_RECORDER_API_URL=http://energy.opnfv.fr/resources     -e DEBUG=true -e POD_ARCH=x86_64 -e BLOCK_MIGRATION=false -e SDN_CONTROLLER_RESTCONFPORT=8080 -e IMAGE_PROPERTIES=hw_disk_bus:scsi,hw_scsi_model:virtio-scsi,hw_mem_page_size:large -e FLAVOR_EXTRA_SPECS=hw:mem_page_size:large -v /home/jenkins/opnfv/functest/images:/home/opnfv/functest/images -v /home/jenkins/opnfv/functest/results/hunter:/home/opnfv/functest/results -v /var/lib/opnfv/mcp.rsa:/root/.ssh/id_rsa       -v /home/jenkins/opnfv-openrc.sh:/home/opnfv/functest/conf/env_file      -v /tmp/tmp.cZ5b6X5yd6:/usr/lib/python2.7/site-packages/functest/opnfv_tests/openstack/tempest/custom_tests/tempest_conf.yaml  opnfv/functest-vnf:hunter /bin/bash -c 'run_tests -r -t all'
2019-08-20 14:31:20,470 - xtesting.ci.run_tests - INFO - Deployment description:

+--------------------------------------+----------------------------------------------------------+
|               ENV VAR                |                          VALUE                           |
+--------------------------------------+----------------------------------------------------------+
|              BUILD_TAG               |      jenkins-functest-fuel-virtual-daily-hunter-624      |
|             TEST_DB_URL              |     http://testresults.opnfv.org/test/api/v1/results     |
|     ENERGY_RECORDER_API_PASSWORD     |                                                          |
|               CI_LOOP                |                          daily                           |
|                DEBUG                 |                           true                           |
|            INSTALLER_TYPE            |                           fuel                           |
|       ENERGY_RECORDER_API_URL        |             http://energy.opnfv.fr/resources             |
|           DEPLOY_SCENARIO            |                     os-odl-ovs-noha                      |
|       ENERGY_RECORDER_API_USER       |                                                          |
|              NODE_NAME               |                    ericsson-virtual1                     |
+--------------------------------------+----------------------------------------------------------+

2019-08-20 14:31:20,474 - xtesting.ci.run_tests - INFO - Sourcing env file /var/lib/xtesting/conf/env_file


export OS_IDENTITY_API_VERSION=3
export OS_PROJECT_DOMAIN_NAME=Default
export OS_USER_DOMAIN_NAME=Default
export OS_PROJECT_NAME=admin
export OS_TENANT_NAME=admin
export OS_USERNAME=admin
export OS_PASSWORD=opnfv_secret
export OS_REGION_NAME=RegionOne
export OS_INTERFACE=internal
export OS_ENDPOINT_TYPE="internal"
export OS_CACERT="/etc/ssl/certs/ca-certificates.crt"
export SDN_CONTROLLER_USER=admin
export SDN_CONTROLLER_RESTCONFPORT=8282
export SDN_CONTROLLER_PASSWORD=admin
export SDN_CONTROLLER_WEBPORT=8282
export SDN_CONTROLLER_IP=10.16.0.107
export VOLUME_DEVICE_NAME=sdc
export OS_AUTH_URL=http://172.16.10.36:35357/v3

2019-08-20 14:31:20,475 - xtesting.ci.run_tests - INFO - TESTS TO BE EXECUTED:

+---------------+---------------+---------------------------------------+----------------------------------------+
|     TIERS     |     ORDER     |              DESCRIPTION              |               TESTCASES                |
+---------------+---------------+---------------------------------------+----------------------------------------+
|      vnf      |       4       |     Collection of VNF test cases.     |     cloudify cloudify_ims heat_ims     |
|               |               |                                       |         vyos_vrouter juju_epc          |
+---------------+---------------+---------------------------------------+----------------------------------------+

2019-08-20 14:31:20,486 - xtesting.ci.run_tests - INFO - Loading test case 'cloudify'...
2019-08-20 14:31:22,586 - xtesting.ci.run_tests - INFO - Running test case 'cloudify'...
2019-08-20 14:34:59,423 - functest.core.singlevm - ERROR - cannot connect to 10.16.0.131
2019-08-20 14:34:59,423 - functest.core.singlevm - ERROR - Cannot run cloudify
Traceback (most recent call last):
  File "/usr/lib/python2.7/site-packages/functest/core/singlevm.py", line 467, in run
    (self.fip, self.ssh) = self.connect(self.sshvm)
TypeError: 'NoneType' object is not iterable
2019-08-20 14:34:59,693 - xtesting.core.testcase - INFO - The results were successfully pushed to DB
2019-08-20 14:34:59,693 - xtesting.ci.run_tests - INFO - Test result:

+-------------------+------------------+------------------+----------------+
|     TEST CASE     |     PROJECT      |     DURATION     |     RESULT     |
+-------------------+------------------+------------------+----------------+
|      cloudify     |     functest     |      03:37       |      FAIL      |
+-------------------+------------------+------------------+----------------+

2019-08-20 14:35:14,246 - xtesting.ci.run_tests - ERROR - The test case 'cloudify' failed.
2019-08-20 14:35:14,257 - xtesting.ci.run_tests - INFO - Loading test case 'cloudify_ims'...
2019-08-20 14:35:16,070 - xtesting.ci.run_tests - INFO - Running test case 'cloudify_ims'...
2019-08-20 14:38:51,704 - functest.core.singlevm - ERROR - cannot connect to 10.16.0.129
2019-08-20 14:38:51,704 - functest.core.singlevm - ERROR - Cannot run cloudify_ims
Traceback (most recent call last):
  File "/usr/lib/python2.7/site-packages/functest/core/singlevm.py", line 467, in run
    (self.fip, self.ssh) = self.connect(self.sshvm)
TypeError: 'NoneType' object is not iterable
2019-08-20 14:38:52,010 - xtesting.core.testcase - INFO - The results were successfully pushed to DB
2019-08-20 14:38:52,010 - xtesting.ci.run_tests - INFO - Test result:

+----------------------+------------------+------------------+----------------+
|      TEST CASE       |     PROJECT      |     DURATION     |     RESULT     |
+----------------------+------------------+------------------+----------------+
|     cloudify_ims     |     functest     |      03:36       |      FAIL      |
+----------------------+------------------+------------------+----------------+

2019-08-20 14:38:52,013 - functest.core.cloudify - INFO - Deleting the current deployment
2019-08-20 14:38:52,014 - functest.core.cloudify - ERROR - Some issue during the undeployment ..
Traceback (most recent call last):
  File "/usr/lib/python2.7/site-packages/functest/core/cloudify.py", line 143, in kill_existing_execution
    exec_list = self.cfy_client.executions.list()
AttributeError: 'NoneType' object has no attribute 'executions'
2019-08-20 14:39:05,823 - xtesting.ci.run_tests - ERROR - The test case 'cloudify_ims' failed.
2019-08-20 14:39:05,835 - xtesting.ci.run_tests - INFO - Loading test case 'heat_ims'...
2019-08-20 14:39:07,774 - xtesting.ci.run_tests - INFO - Running test case 'heat_ims'...
2019-08-20 14:59:40,273 - functest.opnfv_tests.vnf.ims.heat_ims - ERROR - Cannot run heat_ims
Traceback (most recent call last):
  File "/usr/lib/python2.7/site-packages/functest/opnfv_tests/vnf/ims/heat_ims.py", line 143, in run
    if not self.execute():
  File "/usr/lib/python2.7/site-packages/functest/opnfv_tests/vnf/ims/heat_ims.py", line 120, in execute
    if self.deploy_vnf() and self.test_vnf():
  File "/usr/lib/python2.7/site-packages/functest/opnfv_tests/vnf/ims/heat_ims.py", line 203, in deploy_vnf
    assert ellis_ip
UnboundLocalError: local variable 'ellis_ip' referenced before assignment
2019-08-20 14:59:40,582 - xtesting.core.testcase - INFO - The results were successfully pushed to DB
2019-08-20 14:59:40,582 - xtesting.ci.run_tests - INFO - Test result:

+-------------------+------------------+------------------+----------------+
|     TEST CASE     |     PROJECT      |     DURATION     |     RESULT     |
+-------------------+------------------+------------------+----------------+
|      heat_ims     |     functest     |      20:32       |      FAIL      |
+-------------------+------------------+------------------+----------------+

2019-08-20 15:00:13,482 - xtesting.ci.run_tests - ERROR - The test case 'heat_ims' failed.
2019-08-20 15:00:13,496 - xtesting.ci.run_tests - INFO - Loading test case 'vyos_vrouter'...
2019-08-20 15:00:15,494 - xtesting.ci.run_tests - INFO - Running test case 'vyos_vrouter'...
2019-08-20 15:03:51,328 - functest.core.singlevm - ERROR - cannot connect to 10.16.0.121
2019-08-20 15:03:51,328 - functest.core.singlevm - ERROR - Cannot run vyos_vrouter
Traceback (most recent call last):
  File "/usr/lib/python2.7/site-packages/functest/core/singlevm.py", line 467, in run
    (self.fip, self.ssh) = self.connect(self.sshvm)
TypeError: 'NoneType' object is not iterable
2019-08-20 15:03:51,605 - xtesting.core.testcase - INFO - The results were successfully pushed to DB
2019-08-20 15:03:51,605 - xtesting.ci.run_tests - INFO - Test result:

+----------------------+------------------+------------------+----------------+
|      TEST CASE       |     PROJECT      |     DURATION     |     RESULT     |
+----------------------+------------------+------------------+----------------+
|     vyos_vrouter     |     functest     |      03:36       |      FAIL      |
+----------------------+------------------+------------------+----------------+

2019-08-20 15:03:51,608 - functest.core.cloudify - INFO - Deleting the current deployment
2019-08-20 15:03:51,608 - functest.core.cloudify - ERROR - Some issue during the undeployment ..
Traceback (most recent call last):
  File "/usr/lib/python2.7/site-packages/functest/core/cloudify.py", line 143, in kill_existing_execution
    exec_list = self.cfy_client.executions.list()
AttributeError: 'NoneType' object has no attribute 'executions'
2019-08-20 15:04:05,032 - xtesting.ci.run_tests - ERROR - The test case 'vyos_vrouter' failed.
2019-08-20 15:04:05,046 - xtesting.ci.run_tests - INFO - Loading test case 'juju_epc'...
2019-08-20 15:04:07,057 - xtesting.ci.run_tests - INFO - Running test case 'juju_epc'...
2019-08-20 15:26:18,803 - functest.opnfv_tests.vnf.epc.juju_epc - ERROR - Exception with Juju Bootstrap: ['timeout', '-t', '4800', 'juju', 'bootstrap', 'abot-epc/RegionOne', 'abot-controller', '--agent-version', '2.3.9', '--metadata-source', '/root', '--constraints', 'mem=2G', '--bootstrap-series', 'xenial', '--config', 'network=30e7af71-073b-444f-a721-6a464ba4431f', '--config', 'ssl-hostname-verification=false', '--config', 'external-network=ac1fb060-cd65-498e-bf56-8a9d5f1c9aed', '--config', 'use-floating-ip=true', '--config', 'use-default-secgroup=true', '--debug']
15:04:24 INFO  juju.cmd supercommand.go:56 running juju [2.3.9 gc go1.11.5]
15:04:24 DEBUG juju.cmd supercommand.go:57   args: []string{"juju", "bootstrap", "abot-epc/RegionOne", "abot-controller", "--agent-version", "2.3.9", "--metadata-source", "/root", "--constraints", "mem=2G", "--bootstrap-series", "xenial", "--config", "network=30e7af71-073b-444f-a721-6a464ba4431f", "--config", "ssl-hostname-verification=false", "--config", "external-network=ac1fb060-cd65-498e-bf56-8a9d5f1c9aed", "--config", "use-floating-ip=true", "--config", "use-default-secgroup=true", "--debug"}
15:04:24 DEBUG juju.cmd.juju.commands bootstrap.go:835 authenticating with region "RegionOne" and credential "abot-epc" ()
15:04:24 DEBUG juju.cmd.juju.commands bootstrap.go:963 provider attrs: map[network:30e7af71-073b-444f-a721-6a464ba4431f external-network:ac1fb060-cd65-498e-bf56-8a9d5f1c9aed use-openstack-gbp:false policy-target-group: use-floating-ip:true use-default-secgroup:true]
15:04:24 INFO  cmd authkeys.go:114 Adding contents of "/root/.local/share/juju/ssh/juju_id_rsa.pub" to authorized-keys
15:04:24 DEBUG juju.cmd.juju.commands bootstrap.go:1019 preparing controller with config: map[name:controller apt-mirror: transmit-vendor-metrics:true enable-os-refresh-update:true resource-tags: development:false apt-no-proxy: container-networking-method: update-status-hook-interval:5m ftp-proxy: agent-metadata-url: agent-stream:released egress-subnets: image-stream:released logforward-enabled:false test-mode:false policy-target-group: uuid:4e621b69-d9c8-4dab-8ba0-2a71805a74ed external-network:ac1fb060-cd65-498e-bf56-8a9d5f1c9aed apt-http-proxy: network:30e7af71-073b-444f-a721-6a464ba4431f net-bond-reconfigure-delay:17 ssl-hostname-verification:false automatically-retry-hooks:true enable-os-upgrade:true logging-config: default-series:xenial max-status-history-size:5G proxy-ssh:false https-proxy: firewall-mode:instance apt-https-proxy: container-inherit-properties: use-openstack-gbp:false container-image-stream:released ignore-machine-addresses:false http-proxy: cloudinit-userdata: provisioner-harvest-mode:destroyed image-metadata-url: use-floating-ip:true use-default-secgroup:true no-proxy:127.0.0.1,localhost,::1 authorized-keys:ssh-rsa AAAAB3NzaC1yc2EAAAADAQABAAABAQC0lPnbiiQVEgP4SB4jrHF0gn25nGloyQaJO2d9zBoJsbWd8XGMrOp8zmyG5GRHZw6l6lCnJHTPmVgvSKJo12t3X6HBOWAHa4ryHLs/bTADOuDhP/fbuHXC5Au7+AIikcWGK0oP6fvTL4VZOsuCA3jUDLEqY047tqF0toXAEjr6c0LGTXB0B/MvtYjhNQ3oOfSrSy8YSBruFZmVwYaG+r3seBfGNbueSUplxZ8KpmrvtD5EjSih/H2CbMmZu2XY7vmc/PgIpo+Ll5TBOcTgXlSLS0gdE044A1C1ancPY4cT9AhF6nVyhKHNwRV+4pWbmC27sRIAwPsT4lg09SVo7+mj juju-client-key
 fan-config: max-action-results-size:5G max-action-results-age:336h disable-network-management:false type:openstack container-image-metadata-url: apt-ftp-proxy: max-status-history-age:336h]
15:04:24 INFO  juju.provider.openstack provider.go:145 opening model "controller"
15:04:24 DEBUG goose client.go:511 auth details: &{Token:gAAAAABdXAv4mgFS44XK6FElndu-GVz8Knp4xNLTdYWZCoU0ZTNDYvjJogKIJtylUhzPAG-MNXkUpIHn7TKsd_o1a735ipBncXclQVQ0yBETJTGDce_CBuwGJ-Rv8heM84vrddQiQpVH3RyW4KHZhbLw4PpmF4pr4CYUi9eZAF5CCqHSpsFeLtE TenantId:4df04dab398c4ed5ac98239bf7ed96ee UserId:6fa6f0e8781345568aa00a456380ae65 Domain: RegionServiceURLs:map[RegionOne:map[metric:http://10.16.0.107:8041/ cloudformation:http://10.16.0.107:8000/v1 placement:http://10.16.0.107:8778 image:http://10.16.0.107:9292 volumev3:http://10.16.0.107:8776/v3/4df04dab398c4ed5ac98239bf7ed96ee compute:http://10.16.0.107:8774/v2.1 network:http://10.16.0.107:9696/ key-manager:http://10.16.0.107:9311/ identity:http://10.16.0.107:5000/ alarming:http://10.16.0.107:8042/ orchestration:http://10.16.0.107:8004/v1/4df04dab398c4ed5ac98239bf7ed96ee event:http://10.16.0.107:8977/ volumev2:http://10.16.0.107:8776/v2/4df04dab398c4ed5ac98239bf7ed96ee]]}
15:04:25 INFO  cmd bootstrap.go:508 Creating Juju controller "abot-controller" on abot-epc/RegionOne
15:04:25 DEBUG goose apiversion.go:267 discovered API versions: [{Version:{major:2 minor:0} Links:[{Href:http://10.16.0.107:8774/v2/ Rel:self}] Status:SUPPORTED} {Version:{major:2 minor:1} Links:[{Href:http://10.16.0.107:8774/v2.1/ Rel:self}] Status:CURRENT}]
15:04:25 INFO  juju.cmd.juju.commands bootstrap.go:572 combined bootstrap constraints: mem=2048M
15:04:25 DEBUG juju.environs.bootstrap bootstrap.go:199 model "controller" supports service/machine networks: true
15:04:25 DEBUG juju.environs.bootstrap bootstrap.go:201 network management by juju enabled: true
15:04:25 DEBUG juju.environs.bootstrap bootstrap.go:717 no agent directory found, using default agent metadata source: https://streams.canonical.com/juju/tools
15:04:25 DEBUG juju.environs.bootstrap bootstrap.go:742 setting default image metadata source: /root/images
15:04:25 DEBUG juju.environs imagemetadata.go:46 new user image datasource registered: bootstrap metadata
15:04:25 INFO  juju.environs.bootstrap bootstrap.go:760 custom image metadata added to search path
15:04:25 INFO  cmd bootstrap.go:233 Loading image metadata
15:04:25 DEBUG juju.environs imagemetadata.go:112 obtained image datasource "bootstrap metadata"
15:04:25 DEBUG juju.environs imagemetadata.go:112 obtained image datasource "default cloud images"
15:04:25 DEBUG juju.environs imagemetadata.go:112 obtained image datasource "default ubuntu cloud images"
15:04:25 DEBUG juju.environs.bootstrap bootstrap.go:608 constraints for image metadata lookup &{{{RegionOne http://10.16.0.107:5000//v3} [win2012hv win10 quantal saucy yakkety raring wily win2016 win2016hv win81 xenial win2008r2 win7 opensuseleap genericlinux precise trusty win2012r2 win2016nano win8 centos7 zesty win2012hvr2 win2012 bionic utopic vivid artful] [amd64 i386 armhf arm64 ppc64el s390x] released}}
15:04:25 DEBUG juju.environs.bootstrap bootstrap.go:620 found 2 image metadata in bootstrap metadata
15:04:25 DEBUG juju.environs.bootstrap bootstrap.go:620 found 0 image metadata in default cloud images
15:04:26 DEBUG juju.environs.simplestreams simplestreams.go:457 skipping index "http://cloud-images.ubuntu.com/releases/streams/v1/index.sjson" because of missing information: index file has no data for cloud {RegionOne http://10.16.0.107:5000//v3} not found
15:04:26 DEBUG juju.environs.bootstrap bootstrap.go:616 ignoring image metadata in default ubuntu cloud images: index file has no data for cloud {RegionOne http://10.16.0.107:5000//v3} not found
15:04:26 DEBUG juju.environs.bootstrap bootstrap.go:624 found 2 image metadata from all image data sources
15:04:26 INFO  cmd bootstrap.go:303 Looking for packaged Juju agent version 2.3.9 for amd64
15:04:26 INFO  juju.environs.bootstrap tools.go:72 looking for bootstrap agent binaries: version=2.3.9
15:04:26 DEBUG juju.environs.tools tools.go:102 finding agent binaries in stream: "released"
15:04:26 DEBUG juju.environs.tools tools.go:104 reading agent binaries with major.minor version 2.3
15:04:26 DEBUG juju.environs.tools tools.go:112 filtering agent binaries by version: 2.3.9
15:04:26 DEBUG juju.environs.tools tools.go:115 filtering agent binaries by series: xenial
15:04:26 DEBUG juju.environs.tools tools.go:118 filtering agent binaries by architecture: amd64
15:04:26 DEBUG juju.environs.tools urls.go:109 trying datasource "keystone catalog"
15:04:26 DEBUG juju.environs.simplestreams simplestreams.go:683 using default candidate for content id "com.ubuntu.juju:released:tools" are {20161007 mirrors:1.0 content-download streams/v1/cpc-mirrors.sjson []}
15:04:27 INFO  juju.environs.bootstrap tools.go:74 found 1 packaged agent binaries
15:04:27 INFO  cmd bootstrap.go:389 Starting new instance for initial controller
15:04:27 INFO  cmd bootstrap.go:151 Launching controller instance(s) on abot-epc/RegionOne...
15:04:27 DEBUG juju.environs.instances image.go:64 instance constraints {region: RegionOne, series: xenial, arches: [amd64], constraints: mem=2048M, storage: []}
15:04:27 DEBUG juju.environs.instances image.go:70 matching constraints {region: RegionOne, series: xenial, arches: [amd64], constraints: mem=2048M, storage: []} against possible image metadata [{Id:cc1c47fc-6307-4ae4-a069-123e43b9a7c2 Arch:amd64 VirtType:}]
15:04:27 INFO  juju.environs.instances image.go:106 find instance - using image with id: cc1c47fc-6307-4ae4-a069-123e43b9a7c2
15:04:27 DEBUG juju.cloudconfig.instancecfg instancecfg.go:835 Setting numa ctl preference to false
15:04:27 DEBUG juju.service discovery.go:63 discovered init system "systemd" from series "xenial"
15:04:27 DEBUG juju.provider.openstack provider.go:993 openstack user data; 2491 bytes
15:04:27 DEBUG juju.provider.openstack provider.go:1005 using network id "30e7af71-073b-444f-a721-6a464ba4431f"
15:04:27 DEBUG goose apiversion.go:267 discovered API versions: [{Version:{major:2 minor:0} Links:[{Href:http://10.16.0.107:9696/v2.0/ Rel:self}] Status:CURRENT}]
 - instance "eaffbae5-63ac-46d8-9f54-ed0158154bba" has status BUILD, wait 10 seconds before retry, attempt 1
 - instance "eaffbae5-63ac-46d8-9f54-ed0158154bba" has status BUILD, wait 10 seconds before retry, attempt 2
 - instance "eaffbae5-63ac-46d8-9f54-ed0158154bba" has status BUILD, wait 10 seconds before retry, attempt 3
 - instance "eaffbae5-63ac-46d8-9f54-ed0158154bba" has status BUILD, wait 10 seconds before retry, attempt 4
 - instance "eaffbae5-63ac-46d8-9f54-ed0158154bba" has status BUILD, wait 10 seconds before retry, attempt 5
 - instance "eaffbae5-63ac-46d8-9f54-ed0158154bba" has status BUILD, wait 10 seconds before retry, attempt 6
 - instance "eaffbae5-63ac-46d8-9f54-ed0158154bba" has status BUILD, wait 10 seconds before retry, attempt 7
 - instance "eaffbae5-63ac-46d8-9f54-ed0158154bba" has status BUILD, wait 10 seconds before retry, attempt 8
15:05:54 INFO  juju.provider.openstack provider.go:1175 started instance "eaffbae5-63ac-46d8-9f54-ed0158154bba"
15:05:54 DEBUG juju.provider.openstack provider.go:1184 allocating public IP address for openstack node
15:05:54 DEBUG juju.provider.openstack networking.go:169 using external network "ac1fb060-cd65-498e-bf56-8a9d5f1c9aed"
15:05:56 DEBUG juju.provider.openstack networking.go:226 allocated new public IP: 10.16.0.113
15:05:56 INFO  juju.provider.openstack provider.go:1189 allocated public IP 10.16.0.113
15:05:59 INFO  cmd bootstrap.go:225  - eaffbae5-63ac-46d8-9f54-ed0158154bba (arch=amd64 mem=2G cores=1)
15:05:59 INFO  juju.environs.bootstrap bootstrap.go:638 newest version: 2.3.9
15:05:59 INFO  juju.environs.bootstrap bootstrap.go:653 picked bootstrap agent binary version: 2.3.9
15:05:59 INFO  cmd bootstrap.go:425 Installing Juju agent on bootstrap instance
15:05:59 INFO  cmd bootstrap.go:517 Fetching Juju GUI 2.14.0
15:05:59 DEBUG juju.cloudconfig.instancecfg instancecfg.go:835 Setting numa ctl preference to false
Waiting for address
15:06:00 DEBUG juju.provider.openstack provider.go:417 instance eaffbae5-63ac-46d8-9f54-ed0158154bba has floating IP address: 10.16.0.113
Attempting to connect to 10.16.0.113:22
Attempting to connect to 192.168.120.11:22
15:06:10 DEBUG juju.provider.openstack provider.go:417 instance eaffbae5-63ac-46d8-9f54-ed0158154bba has floating IP address: 10.16.0.113
15:06:18 DEBUG juju.provider.common bootstrap.go:564 connection attempt for 10.16.0.113 failed: ssh: connect to host 10.16.0.113 port 22: Host is unreachable
15:06:20 DEBUG juju.provider.openstack provider.go:417 instance eaffbae5-63ac-46d8-9f54-ed0158154bba has floating IP address: 10.16.0.113
15:06:26 DEBUG juju.provider.common bootstrap.go:564 connection attempt for 10.16.0.113 failed: ssh: connect to host 10.16.0.113 port 22: Host is unreachable
15:06:30 DEBUG juju.provider.openstack provider.go:417 instance eaffbae5-63ac-46d8-9f54-ed0158154bba has floating IP address: 10.16.0.113
15:06:34 DEBUG juju.provider.common bootstrap.go:564 connection attempt for 10.16.0.113 failed: ssh: connect to host 10.16.0.113 port 22: Host is unreachable
15:06:40 DEBUG juju.provider.openstack provider.go:417 instance eaffbae5-63ac-46d8-9f54-ed0158154bba has floating IP address: 10.16.0.113
15:06:42 DEBUG juju.provider.common bootstrap.go:564 connection attempt for 10.16.0.113 failed: ssh: connect to host 10.16.0.113 port 22: Host is unreachable
15:06:50 DEBUG juju.provider.openstack provider.go:417 instance eaffbae5-63ac-46d8-9f54-ed0158154bba has floating IP address: 10.16.0.113
15:06:51 DEBUG juju.provider.common bootstrap.go:564 connection attempt for 10.16.0.113 failed: ssh: connect to host 10.16.0.113 port 22: Host is unreachable
15:06:59 DEBUG juju.provider.common bootstrap.go:564 connection attempt for 10.16.0.113 failed: ssh: connect to host 10.16.0.113 port 22: Host is unreachable
15:07:00 DEBUG juju.provider.openstack provider.go:417 instance eaffbae5-63ac-46d8-9f54-ed0158154bba has floating IP address: 10.16.0.113
15:07:07 DEBUG juju.provider.common bootstrap.go:564 connection attempt for 10.16.0.113 failed: ssh: connect to host 10.16.0.113 port 22: Host is unreachable
15:07:10 DEBUG juju.provider.openstack provider.go:417 instance eaffbae5-63ac-46d8-9f54-ed0158154bba has floating IP address: 10.16.0.113
15:07:15 DEBUG juju.provider.common bootstrap.go:564 connection attempt for 10.16.0.113 failed: ssh: connect to host 10.16.0.113 port 22: Host is unreachable
15:07:20 DEBUG juju.provider.openstack provider.go:417 instance eaffbae5-63ac-46d8-9f54-ed0158154bba has floating IP address: 10.16.0.113
15:07:23 DEBUG juju.provider.common bootstrap.go:564 connection attempt for 10.16.0.113 failed: ssh: connect to host 10.16.0.113 port 22: Host is unreachable
15:07:30 DEBUG juju.provider.openstack provider.go:417 instance eaffbae5-63ac-46d8-9f54-ed0158154bba has floating IP address: 10.16.0.113
15:07:31 DEBUG juju.provider.common bootstrap.go:564 connection attempt for 10.16.0.113 failed: ssh: connect to host 10.16.0.113 port 22: Host is unreachable
15:07:39 DEBUG juju.provider.common bootstrap.go:564 connection attempt for 10.16.0.113 failed: ssh: connect to host 10.16.0.113 port 22: Host is unreachable
15:07:40 DEBUG juju.provider.openstack provider.go:417 instance eaffbae5-63ac-46d8-9f54-ed0158154bba has floating IP address: 10.16.0.113
15:07:47 DEBUG juju.provider.common bootstrap.go:564 connection attempt for 10.16.0.113 failed: ssh: connect to host 10.16.0.113 port 22: Host is unreachable
15:07:50 DEBUG juju.provider.openstack provider.go:417 instance eaffbae5-63ac-46d8-9f54-ed0158154bba has floating IP address: 10.16.0.113
15:07:55 DEBUG juju.provider.common bootstrap.go:564 connection attempt for 10.16.0.113 failed: ssh: connect to host 10.16.0.113 port 22: Host is unreachable
15:08:00 DEBUG juju.provider.openstack provider.go:417 instance eaffbae5-63ac-46d8-9f54-ed0158154bba has floating IP address: 10.16.0.113
15:08:03 DEBUG juju.provider.common bootstrap.go:564 connection attempt for 10.16.0.113 failed: ssh: connect to host 10.16.0.113 port 22: Host is unreachable
15:08:10 DEBUG juju.provider.openstack provider.go:417 instance eaffbae5-63ac-46d8-9f54-ed0158154bba has floating IP address: 10.16.0.113
15:08:10 DEBUG juju.provider.common bootstrap.go:564 connection attempt for 192.168.120.11 failed: ssh: connect to host 192.168.120.11 port 22: Operation timed out
15:08:11 DEBUG juju.provider.common bootstrap.go:564 connection attempt for 10.16.0.113 failed: ssh: connect to host 10.16.0.113 port 22: Host is unreachable
15:08:19 DEBUG juju.provider.common bootstrap.go:564 connection attempt for 10.16.0.113 failed: ssh: connect to host 10.16.0.113 port 22: Host is unreachable
15:08:20 DEBUG juju.provider.openstack provider.go:417 instance eaffbae5-63ac-46d8-9f54-ed0158154bba has floating IP address: 10.16.0.113
15:08:27 DEBUG juju.provider.common bootstrap.go:564 connection attempt for 10.16.0.113 failed: ssh: connect to host 10.16.0.113 port 22: Host is unreachable
15:08:30 DEBUG juju.provider.openstack provider.go:417 instance eaffbae5-63ac-46d8-9f54-ed0158154bba has floating IP address: 10.16.0.113
15:08:35 DEBUG juju.provider.common bootstrap.go:564 connection attempt for 10.16.0.113 failed: ssh: connect to host 10.16.0.113 port 22: Host is unreachable
15:08:40 DEBUG juju.provider.openstack provider.go:417 instance eaffbae5-63ac-46d8-9f54-ed0158154bba has floating IP address: 10.16.0.113
15:08:43 DEBUG juju.provider.common bootstrap.go:564 connection attempt for 10.16.0.113 failed: ssh: connect to host 10.16.0.113 port 22: Host is unreachable
15:08:50 DEBUG juju.provider.openstack provider.go:417 instance eaffbae5-63ac-46d8-9f54-ed0158154bba has floating IP address: 10.16.0.113
15:08:52 DEBUG juju.provider.common bootstrap.go:564 connection attempt for 10.16.0.113 failed: ssh: connect to host 10.16.0.113 port 22: Host is unreachable
15:09:00 DEBUG juju.provider.common bootstrap.go:564 connection attempt for 10.16.0.113 failed: ssh: connect to host 10.16.0.113 port 22: Host is unreachable
15:09:00 DEBUG juju.provider.openstack provider.go:417 instance eaffbae5-63ac-46d8-9f54-ed0158154bba has floating IP address: 10.16.0.113
15:09:08 DEBUG juju.provider.common bootstrap.go:564 connection attempt for 10.16.0.113 failed: ssh: connect to host 10.16.0.113 port 22: Host is unreachable
15:09:10 DEBUG juju.provider.openstack provider.go:417 instance eaffbae5-63ac-46d8-9f54-ed0158154bba has floating IP address: 10.16.0.113
15:09:16 DEBUG juju.provider.common bootstrap.go:564 connection attempt for 10.16.0.113 failed: ssh: connect to host 10.16.0.113 port 22: Host is unreachable
15:09:20 DEBUG juju.provider.openstack provider.go:417 instance eaffbae5-63ac-46d8-9f54-ed0158154bba has floating IP address: 10.16.0.113
15:09:24 DEBUG juju.provider.common bootstrap.go:564 connection attempt for 10.16.0.113 failed: ssh: connect to host 10.16.0.113 port 22: Host is unreachable
15:09:30 DEBUG juju.provider.openstack provider.go:417 instance eaffbae5-63ac-46d8-9f54-ed0158154bba has floating IP address: 10.16.0.113
15:09:32 DEBUG juju.provider.common bootstrap.go:564 connection attempt for 10.16.0.113 failed: ssh: connect to host 10.16.0.113 port 22: Host is unreachable
15:09:40 DEBUG juju.provider.common bootstrap.go:564 connection attempt for 10.16.0.113 failed: ssh: connect to host 10.16.0.113 port 22: Host is unreachable
15:09:41 DEBUG juju.provider.openstack provider.go:417 instance eaffbae5-63ac-46d8-9f54-ed0158154bba has floating IP address: 10.16.0.113
15:09:48 DEBUG juju.provider.common bootstrap.go:564 connection attempt for 10.16.0.113 failed: ssh: connect to host 10.16.0.113 port 22: Host is unreachable
15:09:50 DEBUG juju.provider.openstack provider.go:417 instance eaffbae5-63ac-46d8-9f54-ed0158154bba has floating IP address: 10.16.0.113
15:09:56 DEBUG juju.provider.common bootstrap.go:564 connection attempt for 10.16.0.113 failed: ssh: connect to host 10.16.0.113 port 22: Host is unreachable
15:10:00 DEBUG juju.provider.openstack provider.go:417 instance eaffbae5-63ac-46d8-9f54-ed0158154bba has floating IP address: 10.16.0.113
15:10:04 DEBUG juju.provider.common bootstrap.go:564 connection attempt for 10.16.0.113 failed: ssh: connect to host 10.16.0.113 port 22: Host is unreachable
15:10:10 DEBUG juju.provider.openstack provider.go:417 instance eaffbae5-63ac-46d8-9f54-ed0158154bba has floating IP address: 10.16.0.113
15:10:12 DEBUG juju.provider.common bootstrap.go:564 connection attempt for 10.16.0.113 failed: ssh: connect to host 10.16.0.113 port 22: Host is unreachable
15:10:20 DEBUG juju.provider.openstack provider.go:417 instance eaffbae5-63ac-46d8-9f54-ed0158154bba has floating IP address: 10.16.0.113
15:10:20 DEBUG juju.provider.common bootstrap.go:564 connection attempt for 10.16.0.113 failed: ssh: connect to host 10.16.0.113 port 22: Host is unreachable
15:10:25 DEBUG juju.provider.common bootstrap.go:564 connection attempt for 192.168.120.11 failed: ssh: connect to host 192.168.120.11 port 22: Operation timed out
15:10:28 DEBUG juju.provider.common bootstrap.go:564 connection attempt for 10.16.0.113 failed: ssh: connect to host 10.16.0.113 port 22: Host is unreachable
15:10:30 DEBUG juju.provider.openstack provider.go:417 instance eaffbae5-63ac-46d8-9f54-ed0158154bba has floating IP address: 10.16.0.113
15:10:36 DEBUG juju.provider.common bootstrap.go:564 connection attempt for 10.16.0.113 failed: ssh: connect to host 10.16.0.113 port 22: Host is unreachable
15:10:40 DEBUG juju.provider.openstack provider.go:417 instance eaffbae5-63ac-46d8-9f54-ed0158154bba has floating IP address: 10.16.0.113
15:10:44 DEBUG juju.provider.common bootstrap.go:564 connection attempt for 10.16.0.113 failed: ssh: connect to host 10.16.0.113 port 22: Host is unreachable
15:10:50 DEBUG juju.provider.openstack provider.go:417 instance eaffbae5-63ac-46d8-9f54-ed0158154bba has floating IP address: 10.16.0.113
15:10:52 DEBUG juju.provider.common bootstrap.go:564 connection attempt for 10.16.0.113 failed: ssh: connect to host 10.16.0.113 port 22: Host is unreachable
15:11:00 DEBUG juju.provider.openstack provider.go:417 instance eaffbae5-63ac-46d8-9f54-ed0158154bba has floating IP address: 10.16.0.113
15:11:01 DEBUG juju.provider.common bootstrap.go:564 connection attempt for 10.16.0.113 failed: ssh: connect to host 10.16.0.113 port 22: Host is unreachable
15:11:09 DEBUG juju.provider.common bootstrap.go:564 connection attempt for 10.16.0.113 failed: ssh: connect to host 10.16.0.113 port 22: Host is unreachable
15:11:10 DEBUG juju.provider.openstack provider.go:417 instance eaffbae5-63ac-46d8-9f54-ed0158154bba has floating IP address: 10.16.0.113
15:11:17 DEBUG juju.provider.common bootstrap.go:564 connection attempt for 10.16.0.113 failed: ssh: connect to host 10.16.0.113 port 22: Host is unreachable
15:11:20 DEBUG juju.provider.openstack provider.go:417 instance eaffbae5-63ac-46d8-9f54-ed0158154bba has floating IP address: 10.16.0.113
15:11:25 DEBUG juju.provider.common bootstrap.go:564 connection attempt for 10.16.0.113 failed: ssh: connect to host 10.16.0.113 port 22: Host is unreachable
15:11:30 DEBUG juju.provider.openstack provider.go:417 instance eaffbae5-63ac-46d8-9f54-ed0158154bba has floating IP address: 10.16.0.113
15:11:33 DEBUG juju.provider.common bootstrap.go:564 connection attempt for 10.16.0.113 failed: ssh: connect to host 10.16.0.113 port 22: Host is unreachable
15:11:40 DEBUG juju.provider.openstack provider.go:417 instance eaffbae5-63ac-46d8-9f54-ed0158154bba has floating IP address: 10.16.0.113
15:11:41 DEBUG juju.provider.common bootstrap.go:564 connection attempt for 10.16.0.113 failed: ssh: connect to host 10.16.0.113 port 22: Host is unreachable
15:11:49 DEBUG juju.provider.common bootstrap.go:564 connection attempt for 10.16.0.113 failed: ssh: connect to host 10.16.0.113 port 22: Host is unreachable
15:11:50 DEBUG juju.provider.openstack provider.go:417 instance eaffbae5-63ac-46d8-9f54-ed0158154bba has floating IP address: 10.16.0.113
15:11:57 DEBUG juju.provider.common bootstrap.go:564 connection attempt for 10.16.0.113 failed: ssh: connect to host 10.16.0.113 port 22: Host is unreachable
15:12:00 DEBUG juju.provider.openstack provider.go:417 instance eaffbae5-63ac-46d8-9f54-ed0158154bba has floating IP address: 10.16.0.113
15:12:05 DEBUG juju.provider.common bootstrap.go:564 connection attempt for 10.16.0.113 failed: ssh: connect to host 10.16.0.113 port 22: Host is unreachable
15:12:10 DEBUG juju.provider.openstack provider.go:417 instance eaffbae5-63ac-46d8-9f54-ed0158154bba has floating IP address: 10.16.0.113
15:12:13 DEBUG juju.provider.common bootstrap.go:564 connection attempt for 10.16.0.113 failed: ssh: connect to host 10.16.0.113 port 22: Host is unreachable
15:12:20 DEBUG juju.provider.openstack provider.go:417 instance eaffbae5-63ac-46d8-9f54-ed0158154bba has floating IP address: 10.16.0.113
15:12:21 DEBUG juju.provider.common bootstrap.go:564 connection attempt for 10.16.0.113 failed: ssh: connect to host 10.16.0.113 port 22: Host is unreachable
15:12:29 DEBUG juju.provider.common bootstrap.go:564 connection attempt for 10.16.0.113 failed: ssh: connect to host 10.16.0.113 port 22: Host is unreachable
15:12:30 DEBUG juju.provider.openstack provider.go:417 instance eaffbae5-63ac-46d8-9f54-ed0158154bba has floating IP address: 10.16.0.113
15:12:37 DEBUG juju.provider.common bootstrap.go:564 connection attempt for 10.16.0.113 failed: ssh: connect to host 10.16.0.113 port 22: Host is unreachable
15:12:40 DEBUG juju.provider.openstack provider.go:417 instance eaffbae5-63ac-46d8-9f54-ed0158154bba has floating IP address: 10.16.0.113
15:12:41 DEBUG juju.provider.common bootstrap.go:564 connection attempt for 192.168.120.11 failed: ssh: connect to host 192.168.120.11 port 22: Operation timed out
15:12:45 DEBUG juju.provider.common bootstrap.go:564 connection attempt for 10.16.0.113 failed: ssh: connect to host 10.16.0.113 port 22: Host is unreachable
15:12:50 DEBUG juju.provider.openstack provider.go:417 instance eaffbae5-63ac-46d8-9f54-ed0158154bba has floating IP address: 10.16.0.113
15:12:53 DEBUG juju.provider.common bootstrap.go:564 connection attempt for 10.16.0.113 failed: ssh: connect to host 10.16.0.113 port 22: Host is unreachable
15:13:00 DEBUG juju.provider.openstack provider.go:417 instance eaffbae5-63ac-46d8-9f54-ed0158154bba has floating IP address: 10.16.0.113
15:13:01 DEBUG juju.provider.common bootstrap.go:564 connection attempt for 10.16.0.113 failed: ssh: connect to host 10.16.0.113 port 22: Host is unreachable
15:13:10 DEBUG juju.provider.common bootstrap.go:564 connection attempt for 10.16.0.113 failed: ssh: connect to host 10.16.0.113 port 22: Host is unreachable
15:13:10 DEBUG juju.provider.openstack provider.go:417 instance eaffbae5-63ac-46d8-9f54-ed0158154bba has floating IP address: 10.16.0.113
15:13:18 DEBUG juju.provider.common bootstrap.go:564 connection attempt for 10.16.0.113 failed: ssh: connect to host 10.16.0.113 port 22: Host is unreachable
15:13:20 DEBUG juju.provider.openstack provider.go:417 instance eaffbae5-63ac-46d8-9f54-ed0158154bba has floating IP address: 10.16.0.113
15:13:26 DEBUG juju.provider.common bootstrap.go:564 connection attempt for 10.16.0.113 failed: ssh: connect to host 10.16.0.113 port 22: Host is unreachable
15:13:30 DEBUG juju.provider.openstack provider.go:417 instance eaffbae5-63ac-46d8-9f54-ed0158154bba has floating IP address: 10.16.0.113
15:13:34 DEBUG juju.provider.common bootstrap.go:564 connection attempt for 10.16.0.113 failed: ssh: connect to host 10.16.0.113 port 22: Host is unreachable
15:13:40 DEBUG juju.provider.openstack provider.go:417 instance eaffbae5-63ac-46d8-9f54-ed0158154bba has floating IP address: 10.16.0.113
15:13:42 DEBUG juju.provider.common bootstrap.go:564 connection attempt for 10.16.0.113 failed: ssh: connect to host 10.16.0.113 port 22: Host is unreachable
15:13:50 DEBUG juju.provider.common bootstrap.go:564 connection attempt for 10.16.0.113 failed: ssh: connect to host 10.16.0.113 port 22: Host is unreachable
15:13:50 DEBUG juju.provider.openstack provider.go:417 instance eaffbae5-63ac-46d8-9f54-ed0158154bba has floating IP address: 10.16.0.113
15:13:58 DEBUG juju.provider.common bootstrap.go:564 connection attempt for 10.16.0.113 failed: ssh: connect to host 10.16.0.113 port 22: Host is unreachable
15:14:00 DEBUG juju.provider.openstack provider.go:417 instance eaffbae5-63ac-46d8-9f54-ed0158154bba has floating IP address: 10.16.0.113
15:14:06 DEBUG juju.provider.common bootstrap.go:564 connection attempt for 10.16.0.113 failed: ssh: connect to host 10.16.0.113 port 22: Host is unreachable
15:14:10 DEBUG juju.provider.openstack provider.go:417 instance eaffbae5-63ac-46d8-9f54-ed0158154bba has floating IP address: 10.16.0.113
15:14:14 DEBUG juju.provider.common bootstrap.go:564 connection attempt for 10.16.0.113 failed: ssh: connect to host 10.16.0.113 port 22: Host is unreachable
15:14:20 DEBUG juju.provider.openstack provider.go:417 instance eaffbae5-63ac-46d8-9f54-ed0158154bba has floating IP address: 10.16.0.113
15:14:22 DEBUG juju.provider.common bootstrap.go:564 connection attempt for 10.16.0.113 failed: ssh: connect to host 10.16.0.113 port 22: Host is unreachable
15:14:30 DEBUG juju.provider.openstack provider.go:417 instance eaffbae5-63ac-46d8-9f54-ed0158154bba has floating IP address: 10.16.0.113
15:14:30 DEBUG juju.provider.common bootstrap.go:564 connection attempt for 10.16.0.113 failed: ssh: connect to host 10.16.0.113 port 22: Host is unreachable
15:14:38 DEBUG juju.provider.common bootstrap.go:564 connection attempt for 10.16.0.113 failed: ssh: connect to host 10.16.0.113 port 22: Host is unreachable
15:14:40 DEBUG juju.provider.openstack provider.go:417 instance eaffbae5-63ac-46d8-9f54-ed0158154bba has floating IP address: 10.16.0.113
15:14:46 DEBUG juju.provider.common bootstrap.go:564 connection attempt for 10.16.0.113 failed: ssh: connect to host 10.16.0.113 port 22: Host is unreachable
15:14:50 DEBUG juju.provider.openstack provider.go:417 instance eaffbae5-63ac-46d8-9f54-ed0158154bba has floating IP address: 10.16.0.113
15:14:54 DEBUG juju.provider.common bootstrap.go:564 connection attempt for 10.16.0.113 failed: ssh: connect to host 10.16.0.113 port 22: Host is unreachable
15:14:56 DEBUG juju.provider.common bootstrap.go:564 connection attempt for 192.168.120.11 failed: ssh: connect to host 192.168.120.11 port 22: Operation timed out
15:15:00 DEBUG juju.provider.openstack provider.go:417 instance eaffbae5-63ac-46d8-9f54-ed0158154bba has floating IP address: 10.16.0.113
15:15:02 DEBUG juju.provider.common bootstrap.go:564 connection attempt for 10.16.0.113 failed: ssh: connect to host 10.16.0.113 port 22: Host is unreachable
15:15:10 DEBUG juju.provider.openstack provider.go:417 instance eaffbae5-63ac-46d8-9f54-ed0158154bba has floating IP address: 10.16.0.113
15:15:11 DEBUG juju.provider.common bootstrap.go:564 connection attempt for 10.16.0.113 failed: ssh: connect to host 10.16.0.113 port 22: Host is unreachable
15:15:19 DEBUG juju.provider.common bootstrap.go:564 connection attempt for 10.16.0.113 failed: ssh: connect to host 10.16.0.113 port 22: Host is unreachable
15:15:20 DEBUG juju.provider.openstack provider.go:417 instance eaffbae5-63ac-46d8-9f54-ed0158154bba has floating IP address: 10.16.0.113
15:15:27 DEBUG juju.provider.common bootstrap.go:564 connection attempt for 10.16.0.113 failed: ssh: connect to host 10.16.0.113 port 22: Host is unreachable
15:15:30 DEBUG juju.provider.openstack provider.go:417 instance eaffbae5-63ac-46d8-9f54-ed0158154bba has floating IP address: 10.16.0.113
15:15:35 DEBUG juju.provider.common bootstrap.go:564 connection attempt for 10.16.0.113 failed: ssh: connect to host 10.16.0.113 port 22: Host is unreachable
15:15:40 DEBUG juju.provider.openstack provider.go:417 instance eaffbae5-63ac-46d8-9f54-ed0158154bba has floating IP address: 10.16.0.113
15:15:43 DEBUG juju.provider.common bootstrap.go:564 connection attempt for 10.16.0.113 failed: ssh: connect to host 10.16.0.113 port 22: Host is unreachable
15:15:50 DEBUG juju.provider.openstack provider.go:417 instance eaffbae5-63ac-46d8-9f54-ed0158154bba has floating IP address: 10.16.0.113
15:15:51 DEBUG juju.provider.common bootstrap.go:564 connection attempt for 10.16.0.113 failed: ssh: connect to host 10.16.0.113 port 22: Host is unreachable
15:15:59 DEBUG juju.provider.common bootstrap.go:564 connection attempt for 10.16.0.113 failed: ssh: connect to host 10.16.0.113 port 22: Host is unreachable
15:16:00 DEBUG juju.provider.openstack provider.go:417 instance eaffbae5-63ac-46d8-9f54-ed0158154bba has floating IP address: 10.16.0.113
15:16:07 DEBUG juju.provider.common bootstrap.go:564 connection attempt for 10.16.0.113 failed: ssh: connect to host 10.16.0.113 port 22: Host is unreachable
15:16:10 DEBUG juju.provider.openstack provider.go:417 instance eaffbae5-63ac-46d8-9f54-ed0158154bba has floating IP address: 10.16.0.113
15:16:15 DEBUG juju.provider.common bootstrap.go:564 connection attempt for 10.16.0.113 failed: ssh: connect to host 10.16.0.113 port 22: Host is unreachable
15:16:20 DEBUG juju.provider.openstack provider.go:417 instance eaffbae5-63ac-46d8-9f54-ed0158154bba has floating IP address: 10.16.0.113
15:16:23 DEBUG juju.provider.common bootstrap.go:564 connection attempt for 10.16.0.113 failed: ssh: connect to host 10.16.0.113 port 22: Host is unreachable
15:16:30 DEBUG juju.provider.openstack provider.go:417 instance eaffbae5-63ac-46d8-9f54-ed0158154bba has floating IP address: 10.16.0.113
15:16:31 DEBUG juju.provider.common bootstrap.go:564 connection attempt for 10.16.0.113 failed: ssh: connect to host 10.16.0.113 port 22: Host is unreachable
15:16:39 DEBUG juju.provider.common bootstrap.go:564 connection attempt for 10.16.0.113 failed: ssh: connect to host 10.16.0.113 port 22: Host is unreachable
15:16:40 DEBUG juju.provider.openstack provider.go:417 instance eaffbae5-63ac-46d8-9f54-ed0158154bba has floating IP address: 10.16.0.113
15:16:47 DEBUG juju.provider.common bootstrap.go:564 connection attempt for 10.16.0.113 failed: ssh: connect to host 10.16.0.113 port 22: Host is unreachable
15:16:50 DEBUG juju.provider.openstack provider.go:417 instance eaffbae5-63ac-46d8-9f54-ed0158154bba has floating IP address: 10.16.0.113
15:16:55 DEBUG juju.provider.common bootstrap.go:564 connection attempt for 10.16.0.113 failed: ssh: connect to host 10.16.0.113 port 22: Host is unreachable
15:17:00 DEBUG juju.provider.openstack provider.go:417 instance eaffbae5-63ac-46d8-9f54-ed0158154bba has floating IP address: 10.16.0.113
15:17:03 DEBUG juju.provider.common bootstrap.go:564 connection attempt for 10.16.0.113 failed: ssh: connect to host 10.16.0.113 port 22: Host is unreachable
15:17:10 DEBUG juju.provider.openstack provider.go:417 instance eaffbae5-63ac-46d8-9f54-ed0158154bba has floating IP address: 10.16.0.113
15:17:11 DEBUG juju.provider.common bootstrap.go:564 connection attempt for 192.168.120.11 failed: ssh: connect to host 192.168.120.11 port 22: Operation timed out
15:17:11 DEBUG juju.provider.common bootstrap.go:564 connection attempt for 10.16.0.113 failed: ssh: connect to host 10.16.0.113 port 22: Host is unreachable
15:17:20 DEBUG juju.provider.common bootstrap.go:564 connection attempt for 10.16.0.113 failed: ssh: connect to host 10.16.0.113 port 22: Host is unreachable
15:17:20 DEBUG juju.provider.openstack provider.go:417 instance eaffbae5-63ac-46d8-9f54-ed0158154bba has floating IP address: 10.16.0.113
15:17:28 DEBUG juju.provider.common bootstrap.go:564 connection attempt for 10.16.0.113 failed: ssh: connect to host 10.16.0.113 port 22: Host is unreachable
15:17:30 DEBUG juju.provider.openstack provider.go:417 instance eaffbae5-63ac-46d8-9f54-ed0158154bba has floating IP address: 10.16.0.113
15:17:36 DEBUG juju.provider.common bootstrap.go:564 connection attempt for 10.16.0.113 failed: ssh: connect to host 10.16.0.113 port 22: Host is unreachable
15:17:40 DEBUG juju.provider.openstack provider.go:417 instance eaffbae5-63ac-46d8-9f54-ed0158154bba has floating IP address: 10.16.0.113
15:17:44 DEBUG juju.provider.common bootstrap.go:564 connection attempt for 10.16.0.113 failed: ssh: connect to host 10.16.0.113 port 22: Host is unreachable
15:17:50 DEBUG juju.provider.openstack provider.go:417 instance eaffbae5-63ac-46d8-9f54-ed0158154bba has floating IP address: 10.16.0.113
15:17:52 DEBUG juju.provider.common bootstrap.go:564 connection attempt for 10.16.0.113 failed: ssh: connect to host 10.16.0.113 port 22: Host is unreachable
15:18:00 DEBUG juju.provider.common bootstrap.go:564 connection attempt for 10.16.0.113 failed: ssh: connect to host 10.16.0.113 port 22: Host is unreachable
15:18:00 DEBUG juju.provider.openstack provider.go:417 instance eaffbae5-63ac-46d8-9f54-ed0158154bba has floating IP address: 10.16.0.113
15:18:08 DEBUG juju.provider.common bootstrap.go:564 connection attempt for 10.16.0.113 failed: ssh: connect to host 10.16.0.113 port 22: Host is unreachable
15:18:10 DEBUG juju.provider.openstack provider.go:417 instance eaffbae5-63ac-46d8-9f54-ed0158154bba has floating IP address: 10.16.0.113
15:18:16 DEBUG juju.provider.common bootstrap.go:564 connection attempt for 10.16.0.113 failed: ssh: connect to host 10.16.0.113 port 22: Host is unreachable
15:18:20 DEBUG juju.provider.openstack provider.go:417 instance eaffbae5-63ac-46d8-9f54-ed0158154bba has floating IP address: 10.16.0.113
15:18:24 DEBUG juju.provider.common bootstrap.go:564 connection attempt for 10.16.0.113 failed: ssh: connect to host 10.16.0.113 port 22: Host is unreachable
15:18:30 DEBUG juju.provider.openstack provider.go:417 instance eaffbae5-63ac-46d8-9f54-ed0158154bba has floating IP address: 10.16.0.113
15:18:32 DEBUG juju.provider.common bootstrap.go:564 connection attempt for 10.16.0.113 failed: ssh: connect to host 10.16.0.113 port 22: Host is unreachable
15:18:40 DEBUG juju.provider.openstack provider.go:417 instance eaffbae5-63ac-46d8-9f54-ed0158154bba has floating IP address: 10.16.0.113
15:18:40 DEBUG juju.provider.common bootstrap.go:564 connection attempt for 10.16.0.113 failed: ssh: connect to host 10.16.0.113 port 22: Host is unreachable
15:18:48 DEBUG juju.provider.common bootstrap.go:564 connection attempt for 10.16.0.113 failed: ssh: connect to host 10.16.0.113 port 22: Host is unreachable
15:18:50 DEBUG juju.provider.openstack provider.go:417 instance eaffbae5-63ac-46d8-9f54-ed0158154bba has floating IP address: 10.16.0.113
15:18:56 DEBUG juju.provider.common bootstrap.go:564 connection attempt for 10.16.0.113 failed: ssh: connect to host 10.16.0.113 port 22: Host is unreachable
15:19:00 DEBUG juju.provider.openstack provider.go:417 instance eaffbae5-63ac-46d8-9f54-ed0158154bba has floating IP address: 10.16.0.113
15:19:04 DEBUG juju.provider.common bootstrap.go:564 connection attempt for 10.16.0.113 failed: ssh: connect to host 10.16.0.113 port 22: Host is unreachable
15:19:10 DEBUG juju.provider.openstack provider.go:417 instance eaffbae5-63ac-46d8-9f54-ed0158154bba has floating IP address: 10.16.0.113
15:19:12 DEBUG juju.provider.common bootstrap.go:564 connection attempt for 10.16.0.113 failed: ssh: connect to host 10.16.0.113 port 22: Host is unreachable
15:19:20 DEBUG juju.provider.openstack provider.go:417 instance eaffbae5-63ac-46d8-9f54-ed0158154bba has floating IP address: 10.16.0.113
15:19:21 DEBUG juju.provider.common bootstrap.go:564 connection attempt for 10.16.0.113 failed: ssh: connect to host 10.16.0.113 port 22: Host is unreachable
15:19:26 DEBUG juju.provider.common bootstrap.go:564 connection attempt for 192.168.120.11 failed: ssh: connect to host 192.168.120.11 port 22: Operation timed out
15:19:29 DEBUG juju.provider.common bootstrap.go:564 connection attempt for 10.16.0.113 failed: ssh: connect to host 10.16.0.113 port 22: Host is unreachable
15:19:30 DEBUG juju.provider.openstack provider.go:417 instance eaffbae5-63ac-46d8-9f54-ed0158154bba has floating IP address: 10.16.0.113
15:19:37 DEBUG juju.provider.common bootstrap.go:564 connection attempt for 10.16.0.113 failed: ssh: connect to host 10.16.0.113 port 22: Host is unreachable
15:19:40 DEBUG juju.provider.openstack provider.go:417 instance eaffbae5-63ac-46d8-9f54-ed0158154bba has floating IP address: 10.16.0.113
15:19:45 DEBUG juju.provider.common bootstrap.go:564 connection attempt for 10.16.0.113 failed: ssh: connect to host 10.16.0.113 port 22: Host is unreachable
15:19:50 DEBUG juju.provider.openstack provider.go:417 instance eaffbae5-63ac-46d8-9f54-ed0158154bba has floating IP address: 10.16.0.113
15:19:53 DEBUG juju.provider.common bootstrap.go:564 connection attempt for 10.16.0.113 failed: ssh: connect to host 10.16.0.113 port 22: Host is unreachable
15:20:00 DEBUG juju.provider.openstack provider.go:417 instance eaffbae5-63ac-46d8-9f54-ed0158154bba has floating IP address: 10.16.0.113
15:20:01 DEBUG juju.provider.common bootstrap.go:564 connection attempt for 10.16.0.113 failed: ssh: connect to host 10.16.0.113 port 22: Host is unreachable
15:20:09 DEBUG juju.provider.common bootstrap.go:564 connection attempt for 10.16.0.113 failed: ssh: connect to host 10.16.0.113 port 22: Host is unreachable
15:20:10 DEBUG juju.provider.openstack provider.go:417 instance eaffbae5-63ac-46d8-9f54-ed0158154bba has floating IP address: 10.16.0.113
15:20:17 DEBUG juju.provider.common bootstrap.go:564 connection attempt for 10.16.0.113 failed: ssh: connect to host 10.16.0.113 port 22: Host is unreachable
15:20:20 DEBUG juju.provider.openstack provider.go:417 instance eaffbae5-63ac-46d8-9f54-ed0158154bba has floating IP address: 10.16.0.113
15:20:25 DEBUG juju.provider.common bootstrap.go:564 connection attempt for 10.16.0.113 failed: ssh: connect to host 10.16.0.113 port 22: Host is unreachable
15:20:30 DEBUG juju.provider.openstack provider.go:417 instance eaffbae5-63ac-46d8-9f54-ed0158154bba has floating IP address: 10.16.0.113
15:20:33 DEBUG juju.provider.common bootstrap.go:564 connection attempt for 10.16.0.113 failed: ssh: connect to host 10.16.0.113 port 22: Host is unreachable
15:20:40 DEBUG juju.provider.openstack provider.go:417 instance eaffbae5-63ac-46d8-9f54-ed0158154bba has floating IP address: 10.16.0.113
15:20:41 DEBUG juju.provider.common bootstrap.go:564 connection attempt for 10.16.0.113 failed: ssh: connect to host 10.16.0.113 port 22: Host is unreachable
15:20:49 DEBUG juju.provider.common bootstrap.go:564 connection attempt for 10.16.0.113 failed: ssh: connect to host 10.16.0.113 port 22: Host is unreachable
15:20:50 DEBUG juju.provider.openstack provider.go:417 instance eaffbae5-63ac-46d8-9f54-ed0158154bba has floating IP address: 10.16.0.113
15:20:57 DEBUG juju.provider.common bootstrap.go:564 connection attempt for 10.16.0.113 failed: ssh: connect to host 10.16.0.113 port 22: Host is unreachable
15:21:00 DEBUG juju.provider.openstack provider.go:417 instance eaffbae5-63ac-46d8-9f54-ed0158154bba has floating IP address: 10.16.0.113
15:21:05 DEBUG juju.provider.common bootstrap.go:564 connection attempt for 10.16.0.113 failed: ssh: connect to host 10.16.0.113 port 22: Host is unreachable
15:21:10 DEBUG juju.provider.openstack provider.go:417 instance eaffbae5-63ac-46d8-9f54-ed0158154bba has floating IP address: 10.16.0.113
15:21:13 DEBUG juju.provider.common bootstrap.go:564 connection attempt for 10.16.0.113 failed: ssh: connect to host 10.16.0.113 port 22: Host is unreachable
15:21:20 DEBUG juju.provider.openstack provider.go:417 instance eaffbae5-63ac-46d8-9f54-ed0158154bba has floating IP address: 10.16.0.113
15:21:21 DEBUG juju.provider.common bootstrap.go:564 connection attempt for 10.16.0.113 failed: ssh: connect to host 10.16.0.113 port 22: Host is unreachable
15:21:30 DEBUG juju.provider.common bootstrap.go:564 connection attempt for 10.16.0.113 failed: ssh: connect to host 10.16.0.113 port 22: Host is unreachable
15:21:30 DEBUG juju.provider.openstack provider.go:417 instance eaffbae5-63ac-46d8-9f54-ed0158154bba has floating IP address: 10.16.0.113
15:21:38 DEBUG juju.provider.common bootstrap.go:564 connection attempt for 10.16.0.113 failed: ssh: connect to host 10.16.0.113 port 22: Host is unreachable
15:21:40 DEBUG juju.provider.openstack provider.go:417 instance eaffbae5-63ac-46d8-9f54-ed0158154bba has floating IP address: 10.16.0.113
15:21:41 DEBUG juju.provider.common bootstrap.go:564 connection attempt for 192.168.120.11 failed: ssh: connect to host 192.168.120.11 port 22: Operation timed out
15:21:46 DEBUG juju.provider.common bootstrap.go:564 connection attempt for 10.16.0.113 failed: ssh: connect to host 10.16.0.113 port 22: Host is unreachable
15:21:50 DEBUG juju.provider.openstack provider.go:417 instance eaffbae5-63ac-46d8-9f54-ed0158154bba has floating IP address: 10.16.0.113
15:21:54 DEBUG juju.provider.common bootstrap.go:564 connection attempt for 10.16.0.113 failed: ssh: connect to host 10.16.0.113 port 22: Host is unreachable
15:22:00 DEBUG juju.provider.openstack provider.go:417 instance eaffbae5-63ac-46d8-9f54-ed0158154bba has floating IP address: 10.16.0.113
15:22:02 DEBUG juju.provider.common bootstrap.go:564 connection attempt for 10.16.0.113 failed: ssh: connect to host 10.16.0.113 port 22: Host is unreachable
15:22:10 DEBUG juju.provider.common bootstrap.go:564 connection attempt for 10.16.0.113 failed: ssh: connect to host 10.16.0.113 port 22: Host is unreachable
15:22:10 DEBUG juju.provider.openstack provider.go:417 instance eaffbae5-63ac-46d8-9f54-ed0158154bba has floating IP address: 10.16.0.113
15:22:18 DEBUG juju.provider.common bootstrap.go:564 connection attempt for 10.16.0.113 failed: ssh: connect to host 10.16.0.113 port 22: Host is unreachable
15:22:20 DEBUG juju.provider.openstack provider.go:417 instance eaffbae5-63ac-46d8-9f54-ed0158154bba has floating IP address: 10.16.0.113
15:22:26 DEBUG juju.provider.common bootstrap.go:564 connection attempt for 10.16.0.113 failed: ssh: connect to host 10.16.0.113 port 22: Host is unreachable
15:22:30 DEBUG juju.provider.openstack provider.go:417 instance eaffbae5-63ac-46d8-9f54-ed0158154bba has floating IP address: 10.16.0.113
15:22:34 DEBUG juju.provider.common bootstrap.go:564 connection attempt for 10.16.0.113 failed: ssh: connect to host 10.16.0.113 port 22: Host is unreachable
15:22:40 DEBUG juju.provider.openstack provider.go:417 instance eaffbae5-63ac-46d8-9f54-ed0158154bba has floating IP address: 10.16.0.113
15:22:42 DEBUG juju.provider.common bootstrap.go:564 connection attempt for 10.16.0.113 failed: ssh: connect to host 10.16.0.113 port 22: Host is unreachable
15:22:50 DEBUG juju.provider.openstack provider.go:417 instance eaffbae5-63ac-46d8-9f54-ed0158154bba has floating IP address: 10.16.0.113
15:22:50 DEBUG juju.provider.common bootstrap.go:564 connection attempt for 10.16.0.113 failed: ssh: connect to host 10.16.0.113 port 22: Host is unreachable
15:22:58 DEBUG juju.provider.common bootstrap.go:564 connection attempt for 10.16.0.113 failed: ssh: connect to host 10.16.0.113 port 22: Host is unreachable
15:23:00 DEBUG juju.provider.openstack provider.go:417 instance eaffbae5-63ac-46d8-9f54-ed0158154bba has floating IP address: 10.16.0.113
15:23:06 DEBUG juju.provider.common bootstrap.go:564 connection attempt for 10.16.0.113 failed: ssh: connect to host 10.16.0.113 port 22: Host is unreachable
15:23:10 DEBUG juju.provider.openstack provider.go:417 instance eaffbae5-63ac-46d8-9f54-ed0158154bba has floating IP address: 10.16.0.113
15:23:14 DEBUG juju.provider.common bootstrap.go:564 connection attempt for 10.16.0.113 failed: ssh: connect to host 10.16.0.113 port 22: Host is unreachable
15:23:20 DEBUG juju.provider.openstack provider.go:417 instance eaffbae5-63ac-46d8-9f54-ed0158154bba has floating IP address: 10.16.0.113
15:23:22 DEBUG juju.provider.common bootstrap.go:564 connection attempt for 10.16.0.113 failed: ssh: connect to host 10.16.0.113 port 22: Host is unreachable
15:23:30 DEBUG juju.provider.openstack provider.go:417 instance eaffbae5-63ac-46d8-9f54-ed0158154bba has floating IP address: 10.16.0.113
15:23:30 DEBUG juju.provider.common bootstrap.go:564 connection attempt for 10.16.0.113 failed: ssh: connect to host 10.16.0.113 port 22: Host is unreachable
15:23:39 DEBUG juju.provider.common bootstrap.go:564 connection attempt for 10.16.0.113 failed: ssh: connect to host 10.16.0.113 port 22: Host is unreachable
15:23:40 DEBUG juju.provider.openstack provider.go:417 instance eaffbae5-63ac-46d8-9f54-ed0158154bba has floating IP address: 10.16.0.113
15:23:47 DEBUG juju.provider.common bootstrap.go:564 connection attempt for 10.16.0.113 failed: ssh: connect to host 10.16.0.113 port 22: Host is unreachable
15:23:50 DEBUG juju.provider.openstack provider.go:417 instance eaffbae5-63ac-46d8-9f54-ed0158154bba has floating IP address: 10.16.0.113
15:23:55 DEBUG juju.provider.common bootstrap.go:564 connection attempt for 10.16.0.113 failed: ssh: connect to host 10.16.0.113 port 22: Host is unreachable
15:23:56 DEBUG juju.provider.common bootstrap.go:564 connection attempt for 192.168.120.11 failed: ssh: connect to host 192.168.120.11 port 22: Operation timed out
15:24:00 DEBUG juju.provider.openstack provider.go:417 instance eaffbae5-63ac-46d8-9f54-ed0158154bba has floating IP address: 10.16.0.113
15:24:03 DEBUG juju.provider.common bootstrap.go:564 connection attempt for 10.16.0.113 failed: ssh: connect to host 10.16.0.113 port 22: Host is unreachable
15:24:10 DEBUG juju.provider.openstack provider.go:417 instance eaffbae5-63ac-46d8-9f54-ed0158154bba has floating IP address: 10.16.0.113
15:24:11 DEBUG juju.provider.common bootstrap.go:564 connection attempt for 10.16.0.113 failed: ssh: connect to host 10.16.0.113 port 22: Host is unreachable
15:24:19 DEBUG juju.provider.common bootstrap.go:564 connection attempt for 10.16.0.113 failed: ssh: connect to host 10.16.0.113 port 22: Host is unreachable
15:24:20 DEBUG juju.provider.openstack provider.go:417 instance eaffbae5-63ac-46d8-9f54-ed0158154bba has floating IP address: 10.16.0.113
15:24:27 DEBUG juju.provider.common bootstrap.go:564 connection attempt for 10.16.0.113 failed: ssh: connect to host 10.16.0.113 port 22: Host is unreachable
15:24:30 DEBUG juju.provider.openstack provider.go:417 instance eaffbae5-63ac-46d8-9f54-ed0158154bba has floating IP address: 10.16.0.113
15:24:35 DEBUG juju.provider.common bootstrap.go:564 connection attempt for 10.16.0.113 failed: ssh: connect to host 10.16.0.113 port 22: Host is unreachable
15:24:40 DEBUG juju.provider.openstack provider.go:417 instance eaffbae5-63ac-46d8-9f54-ed0158154bba has floating IP address: 10.16.0.113
15:24:43 DEBUG juju.provider.common bootstrap.go:564 connection attempt for 10.16.0.113 failed: ssh: connect to host 10.16.0.113 port 22: Host is unreachable
15:24:50 DEBUG juju.provider.openstack provider.go:417 instance eaffbae5-63ac-46d8-9f54-ed0158154bba has floating IP address: 10.16.0.113
15:24:51 DEBUG juju.provider.common bootstrap.go:564 connection attempt for 10.16.0.113 failed: ssh: connect to host 10.16.0.113 port 22: Host is unreachable
15:24:59 DEBUG juju.provider.common bootstrap.go:564 connection attempt for 10.16.0.113 failed: ssh: connect to host 10.16.0.113 port 22: Host is unreachable
15:25:00 DEBUG juju.provider.openstack provider.go:417 instance eaffbae5-63ac-46d8-9f54-ed0158154bba has floating IP address: 10.16.0.113
15:25:07 DEBUG juju.provider.common bootstrap.go:564 connection attempt for 10.16.0.113 failed: ssh: connect to host 10.16.0.113 port 22: Host is unreachable
15:25:11 DEBUG juju.provider.openstack provider.go:417 instance eaffbae5-63ac-46d8-9f54-ed0158154bba has floating IP address: 10.16.0.113
15:25:15 DEBUG juju.provider.common bootstrap.go:564 connection attempt for 10.16.0.113 failed: ssh: connect to host 10.16.0.113 port 22: Host is unreachable
15:25:20 DEBUG juju.provider.openstack provider.go:417 instance eaffbae5-63ac-46d8-9f54-ed0158154bba has floating IP address: 10.16.0.113
15:25:23 DEBUG juju.provider.common bootstrap.go:564 connection attempt for 10.16.0.113 failed: ssh: connect to host 10.16.0.113 port 22: Host is unreachable
15:25:30 DEBUG juju.provider.openstack provider.go:417 instance eaffbae5-63ac-46d8-9f54-ed0158154bba has floating IP address: 10.16.0.113
15:25:31 DEBUG juju.provider.common bootstrap.go:564 connection attempt for 10.16.0.113 failed: ssh: connect to host 10.16.0.113 port 22: Host is unreachable
15:25:40 DEBUG juju.provider.common bootstrap.go:564 connection attempt for 10.16.0.113 failed: ssh: connect to host 10.16.0.113 port 22: Host is unreachable
15:25:41 DEBUG juju.provider.openstack provider.go:417 instance eaffbae5-63ac-46d8-9f54-ed0158154bba has floating IP address: 10.16.0.113
15:25:48 DEBUG juju.provider.common bootstrap.go:564 connection attempt for 10.16.0.113 failed: ssh: connect to host 10.16.0.113 port 22: Host is unreachable
15:25:51 DEBUG juju.provider.openstack provider.go:417 instance eaffbae5-63ac-46d8-9f54-ed0158154bba has floating IP address: 10.16.0.113
15:25:56 DEBUG juju.provider.common bootstrap.go:564 connection attempt for 10.16.0.113 failed: ssh: connect to host 10.16.0.113 port 22: Host is unreachable
15:26:12 DEBUG juju.provider.common bootstrap.go:564 connection attempt for 192.168.120.11 failed: ssh: connect to host 192.168.120.11 port 22: Operation timed out
15:26:12 ERROR juju.cmd.juju.commands bootstrap.go:528 failed to bootstrap model: waited for 20m0s without being able to connect: ssh: connect to host 192.168.120.11 port 22: Operation timed out
15:26:12 DEBUG juju.cmd.juju.commands bootstrap.go:529 (error details: [{github.com/juju/juju/cmd/juju/commands/bootstrap.go:620: failed to bootstrap model} {waited for 20m0s without being able to connect: ssh: connect to host 192.168.120.11 port 22: Operation timed out}])
15:26:12 DEBUG juju.cmd.juju.commands bootstrap.go:1126 cleaning up after failed bootstrap
15:26:12 INFO  juju.provider.common destroy.go:20 destroying model "controller"
15:26:12 INFO  juju.provider.common destroy.go:31 destroying instances
15:26:14 DEBUG juju.provider.openstack provider.go:1296 terminating instances [eaffbae5-63ac-46d8-9f54-ed0158154bba]
15:26:14 DEBUG juju.provider.openstack firewaller.go:298 deleting security group "juju-9bbcd964-c2a6-4901-83ae-51e55d25a8a0-4e621b69-d9c8-4dab-8ba0-2a71805a74ed-0"
15:26:16 INFO  juju.provider.common destroy.go:55 destroying storage
15:26:16 DEBUG juju.provider.openstack cinder.go:115 volume URL: http://10.16.0.107:8776/v2/4df04dab398c4ed5ac98239bf7ed96ee
15:26:17 DEBUG juju.provider.openstack firewaller.go:298 deleting security group "juju-9bbcd964-c2a6-4901-83ae-51e55d25a8a0-4e621b69-d9c8-4dab-8ba0-2a71805a74ed"
15:26:18 INFO  cmd supercommand.go:465 command finished

2019-08-20 15:26:19,068 - xtesting.core.testcase - INFO - The results were successfully pushed to DB
2019-08-20 15:26:19,068 - xtesting.ci.run_tests - INFO - Test result:

+-------------------+------------------+------------------+----------------+
|     TEST CASE     |     PROJECT      |     DURATION     |     RESULT     |
+-------------------+------------------+------------------+----------------+
|      juju_epc     |     functest     |      22:12       |      FAIL      |
+-------------------+------------------+------------------+----------------+

2019-08-20 15:26:19,185 - functest.opnfv_tests.vnf.epc.juju_epc - ERROR - Exception with Juju Cleanup: ['juju', 'debug-log', '--replay', '--no-tail']
ERROR No controllers registered.

Please either create a new controller using "juju bootstrap" or connect to
another controller that you have been given access to using "juju register".


2019-08-20 15:26:31,759 - xtesting.ci.run_tests - ERROR - The test case 'juju_epc' failed.
2019-08-20 15:26:31,760 - xtesting.ci.run_tests - INFO - Xtesting report:

+----------------------+------------------+--------------+------------------+----------------+
|      TEST CASE       |     PROJECT      |     TIER     |     DURATION     |     RESULT     |
+----------------------+------------------+--------------+------------------+----------------+
|       cloudify       |     functest     |     vnf      |      03:37       |      FAIL      |
|     cloudify_ims     |     functest     |     vnf      |      03:36       |      FAIL      |
|       heat_ims       |     functest     |     vnf      |      20:32       |      FAIL      |
|     vyos_vrouter     |     functest     |     vnf      |      03:36       |      FAIL      |
|       juju_epc       |     functest     |     vnf      |      22:12       |      FAIL      |
+----------------------+------------------+--------------+------------------+----------------+

2019-08-20 15:26:31,766 - xtesting.ci.run_tests - INFO - Execution exit value: Result.EX_ERROR
Regular expression run condition: Expression=[k8-.*], Label=[os-odl-ovs-noha]
Run condition [Regular expression match] preventing perform for step [Execute shell]
[functest-fuel-virtual-daily-hunter] $ /bin/bash /tmp/jenkins819612028711720170.sh
Uploading logs to artifact logs/functest/ericsson-virtual1/hunter/2019-08-20_15-26-32
Logs can be found in https://artifacts.opnfv.org/logs_functest_ericsson-virtual1.html
https://artifacts.opnfv.org/logs/functest/ericsson-virtual1/hunter/2019-08-20_15-26-32/return_value
https://artifacts.opnfv.org/logs/functest/ericsson-virtual1/hunter/2019-08-20_15-26-32/functest.debug.log
https://artifacts.opnfv.org/logs/functest/ericsson-virtual1/hunter/2019-08-20_15-26-32/odl
https://artifacts.opnfv.org/logs/functest/ericsson-virtual1/hunter/2019-08-20_15-26-32/odl/report.html
https://artifacts.opnfv.org/logs/functest/ericsson-virtual1/hunter/2019-08-20_15-26-32/odl/log.html
https://artifacts.opnfv.org/logs/functest/ericsson-virtual1/hunter/2019-08-20_15-26-32/odl/output.xml
https://artifacts.opnfv.org/logs/functest/ericsson-virtual1/hunter/2019-08-20_15-26-32/odl/xunit.xml
https://artifacts.opnfv.org/logs/functest/ericsson-virtual1/hunter/2019-08-20_15-26-32/shaker
https://artifacts.opnfv.org/logs/functest/ericsson-virtual1/hunter/2019-08-20_15-26-32/rally_jobs
https://artifacts.opnfv.org/logs/functest/ericsson-virtual1/hunter/2019-08-20_15-26-32/rally_jobs/rally_jobs.html
https://artifacts.opnfv.org/logs/functest/ericsson-virtual1/hunter/2019-08-20_15-26-32/rally_jobs/rally.log
https://artifacts.opnfv.org/logs/functest/ericsson-virtual1/hunter/2019-08-20_15-26-32/rally_jobs/neutron.json
https://artifacts.opnfv.org/logs/functest/ericsson-virtual1/hunter/2019-08-20_15-26-32/rally_jobs/rally_jobs.xml
https://artifacts.opnfv.org/logs/functest/ericsson-virtual1/hunter/2019-08-20_15-26-32/tempest_smoke
https://artifacts.opnfv.org/logs/functest/ericsson-virtual1/hunter/2019-08-20_15-26-32/tempest_smoke/tempest-report.html
https://artifacts.opnfv.org/logs/functest/ericsson-virtual1/hunter/2019-08-20_15-26-32/tempest_smoke/rally.conf
https://artifacts.opnfv.org/logs/functest/ericsson-virtual1/hunter/2019-08-20_15-26-32/tempest_smoke/tempest-report.xml
https://artifacts.opnfv.org/logs/functest/ericsson-virtual1/hunter/2019-08-20_15-26-32/tempest_smoke/tempest.debug.log
https://artifacts.opnfv.org/logs/functest/ericsson-virtual1/hunter/2019-08-20_15-26-32/tempest_smoke/tempest.log
https://artifacts.opnfv.org/logs/functest/ericsson-virtual1/hunter/2019-08-20_15-26-32/tempest_smoke/rally.log
https://artifacts.opnfv.org/logs/functest/ericsson-virtual1/hunter/2019-08-20_15-26-32/tempest_smoke/tempest.conf
https://artifacts.opnfv.org/logs/functest/ericsson-virtual1/hunter/2019-08-20_15-26-32/tempest_smoke/test_raw_list.txt
https://artifacts.opnfv.org/logs/functest/ericsson-virtual1/hunter/2019-08-20_15-26-32/tempest_smoke/test_list.txt
https://artifacts.opnfv.org/logs/functest/ericsson-virtual1/hunter/2019-08-20_15-26-32/barbican
https://artifacts.opnfv.org/logs/functest/ericsson-virtual1/hunter/2019-08-20_15-26-32/barbican/tempest-report.html
https://artifacts.opnfv.org/logs/functest/ericsson-virtual1/hunter/2019-08-20_15-26-32/barbican/rally.conf
https://artifacts.opnfv.org/logs/functest/ericsson-virtual1/hunter/2019-08-20_15-26-32/barbican/tempest-report.xml
https://artifacts.opnfv.org/logs/functest/ericsson-virtual1/hunter/2019-08-20_15-26-32/barbican/tempest.debug.log
https://artifacts.opnfv.org/logs/functest/ericsson-virtual1/hunter/2019-08-20_15-26-32/barbican/tempest.log
https://artifacts.opnfv.org/logs/functest/ericsson-virtual1/hunter/2019-08-20_15-26-32/barbican/rally.log
https://artifacts.opnfv.org/logs/functest/ericsson-virtual1/hunter/2019-08-20_15-26-32/barbican/tempest.conf
https://artifacts.opnfv.org/logs/functest/ericsson-virtual1/hunter/2019-08-20_15-26-32/barbican/test_raw_list.txt
https://artifacts.opnfv.org/logs/functest/ericsson-virtual1/hunter/2019-08-20_15-26-32/barbican/test_list.txt
https://artifacts.opnfv.org/logs/functest/ericsson-virtual1/hunter/2019-08-20_15-26-32/doctor-notification
https://artifacts.opnfv.org/logs/functest/ericsson-virtual1/hunter/2019-08-20_15-26-32/doctor-notification/doctor-notification.log
https://artifacts.opnfv.org/logs/functest/ericsson-virtual1/hunter/2019-08-20_15-26-32/vmtp
https://artifacts.opnfv.org/logs/functest/ericsson-virtual1/hunter/2019-08-20_15-26-32/vmtp/vmtp.conf
https://artifacts.opnfv.org/logs/functest/ericsson-virtual1/hunter/2019-08-20_15-26-32/refstack_defcore
https://artifacts.opnfv.org/logs/functest/ericsson-virtual1/hunter/2019-08-20_15-26-32/refstack_defcore/tempest-report.html
https://artifacts.opnfv.org/logs/functest/ericsson-virtual1/hunter/2019-08-20_15-26-32/refstack_defcore/rally.conf
https://artifacts.opnfv.org/logs/functest/ericsson-virtual1/hunter/2019-08-20_15-26-32/refstack_defcore/tempest-report.xml
https://artifacts.opnfv.org/logs/functest/ericsson-virtual1/hunter/2019-08-20_15-26-32/refstack_defcore/tempest.debug.log
https://artifacts.opnfv.org/logs/functest/ericsson-virtual1/hunter/2019-08-20_15-26-32/refstack_defcore/tempest.log
https://artifacts.opnfv.org/logs/functest/ericsson-virtual1/hunter/2019-08-20_15-26-32/refstack_defcore/rally.log
https://artifacts.opnfv.org/logs/functest/ericsson-virtual1/hunter/2019-08-20_15-26-32/refstack_defcore/tempest.conf
https://artifacts.opnfv.org/logs/functest/ericsson-virtual1/hunter/2019-08-20_15-26-32/refstack_defcore/test_raw_list.txt
https://artifacts.opnfv.org/logs/functest/ericsson-virtual1/hunter/2019-08-20_15-26-32/refstack_defcore/test_list.txt
https://artifacts.opnfv.org/logs/functest/ericsson-virtual1/hunter/2019-08-20_15-26-32/neutron_trunk
https://artifacts.opnfv.org/logs/functest/ericsson-virtual1/hunter/2019-08-20_15-26-32/neutron_trunk/tempest-report.html
https://artifacts.opnfv.org/logs/functest/ericsson-virtual1/hunter/2019-08-20_15-26-32/neutron_trunk/rally.conf
https://artifacts.opnfv.org/logs/functest/ericsson-virtual1/hunter/2019-08-20_15-26-32/neutron_trunk/tempest-report.xml
https://artifacts.opnfv.org/logs/functest/ericsson-virtual1/hunter/2019-08-20_15-26-32/neutron_trunk/tempest.debug.log
https://artifacts.opnfv.org/logs/functest/ericsson-virtual1/hunter/2019-08-20_15-26-32/neutron_trunk/tempest.log
https://artifacts.opnfv.org/logs/functest/ericsson-virtual1/hunter/2019-08-20_15-26-32/neutron_trunk/rally.log
https://artifacts.opnfv.org/logs/functest/ericsson-virtual1/hunter/2019-08-20_15-26-32/neutron_trunk/tempest.conf
https://artifacts.opnfv.org/logs/functest/ericsson-virtual1/hunter/2019-08-20_15-26-32/neutron_trunk/test_raw_list.txt
https://artifacts.opnfv.org/logs/functest/ericsson-virtual1/hunter/2019-08-20_15-26-32/neutron_trunk/test_list.txt
https://artifacts.opnfv.org/logs/functest/ericsson-virtual1/hunter/2019-08-20_15-26-32/tempest_full
https://artifacts.opnfv.org/logs/functest/ericsson-virtual1/hunter/2019-08-20_15-26-32/tempest_full/tempest-report.html
https://artifacts.opnfv.org/logs/functest/ericsson-virtual1/hunter/2019-08-20_15-26-32/tempest_full/rally.conf
https://artifacts.opnfv.org/logs/functest/ericsson-virtual1/hunter/2019-08-20_15-26-32/tempest_full/tempest-report.xml
https://artifacts.opnfv.org/logs/functest/ericsson-virtual1/hunter/2019-08-20_15-26-32/tempest_full/tempest.debug.log
https://artifacts.opnfv.org/logs/functest/ericsson-virtual1/hunter/2019-08-20_15-26-32/tempest_full/tempest.log
https://artifacts.opnfv.org/logs/functest/ericsson-virtual1/hunter/2019-08-20_15-26-32/tempest_full/rally.log
https://artifacts.opnfv.org/logs/functest/ericsson-virtual1/hunter/2019-08-20_15-26-32/tempest_full/tempest.conf
https://artifacts.opnfv.org/logs/functest/ericsson-virtual1/hunter/2019-08-20_15-26-32/tempest_full/test_raw_list.txt
https://artifacts.opnfv.org/logs/functest/ericsson-virtual1/hunter/2019-08-20_15-26-32/tempest_full/test_list.txt
https://artifacts.opnfv.org/logs/functest/ericsson-virtual1/hunter/2019-08-20_15-26-32/functest.log
https://artifacts.opnfv.org/logs/functest/ericsson-virtual1/hunter/2019-08-20_15-26-32/patrole
https://artifacts.opnfv.org/logs/functest/ericsson-virtual1/hunter/2019-08-20_15-26-32/patrole/tempest-report.html
https://artifacts.opnfv.org/logs/functest/ericsson-virtual1/hunter/2019-08-20_15-26-32/patrole/rally.conf
https://artifacts.opnfv.org/logs/functest/ericsson-virtual1/hunter/2019-08-20_15-26-32/patrole/tempest-report.xml
https://artifacts.opnfv.org/logs/functest/ericsson-virtual1/hunter/2019-08-20_15-26-32/patrole/tempest.debug.log
https://artifacts.opnfv.org/logs/functest/ericsson-virtual1/hunter/2019-08-20_15-26-32/patrole/tempest.log
https://artifacts.opnfv.org/logs/functest/ericsson-virtual1/hunter/2019-08-20_15-26-32/patrole/rally.log
https://artifacts.opnfv.org/logs/functest/ericsson-virtual1/hunter/2019-08-20_15-26-32/patrole/tempest.conf
https://artifacts.opnfv.org/logs/functest/ericsson-virtual1/hunter/2019-08-20_15-26-32/patrole/test_raw_list.txt
https://artifacts.opnfv.org/logs/functest/ericsson-virtual1/hunter/2019-08-20_15-26-32/patrole/test_list.txt
https://artifacts.opnfv.org/logs/functest/ericsson-virtual1/hunter/2019-08-20_15-26-32/rally_full
https://artifacts.opnfv.org/logs/functest/ericsson-virtual1/hunter/2019-08-20_15-26-32/rally_full/cinder.json
https://artifacts.opnfv.org/logs/functest/ericsson-virtual1/hunter/2019-08-20_15-26-32/rally_full/gnocchi.json
https://artifacts.opnfv.org/logs/functest/ericsson-virtual1/hunter/2019-08-20_15-26-32/rally_full/rally_full.html
https://artifacts.opnfv.org/logs/functest/ericsson-virtual1/hunter/2019-08-20_15-26-32/rally_full/quotas.json
https://artifacts.opnfv.org/logs/functest/ericsson-virtual1/hunter/2019-08-20_15-26-32/rally_full/glance.json
https://artifacts.opnfv.org/logs/functest/ericsson-virtual1/hunter/2019-08-20_15-26-32/rally_full/rally_full.xml
https://artifacts.opnfv.org/logs/functest/ericsson-virtual1/hunter/2019-08-20_15-26-32/rally_full/rally.log
https://artifacts.opnfv.org/logs/functest/ericsson-virtual1/hunter/2019-08-20_15-26-32/rally_full/neutron.json
https://artifacts.opnfv.org/logs/functest/ericsson-virtual1/hunter/2019-08-20_15-26-32/rally_full/heat.json
https://artifacts.opnfv.org/logs/functest/ericsson-virtual1/hunter/2019-08-20_15-26-32/rally_full/nova.json
https://artifacts.opnfv.org/logs/functest/ericsson-virtual1/hunter/2019-08-20_15-26-32/rally_full/keystone.json
https://artifacts.opnfv.org/logs/functest/ericsson-virtual1/hunter/2019-08-20_15-26-32/rally_full/authenticate.json
https://artifacts.opnfv.org/logs/functest/ericsson-virtual1/hunter/2019-08-20_15-26-32/neutron-tempest-plugin-api
https://artifacts.opnfv.org/logs/functest/ericsson-virtual1/hunter/2019-08-20_15-26-32/neutron-tempest-plugin-api/tempest-report.html
https://artifacts.opnfv.org/logs/functest/ericsson-virtual1/hunter/2019-08-20_15-26-32/neutron-tempest-plugin-api/rally.conf
https://artifacts.opnfv.org/logs/functest/ericsson-virtual1/hunter/2019-08-20_15-26-32/neutron-tempest-plugin-api/tempest-report.xml
https://artifacts.opnfv.org/logs/functest/ericsson-virtual1/hunter/2019-08-20_15-26-32/neutron-tempest-plugin-api/tempest.debug.log
https://artifacts.opnfv.org/logs/functest/ericsson-virtual1/hunter/2019-08-20_15-26-32/neutron-tempest-plugin-api/tempest.log
https://artifacts.opnfv.org/logs/functest/ericsson-virtual1/hunter/2019-08-20_15-26-32/neutron-tempest-plugin-api/rally.log
https://artifacts.opnfv.org/logs/functest/ericsson-virtual1/hunter/2019-08-20_15-26-32/neutron-tempest-plugin-api/tempest.conf
https://artifacts.opnfv.org/logs/functest/ericsson-virtual1/hunter/2019-08-20_15-26-32/neutron-tempest-plugin-api/test_raw_list.txt
https://artifacts.opnfv.org/logs/functest/ericsson-virtual1/hunter/2019-08-20_15-26-32/neutron-tempest-plugin-api/test_list.txt
https://artifacts.opnfv.org/logs/functest/ericsson-virtual1/hunter/2019-08-20_15-26-32/tempest_scenario
https://artifacts.opnfv.org/logs/functest/ericsson-virtual1/hunter/2019-08-20_15-26-32/tempest_scenario/tempest-report.html
https://artifacts.opnfv.org/logs/functest/ericsson-virtual1/hunter/2019-08-20_15-26-32/tempest_scenario/rally.conf
https://artifacts.opnfv.org/logs/functest/ericsson-virtual1/hunter/2019-08-20_15-26-32/tempest_scenario/tempest-report.xml
https://artifacts.opnfv.org/logs/functest/ericsson-virtual1/hunter/2019-08-20_15-26-32/tempest_scenario/tempest.debug.log
https://artifacts.opnfv.org/logs/functest/ericsson-virtual1/hunter/2019-08-20_15-26-32/tempest_scenario/tempest.log
https://artifacts.opnfv.org/logs/functest/ericsson-virtual1/hunter/2019-08-20_15-26-32/tempest_scenario/rally.log
https://artifacts.opnfv.org/logs/functest/ericsson-virtual1/hunter/2019-08-20_15-26-32/tempest_scenario/tempest.conf
https://artifacts.opnfv.org/logs/functest/ericsson-virtual1/hunter/2019-08-20_15-26-32/tempest_scenario/test_raw_list.txt
https://artifacts.opnfv.org/logs/functest/ericsson-virtual1/hunter/2019-08-20_15-26-32/tempest_scenario/test_list.txt
https://artifacts.opnfv.org/logs/functest/ericsson-virtual1/hunter/2019-08-20_15-26-32/rally_sanity
https://artifacts.opnfv.org/logs/functest/ericsson-virtual1/hunter/2019-08-20_15-26-32/rally_sanity/rally_sanity.html
https://artifacts.opnfv.org/logs/functest/ericsson-virtual1/hunter/2019-08-20_15-26-32/rally_sanity/cinder.json
https://artifacts.opnfv.org/logs/functest/ericsson-virtual1/hunter/2019-08-20_15-26-32/rally_sanity/gnocchi.json
https://artifacts.opnfv.org/logs/functest/ericsson-virtual1/hunter/2019-08-20_15-26-32/rally_sanity/quotas.json
https://artifacts.opnfv.org/logs/functest/ericsson-virtual1/hunter/2019-08-20_15-26-32/rally_sanity/glance.json
https://artifacts.opnfv.org/logs/functest/ericsson-virtual1/hunter/2019-08-20_15-26-32/rally_sanity/rally_sanity.xml
https://artifacts.opnfv.org/logs/functest/ericsson-virtual1/hunter/2019-08-20_15-26-32/rally_sanity/rally.log
https://artifacts.opnfv.org/logs/functest/ericsson-virtual1/hunter/2019-08-20_15-26-32/rally_sanity/neutron.json
https://artifacts.opnfv.org/logs/functest/ericsson-virtual1/hunter/2019-08-20_15-26-32/rally_sanity/heat.json
https://artifacts.opnfv.org/logs/functest/ericsson-virtual1/hunter/2019-08-20_15-26-32/rally_sanity/nova.json
https://artifacts.opnfv.org/logs/functest/ericsson-virtual1/hunter/2019-08-20_15-26-32/rally_sanity/keystone.json
https://artifacts.opnfv.org/logs/functest/ericsson-virtual1/hunter/2019-08-20_15-26-32/rally_sanity/authenticate.json
https://artifacts.opnfv.org/logs/functest/ericsson-virtual1/hunter/2019-08-20_15-26-32/juju_epc
https://artifacts.opnfv.org/logs/functest/ericsson-virtual1/hunter/2019-08-20_15-26-32/juju_epc/credentials.yaml
https://artifacts.opnfv.org/logs/functest/ericsson-virtual1/hunter/2019-08-20_15-26-32/juju_epc/clouds.yaml
[functest-fuel-virtual-daily-hunter] $ /bin/bash /tmp/jenkins853049485181424389.sh
Build step 'Execute shell' marked build as failure
New run name is '624 Suite: daily Scenario: os-odl-ovs-noha'
Email was triggered for: Failure - Any
Sending email for trigger: Failure - Any
Request made to compress build log
Sending email to: tbramwell@linuxfoundation.org agardner@linuxfoundation.org rgrigar@linuxfoundation.org
Finished: FAILURE