AbortedConsole Output

Started by upstream project "fuel-os-odl-sfc-noha-virtual-daily-hunter" build number 42
originally caused by:
 Started by timer
Running as SYSTEM
[EnvInject] - Loading node environment variables.
Building remotely on ericsson-virtual3 (fuel-virtual ci-resource opnfv-sysinfo) in workspace /home/jenkins/opnfv/slave_root/workspace/functest-fuel-virtual-daily-hunter
using credential d42411ac011ad6f3dd2e1fa34eaa5d87f910eb2e
Wiping out workspace first.
Cloning the remote Git repository
Cloning repository https://gerrit.opnfv.org/gerrit/functest
 > git init /home/jenkins/opnfv/slave_root/workspace/functest-fuel-virtual-daily-hunter # timeout=10
Fetching upstream changes from https://gerrit.opnfv.org/gerrit/functest
 > git --version # timeout=10
using GIT_SSH to set credentials Jenkins Master SSH
 > git fetch --tags --progress https://gerrit.opnfv.org/gerrit/functest +refs/heads/*:refs/remotes/origin/* # timeout=15
 > git config remote.origin.url https://gerrit.opnfv.org/gerrit/functest # timeout=10
 > git config --add remote.origin.fetch +refs/heads/*:refs/remotes/origin/* # timeout=10
 > git config remote.origin.url https://gerrit.opnfv.org/gerrit/functest # timeout=10
Fetching upstream changes from https://gerrit.opnfv.org/gerrit/functest
using GIT_SSH to set credentials Jenkins Master SSH
 > git fetch --tags --progress https://gerrit.opnfv.org/gerrit/functest +refs/heads/*:refs/remotes/origin/* # timeout=15
 > git rev-parse refs/remotes/origin/stable/hunter^{commit} # timeout=10
 > git rev-parse refs/remotes/origin/origin/stable/hunter^{commit} # timeout=10
Checking out Revision 288bed88ffb21b0978d7b21f333c5026eacbee61 (refs/remotes/origin/stable/hunter)
 > git config core.sparsecheckout # timeout=10
 > git checkout -f 288bed88ffb21b0978d7b21f333c5026eacbee61 # timeout=15
Commit message: "Fix last redirects in docs"
 > git rev-list --no-walk 288bed88ffb21b0978d7b21f333c5026eacbee61 # timeout=10
Run condition [Regular expression match] enabling prebuild for step [Execute shell]
Run condition [Regular expression match] enabling prebuild for step [Execute shell]
No emails were triggered.
New run name is '619 Suite: daily Scenario: os-odl-sfc-noha'
[description-setter] Description set: Built on ericsson-virtual3
[functest-fuel-virtual-daily-hunter] $ /bin/bash /tmp/jenkins1818027102927423667.sh
Cleaning up docker containers/images...
  Removing opnfv/functest:<none> images and their containers...
      Removing image_id: cf243747461f and its containers
Regular expression run condition: Expression=[os-.*], Label=[os-odl-sfc-noha]
Run condition [Regular expression match] enabling perform for step [Execute shell]
[functest-fuel-virtual-daily-hunter] $ /usr/bin/env bash /tmp/jenkins7981052118517316218.sh
Map mcp ssh_key
<13>Aug 19 09:36:39 fetch_os_creds.info: Fetching rc file...
<13>Aug 19 09:36:39 fetch_os_creds.info: Verifying connectivity to 10.20.0.2...
<13>Aug 19 09:36:39 fetch_os_creds.info: 10.20.0.2 is reachable!
<13>Aug 19 09:36:39 fetch_os_creds.info: ... from controller 172.16.10.36 ...
Warning: Permanently added '172.16.10.36' (ECDSA) to the list of known hosts.
-------- Credentials: --------

export OS_IDENTITY_API_VERSION=3
export OS_PROJECT_DOMAIN_NAME=Default
export OS_USER_DOMAIN_NAME=Default
export OS_PROJECT_NAME=admin
export OS_TENANT_NAME=admin
export OS_USERNAME=admin
export OS_PASSWORD=opnfv_secret
export OS_REGION_NAME=RegionOne
export OS_INTERFACE=internal
export OS_ENDPOINT_TYPE="internal"
export OS_CACERT="/etc/ssl/certs/ca-certificates.crt"
export SDN_CONTROLLER_USER=admin
export SDN_CONTROLLER_RESTCONFPORT=8282
export SDN_CONTROLLER_PASSWORD=admin
export SDN_CONTROLLER_WEBPORT=8282
export SDN_CONTROLLER_IP=10.16.0.107
export VOLUME_DEVICE_NAME=sdc
export OS_AUTH_URL=http://172.16.10.36:35357/v3
Functest: Start Docker and prepare environment
Functest: Download images that will be used by test cases
+ wget_opts='-N --tries=1 --connect-timeout=30'
+ '[' -t 1 ']'
+ wget_opts='-N --tries=1 --connect-timeout=30 --progress=dot:giga'
+ cat
+ wget -N --tries=1 --connect-timeout=30 --progress=dot:giga -i - -P /home/jenkins/opnfv/functest/images
--2019-08-19 09:36:40--  http://download.cirros-cloud.net/0.4.0/cirros-0.4.0-x86_64-disk.img
Resolving download.cirros-cloud.net (download.cirros-cloud.net)... 64.90.42.85, 2607:f298:6:a036::bd6:a72a
Connecting to download.cirros-cloud.net (download.cirros-cloud.net)|64.90.42.85|:80... connected.
HTTP request sent, awaiting response... 304 Not Modified
File ‘/home/jenkins/opnfv/functest/images/cirros-0.4.0-x86_64-disk.img’ not modified on server. Omitting download.

--2019-08-19 09:36:40--  https://cloud-images.ubuntu.com/releases/14.04/release/ubuntu-14.04-server-cloudimg-amd64-disk1.img
Resolving cloud-images.ubuntu.com (cloud-images.ubuntu.com)... 91.189.88.89, 2001:67c:1560:8001::8001
Connecting to cloud-images.ubuntu.com (cloud-images.ubuntu.com)|91.189.88.89|:443... connected.
HTTP request sent, awaiting response... 302 Found
Location: https://cloud-images.ubuntu.com/releases/trusty/release/ubuntu-14.04-server-cloudimg-amd64-disk1.img [following]
--2019-08-19 09:36:40--  https://cloud-images.ubuntu.com/releases/trusty/release/ubuntu-14.04-server-cloudimg-amd64-disk1.img
Reusing existing connection to cloud-images.ubuntu.com:443.
HTTP request sent, awaiting response... 304 Not Modified
File ‘/home/jenkins/opnfv/functest/images/ubuntu-14.04-server-cloudimg-amd64-disk1.img’ not modified on server. Omitting download.

--2019-08-19 09:36:40--  https://cloud-images.ubuntu.com/releases/16.04/release/ubuntu-16.04-server-cloudimg-amd64-disk1.img
Reusing existing connection to cloud-images.ubuntu.com:443.
HTTP request sent, awaiting response... 302 Found
Location: https://cloud-images.ubuntu.com/releases/xenial/release/ubuntu-16.04-server-cloudimg-amd64-disk1.img [following]
--2019-08-19 09:36:40--  https://cloud-images.ubuntu.com/releases/xenial/release/ubuntu-16.04-server-cloudimg-amd64-disk1.img
Reusing existing connection to cloud-images.ubuntu.com:443.
HTTP request sent, awaiting response... 304 Not Modified
File ‘/home/jenkins/opnfv/functest/images/ubuntu-16.04-server-cloudimg-amd64-disk1.img’ not modified on server. Omitting download.

--2019-08-19 09:36:40--  http://download.cirros-cloud.net/0.4.0/cirros-0.4.0-aarch64-disk.img
Connecting to download.cirros-cloud.net (download.cirros-cloud.net)|64.90.42.85|:80... connected.
HTTP request sent, awaiting response... 304 Not Modified
File ‘/home/jenkins/opnfv/functest/images/cirros-0.4.0-aarch64-disk.img’ not modified on server. Omitting download.

--2019-08-19 09:36:41--  https://cloud-images.ubuntu.com/releases/14.04/release/ubuntu-14.04-server-cloudimg-arm64-uefi1.img
Connecting to cloud-images.ubuntu.com (cloud-images.ubuntu.com)|91.189.88.89|:443... connected.
HTTP request sent, awaiting response... 302 Found
Location: https://cloud-images.ubuntu.com/releases/trusty/release/ubuntu-14.04-server-cloudimg-arm64-uefi1.img [following]
--2019-08-19 09:36:41--  https://cloud-images.ubuntu.com/releases/trusty/release/ubuntu-14.04-server-cloudimg-arm64-uefi1.img
Reusing existing connection to cloud-images.ubuntu.com:443.
HTTP request sent, awaiting response... 304 Not Modified
File ‘/home/jenkins/opnfv/functest/images/ubuntu-14.04-server-cloudimg-arm64-uefi1.img’ not modified on server. Omitting download.

--2019-08-19 09:36:41--  http://repository.cloudifysource.org/cloudify/19.01.24/community-release/cloudify-docker-manager-community-19.01.24.tar
Resolving repository.cloudifysource.org (repository.cloudifysource.org)... 13.224.217.151, 13.224.217.226, 13.224.217.228, ...
Connecting to repository.cloudifysource.org (repository.cloudifysource.org)|13.224.217.151|:80... connected.
HTTP request sent, awaiting response... 304 Not Modified
File ‘/home/jenkins/opnfv/functest/images/cloudify-docker-manager-community-19.01.24.tar’ not modified on server. Omitting download.

--2019-08-19 09:36:41--  http://testresults.opnfv.org/functest/vyos-1.1.8-amd64.qcow2
Resolving testresults.opnfv.org (testresults.opnfv.org)... 104.154.71.112
Connecting to testresults.opnfv.org (testresults.opnfv.org)|104.154.71.112|:80... connected.
HTTP request sent, awaiting response... 304 Not Modified
File ‘/home/jenkins/opnfv/functest/images/vyos-1.1.8-amd64.qcow2’ not modified on server. Omitting download.

--2019-08-19 09:36:42--  http://testresults.opnfv.org/functest/shaker-image.qcow2
Reusing existing connection to testresults.opnfv.org:80.
HTTP request sent, awaiting response... 304 Not Modified
File ‘/home/jenkins/opnfv/functest/images/shaker-image.qcow2’ not modified on server. Omitting download.

--2019-08-19 09:36:42--  http://testresults.opnfv.org/functest/shaker-image-arm64.qcow2
Reusing existing connection to testresults.opnfv.org:80.
HTTP request sent, awaiting response... 304 Not Modified
File ‘/home/jenkins/opnfv/functest/images/shaker-image-arm64.qcow2’ not modified on server. Omitting download.

Warning: Permanently added '10.20.0.2' (ECDSA) to the list of known hosts.
tempest_conf.yaml:
---
compute-feature-enabled:
    shelve: false
    vnc_console: false
    spice_console: true
identity-feature-enabled:
    api_v2: false
    api_v2_admin: false
image-feature-enabled:
    api_v2: true
    api_v1: false
volume:
    storage_protocol: iSCSI
volume-feature-enabled:
    backup: false
compute:
    max_microversion: 2.65
Functest: Pulling Functest Docker image opnfv/functest-healthcheck:hunter ...
Running Functest tier 'healthcheck'. CMD: docker run --rm  -e INSTALLER_TYPE=fuel -e INSTALLER_IP=10.20.0.2     -e NODE_NAME=ericsson-virtual3 -e DEPLOY_SCENARIO=os-odl-sfc-noha     -e BUILD_TAG=jenkins-functest-fuel-virtual-daily-hunter-619 -e DEPLOY_TYPE=virt -e CI_LOOP=daily     -e TEST_DB_URL=http://testresults.opnfv.org/test/api/v1/results -e ENERGY_RECORDER_API_URL=http://energy.opnfv.fr/resources     -e DEBUG=true -e POD_ARCH=x86_64 -e BLOCK_MIGRATION=false -e SDN_CONTROLLER_RESTCONFPORT=8080 -e IMAGE_PROPERTIES=hw_disk_bus:scsi,hw_scsi_model:virtio-scsi -e FLAVOR_EXTRA_SPECS= -v /home/jenkins/opnfv/functest/images:/home/opnfv/functest/images -v /home/jenkins/opnfv/functest/results/hunter:/home/opnfv/functest/results -v /var/lib/opnfv/mcp.rsa:/root/.ssh/id_rsa       -v /home/jenkins/opnfv-openrc.sh:/home/opnfv/functest/conf/env_file      -v /tmp/tmp.OQ2MNBpOB7:/usr/lib/python2.7/site-packages/functest/opnfv_tests/openstack/tempest/custom_tests/tempest_conf.yaml  opnfv/functest-healthcheck:hunter /bin/bash -c 'run_tests -r -t all'
2019-08-19 07:36:46,590 - xtesting.ci.run_tests - INFO - Deployment description:

+--------------------------------------+----------------------------------------------------------+
|               ENV VAR                |                          VALUE                           |
+--------------------------------------+----------------------------------------------------------+
|              BUILD_TAG               |      jenkins-functest-fuel-virtual-daily-hunter-619      |
|             TEST_DB_URL              |     http://testresults.opnfv.org/test/api/v1/results     |
|     ENERGY_RECORDER_API_PASSWORD     |                                                          |
|               CI_LOOP                |                          daily                           |
|                DEBUG                 |                           true                           |
|            INSTALLER_TYPE            |                           fuel                           |
|       ENERGY_RECORDER_API_URL        |             http://energy.opnfv.fr/resources             |
|           DEPLOY_SCENARIO            |                     os-odl-sfc-noha                      |
|       ENERGY_RECORDER_API_USER       |                                                          |
|              NODE_NAME               |                    ericsson-virtual3                     |
+--------------------------------------+----------------------------------------------------------+

2019-08-19 07:36:46,597 - xtesting.ci.run_tests - INFO - Sourcing env file /var/lib/xtesting/conf/env_file


export OS_IDENTITY_API_VERSION=3
export OS_PROJECT_DOMAIN_NAME=Default
export OS_USER_DOMAIN_NAME=Default
export OS_PROJECT_NAME=admin
export OS_TENANT_NAME=admin
export OS_USERNAME=admin
export OS_PASSWORD=opnfv_secret
export OS_REGION_NAME=RegionOne
export OS_INTERFACE=internal
export OS_ENDPOINT_TYPE="internal"
export OS_CACERT="/etc/ssl/certs/ca-certificates.crt"
export SDN_CONTROLLER_USER=admin
export SDN_CONTROLLER_RESTCONFPORT=8282
export SDN_CONTROLLER_PASSWORD=admin
export SDN_CONTROLLER_WEBPORT=8282
export SDN_CONTROLLER_IP=10.16.0.107
export VOLUME_DEVICE_NAME=sdc
export OS_AUTH_URL=http://172.16.10.36:35357/v3

2019-08-19 07:36:46,599 - xtesting.ci.run_tests - INFO - TESTS TO BE EXECUTED:

+---------------------+---------------+-------------------------------------------------+------------------------------------------+
|        TIERS        |     ORDER     |                   DESCRIPTION                   |                TESTCASES                 |
+---------------------+---------------+-------------------------------------------------+------------------------------------------+
|     healthcheck     |       0       |     First tier to be executed to verify the     |     connection_check tenantnetwork1      |
|                     |               |           basic operations in the VIM.          |     tenantnetwork2 vmready1 vmready2     |
|                     |               |                                                 |      singlevm1 singlevm2 vping_ssh       |
|                     |               |                                                 |      vping_userdata cinder_test odl      |
|                     |               |                                                 |              tempest_smoke               |
+---------------------+---------------+-------------------------------------------------+------------------------------------------+

2019-08-19 07:36:46,650 - xtesting.ci.run_tests - INFO - Loading test case 'connection_check'...
2019-08-19 07:36:47,275 - xtesting.ci.run_tests - INFO - Running test case 'connection_check'...
2019-08-19 07:36:50,524 - xtesting.core.testcase - INFO - The results were successfully pushed to DB
2019-08-19 07:36:50,525 - xtesting.ci.run_tests - INFO - Test result:

+--------------------------+------------------+------------------+----------------+
|        TEST CASE         |     PROJECT      |     DURATION     |     RESULT     |
+--------------------------+------------------+------------------+----------------+
|     connection_check     |     functest     |      00:03       |      PASS      |
+--------------------------+------------------+------------------+----------------+

2019-08-19 07:36:50,560 - xtesting.ci.run_tests - INFO - Loading test case 'tenantnetwork1'...
2019-08-19 07:36:51,254 - xtesting.ci.run_tests - INFO - Running test case 'tenantnetwork1'...
2019-08-19 07:36:56,098 - xtesting.core.testcase - INFO - The results were successfully pushed to DB
2019-08-19 07:36:56,098 - xtesting.ci.run_tests - INFO - Test result:

+------------------------+------------------+------------------+----------------+
|       TEST CASE        |     PROJECT      |     DURATION     |     RESULT     |
+------------------------+------------------+------------------+----------------+
|     tenantnetwork1     |     functest     |      00:05       |      PASS      |
+------------------------+------------------+------------------+----------------+

2019-08-19 07:37:03,843 - xtesting.ci.run_tests - INFO - Loading test case 'tenantnetwork2'...
2019-08-19 07:37:05,933 - xtesting.ci.run_tests - INFO - Running test case 'tenantnetwork2'...
2019-08-19 07:37:12,457 - xtesting.core.testcase - INFO - The results were successfully pushed to DB
2019-08-19 07:37:12,457 - xtesting.ci.run_tests - INFO - Test result:

+------------------------+------------------+------------------+----------------+
|       TEST CASE        |     PROJECT      |     DURATION     |     RESULT     |
+------------------------+------------------+------------------+----------------+
|     tenantnetwork2     |     functest     |      00:06       |      PASS      |
+------------------------+------------------+------------------+----------------+

2019-08-19 07:37:21,070 - xtesting.ci.run_tests - INFO - Loading test case 'vmready1'...
2019-08-19 07:37:22,061 - xtesting.ci.run_tests - INFO - Running test case 'vmready1'...
2019-08-19 07:37:28,659 - xtesting.core.testcase - INFO - The results were successfully pushed to DB
2019-08-19 07:37:28,660 - xtesting.ci.run_tests - INFO - Test result:

+-------------------+------------------+------------------+----------------+
|     TEST CASE     |     PROJECT      |     DURATION     |     RESULT     |
+-------------------+------------------+------------------+----------------+
|      vmready1     |     functest     |      00:06       |      PASS      |
+-------------------+------------------+------------------+----------------+

2019-08-19 07:37:36,081 - xtesting.ci.run_tests - INFO - Loading test case 'vmready2'...
2019-08-19 07:37:39,324 - xtesting.ci.run_tests - INFO - Running test case 'vmready2'...
2019-08-19 07:37:47,094 - xtesting.core.testcase - INFO - The results were successfully pushed to DB
2019-08-19 07:37:47,094 - xtesting.ci.run_tests - INFO - Test result:

+-------------------+------------------+------------------+----------------+
|     TEST CASE     |     PROJECT      |     DURATION     |     RESULT     |
+-------------------+------------------+------------------+----------------+
|      vmready2     |     functest     |      00:08       |      PASS      |
+-------------------+------------------+------------------+----------------+

2019-08-19 07:37:56,319 - xtesting.ci.run_tests - INFO - Loading test case 'singlevm1'...
2019-08-19 07:37:57,100 - xtesting.ci.run_tests - INFO - Running test case 'singlevm1'...
2019-08-19 07:38:31,894 - xtesting.core.testcase - INFO - The results were successfully pushed to DB
2019-08-19 07:38:31,895 - xtesting.ci.run_tests - INFO - Test result:

+-------------------+------------------+------------------+----------------+
|     TEST CASE     |     PROJECT      |     DURATION     |     RESULT     |
+-------------------+------------------+------------------+----------------+
|     singlevm1     |     functest     |      00:35       |      PASS      |
+-------------------+------------------+------------------+----------------+

2019-08-19 07:38:44,509 - xtesting.ci.run_tests - INFO - Loading test case 'singlevm2'...
2019-08-19 07:38:46,282 - xtesting.ci.run_tests - INFO - Running test case 'singlevm2'...
2019-08-19 07:39:21,914 - xtesting.core.testcase - INFO - The results were successfully pushed to DB
2019-08-19 07:39:21,915 - xtesting.ci.run_tests - INFO - Test result:

+-------------------+------------------+------------------+----------------+
|     TEST CASE     |     PROJECT      |     DURATION     |     RESULT     |
+-------------------+------------------+------------------+----------------+
|     singlevm2     |     functest     |      00:35       |      PASS      |
+-------------------+------------------+------------------+----------------+

2019-08-19 07:39:35,462 - xtesting.ci.run_tests - INFO - Loading test case 'vping_ssh'...
2019-08-19 07:39:37,452 - xtesting.ci.run_tests - INFO - Running test case 'vping_ssh'...
2019-08-19 07:40:17,805 - xtesting.core.testcase - INFO - The results were successfully pushed to DB
2019-08-19 07:40:17,805 - xtesting.ci.run_tests - INFO - Test result:

+-------------------+------------------+------------------+----------------+
|     TEST CASE     |     PROJECT      |     DURATION     |     RESULT     |
+-------------------+------------------+------------------+----------------+
|     vping_ssh     |     functest     |      00:40       |      PASS      |
+-------------------+------------------+------------------+----------------+

2019-08-19 07:40:34,394 - xtesting.ci.run_tests - INFO - Loading test case 'vping_userdata'...
2019-08-19 07:40:36,217 - xtesting.ci.run_tests - INFO - Running test case 'vping_userdata'...
2019-08-19 07:41:12,248 - xtesting.core.testcase - INFO - The results were successfully pushed to DB
2019-08-19 07:41:12,249 - xtesting.ci.run_tests - INFO - Test result:

+------------------------+------------------+------------------+----------------+
|       TEST CASE        |     PROJECT      |     DURATION     |     RESULT     |
+------------------------+------------------+------------------+----------------+
|     vping_userdata     |     functest     |      00:36       |      PASS      |
+------------------------+------------------+------------------+----------------+

2019-08-19 07:41:27,276 - xtesting.ci.run_tests - INFO - Loading test case 'cinder_test'...
2019-08-19 07:41:29,468 - xtesting.ci.run_tests - INFO - Running test case 'cinder_test'...
2019-08-19 07:43:13,253 - xtesting.core.testcase - INFO - The results were successfully pushed to DB
2019-08-19 07:43:13,253 - xtesting.ci.run_tests - INFO - Test result:

+---------------------+------------------+------------------+----------------+
|      TEST CASE      |     PROJECT      |     DURATION     |     RESULT     |
+---------------------+------------------+------------------+----------------+
|     cinder_test     |     functest     |      01:44       |      PASS      |
+---------------------+------------------+------------------+----------------+

2019-08-19 07:43:35,361 - xtesting.ci.run_tests - INFO - Loading test case 'odl'...
2019-08-19 07:43:35,624 - xtesting.ci.run_tests - INFO - Running test case 'odl'...
[ WARN ] Deprecation Warning: Use Post Request in the future
2019-08-19 07:43:55,307 - xtesting.core.robotframework - INFO - 
==============================================================================
Basic & Neutron                                                               
==============================================================================
Basic & Neutron.Basic                                                         
==============================================================================
Basic & Neutron.Basic.Restconf Modules :: Test suite to verify Restconf is OK.
==============================================================================
Get Controller Modules :: Get the restconf modules, check 200 stat... | PASS |
------------------------------------------------------------------------------
Basic & Neutron.Basic.Restconf Modules :: Test suite to verify Res... | PASS |
1 critical test, 1 passed, 0 failed
1 test total, 1 passed, 0 failed
==============================================================================
Basic & Neutron.Basic                                                 | PASS |
1 critical test, 1 passed, 0 failed
1 test total, 1 passed, 0 failed
==============================================================================
Basic & Neutron.Neutron :: Test suite for Neutron Plugin                      
==============================================================================
Basic & Neutron.Neutron.Reachability                                          
==============================================================================
Get the complete list of networks :: Get the complete list of netw... | PASS |
------------------------------------------------------------------------------
Get the complete list of subnets :: Get the complete list of subnets  | PASS |
------------------------------------------------------------------------------
Get the complete list of ports :: Get the complete list of ports      | PASS |
------------------------------------------------------------------------------
Basic & Neutron.Neutron.Reachability                                  | PASS |
3 critical tests, 3 passed, 0 failed
3 tests total, 3 passed, 0 failed
==============================================================================
Basic & Neutron.Neutron.Networks :: Checking Network created in OpenStack a...
==============================================================================
Check OpenStack Networks :: Checking OpenStack Neutron for known n... | PASS |
------------------------------------------------------------------------------
Check OpenDaylight Networks :: Checking OpenDaylight Neutron API f... | PASS |
------------------------------------------------------------------------------
Create Network :: Create new network in OpenStack                     | PASS |
------------------------------------------------------------------------------
Check Network :: Check network created in OpenDaylight                | PASS |
------------------------------------------------------------------------------
Basic & Neutron.Neutron.Networks :: Checking Network created in Op... | PASS |
4 critical tests, 4 passed, 0 failed
4 tests total, 4 passed, 0 failed
==============================================================================
Basic & Neutron.Neutron.Subnets :: Checking Subnets created in OpenStack ar...
==============================================================================
Check OpenStack Subnets :: Checking OpenStack Neutron for known su... | PASS |
------------------------------------------------------------------------------
Check OpenDaylight subnets :: Checking OpenDaylight Neutron API fo... | PASS |
------------------------------------------------------------------------------
Create New subnet :: Create new subnet in OpenStack                   | PASS |
------------------------------------------------------------------------------
Check New subnet :: Check new subnet created in OpenDaylight          | PASS |
------------------------------------------------------------------------------
Basic & Neutron.Neutron.Subnets :: Checking Subnets created in Ope... | PASS |
4 critical tests, 4 passed, 0 failed
4 tests total, 4 passed, 0 failed
==============================================================================
Basic & Neutron.Neutron.Ports :: Checking Port created in OpenStack are pus...
==============================================================================
Check OpenStack ports :: Checking OpenStack Neutron for known ports   | PASS |
------------------------------------------------------------------------------
Check OpenDaylight ports :: Checking OpenDaylight Neutron API for ... | PASS |
------------------------------------------------------------------------------
Create New Port :: Create new port in OpenStack                       | PASS |
------------------------------------------------------------------------------
Check New Port :: Check new port created in OpenDaylight              | PASS |
------------------------------------------------------------------------------
Basic & Neutron.Neutron.Ports :: Checking Port created in OpenStac... | PASS |
4 critical tests, 4 passed, 0 failed
4 tests total, 4 passed, 0 failed
==============================================================================
Basic & Neutron.Neutron.Delete Ports :: Checking Port deleted in OpenStack ...
==============================================================================
Delete New Port :: Delete previously created port in OpenStack        | PASS |
------------------------------------------------------------------------------
Check Port Deleted :: Check port deleted in OpenDaylight              | PASS |
------------------------------------------------------------------------------
Basic & Neutron.Neutron.Delete Ports :: Checking Port deleted in O... | PASS |
2 critical tests, 2 passed, 0 failed
2 tests total, 2 passed, 0 failed
==============================================================================
Basic & Neutron.Neutron.Delete Subnets :: Checking Subnets deleted in OpenS...
==============================================================================
Delete New subnet :: Delete previously created subnet in OpenStack    | PASS |
------------------------------------------------------------------------------
Check New subnet deleted :: Check subnet deleted in OpenDaylight      | PASS |
------------------------------------------------------------------------------
Basic & Neutron.Neutron.Delete Subnets :: Checking Subnets deleted... | PASS |
2 critical tests, 2 passed, 0 failed
2 tests total, 2 passed, 0 failed
==============================================================================
Basic & Neutron.Neutron.Delete Networks :: Checking Network deleted in Open...
==============================================================================
Delete Network :: Delete network in OpenStack                         | PASS |
------------------------------------------------------------------------------
Check Network deleted :: Check network deleted in OpenDaylight        | PASS |
------------------------------------------------------------------------------
Basic & Neutron.Neutron.Delete Networks :: Checking Network delete... | PASS |
2 critical tests, 2 passed, 0 failed
2 tests total, 2 passed, 0 failed
==============================================================================
Basic & Neutron.Neutron :: Test suite for Neutron Plugin              | PASS |
21 critical tests, 21 passed, 0 failed
21 tests total, 21 passed, 0 failed
==============================================================================
Basic & Neutron                                                       | PASS |
22 critical tests, 22 passed, 0 failed
22 tests total, 22 passed, 0 failed
==============================================================================
Output:  /home/opnfv/functest/results/odl/output.xml

2019-08-19 07:43:55,365 - xtesting.core.robotframework - INFO - Results were successfully parsed
2019-08-19 07:43:55,614 - xtesting.core.robotframework - INFO - Results were successfully generated
2019-08-19 07:43:55,893 - xtesting.core.testcase - INFO - The results were successfully pushed to DB
2019-08-19 07:43:55,894 - xtesting.ci.run_tests - INFO - Test result:

+-------------------+------------------+------------------+----------------+
|     TEST CASE     |     PROJECT      |     DURATION     |     RESULT     |
+-------------------+------------------+------------------+----------------+
|        odl        |     functest     |      00:19       |      PASS      |
+-------------------+------------------+------------------+----------------+

2019-08-19 07:43:55,930 - xtesting.ci.run_tests - INFO - Loading test case 'tempest_smoke'...
2019-08-19 07:43:59,349 - xtesting.ci.run_tests - INFO - Running test case 'tempest_smoke'...
2019-08-19 07:48:34,787 - xtesting.core.testcase - INFO - The results were successfully pushed to DB
2019-08-19 07:48:34,788 - xtesting.ci.run_tests - INFO - Test result:

+-----------------------+------------------+------------------+----------------+
|       TEST CASE       |     PROJECT      |     DURATION     |     RESULT     |
+-----------------------+------------------+------------------+----------------+
|     tempest_smoke     |     functest     |      04:35       |      PASS      |
+-----------------------+------------------+------------------+----------------+

2019-08-19 07:48:44,431 - xtesting.ci.run_tests - INFO - Xtesting report:

+--------------------------+------------------+---------------------+------------------+----------------+
|        TEST CASE         |     PROJECT      |         TIER        |     DURATION     |     RESULT     |
+--------------------------+------------------+---------------------+------------------+----------------+
|     connection_check     |     functest     |     healthcheck     |      00:03       |      PASS      |
|      tenantnetwork1      |     functest     |     healthcheck     |      00:05       |      PASS      |
|      tenantnetwork2      |     functest     |     healthcheck     |      00:06       |      PASS      |
|         vmready1         |     functest     |     healthcheck     |      00:06       |      PASS      |
|         vmready2         |     functest     |     healthcheck     |      00:08       |      PASS      |
|        singlevm1         |     functest     |     healthcheck     |      00:35       |      PASS      |
|        singlevm2         |     functest     |     healthcheck     |      00:35       |      PASS      |
|        vping_ssh         |     functest     |     healthcheck     |      00:40       |      PASS      |
|      vping_userdata      |     functest     |     healthcheck     |      00:36       |      PASS      |
|       cinder_test        |     functest     |     healthcheck     |      01:44       |      PASS      |
|           odl            |     functest     |     healthcheck     |      00:19       |      PASS      |
|      tempest_smoke       |     functest     |     healthcheck     |      04:35       |      PASS      |
+--------------------------+------------------+---------------------+------------------+----------------+

2019-08-19 07:48:44,440 - xtesting.ci.run_tests - INFO - Execution exit value: Result.EX_OK
Functest: Pulling Functest Docker image opnfv/functest-smoke:hunter ...
Running Functest tier 'smoke'. CMD: docker run --rm  -e INSTALLER_TYPE=fuel -e INSTALLER_IP=10.20.0.2     -e NODE_NAME=ericsson-virtual3 -e DEPLOY_SCENARIO=os-odl-sfc-noha     -e BUILD_TAG=jenkins-functest-fuel-virtual-daily-hunter-619 -e DEPLOY_TYPE=virt -e CI_LOOP=daily     -e TEST_DB_URL=http://testresults.opnfv.org/test/api/v1/results -e ENERGY_RECORDER_API_URL=http://energy.opnfv.fr/resources     -e DEBUG=true -e POD_ARCH=x86_64 -e BLOCK_MIGRATION=false -e SDN_CONTROLLER_RESTCONFPORT=8080 -e IMAGE_PROPERTIES=hw_disk_bus:scsi,hw_scsi_model:virtio-scsi -e FLAVOR_EXTRA_SPECS= -v /home/jenkins/opnfv/functest/images:/home/opnfv/functest/images -v /home/jenkins/opnfv/functest/results/hunter:/home/opnfv/functest/results -v /var/lib/opnfv/mcp.rsa:/root/.ssh/id_rsa       -v /home/jenkins/opnfv-openrc.sh:/home/opnfv/functest/conf/env_file      -v /tmp/tmp.OQ2MNBpOB7:/usr/lib/python2.7/site-packages/functest/opnfv_tests/openstack/tempest/custom_tests/tempest_conf.yaml  opnfv/functest-smoke:hunter /bin/bash -c 'run_tests -r -t all'
2019-08-19 07:48:48,988 - xtesting.ci.run_tests - INFO - Deployment description:

+--------------------------------------+----------------------------------------------------------+
|               ENV VAR                |                          VALUE                           |
+--------------------------------------+----------------------------------------------------------+
|              BUILD_TAG               |      jenkins-functest-fuel-virtual-daily-hunter-619      |
|             TEST_DB_URL              |     http://testresults.opnfv.org/test/api/v1/results     |
|     ENERGY_RECORDER_API_PASSWORD     |                                                          |
|               CI_LOOP                |                          daily                           |
|                DEBUG                 |                           true                           |
|            INSTALLER_TYPE            |                           fuel                           |
|       ENERGY_RECORDER_API_URL        |             http://energy.opnfv.fr/resources             |
|           DEPLOY_SCENARIO            |                     os-odl-sfc-noha                      |
|       ENERGY_RECORDER_API_USER       |                                                          |
|              NODE_NAME               |                    ericsson-virtual3                     |
+--------------------------------------+----------------------------------------------------------+

2019-08-19 07:48:48,993 - xtesting.ci.run_tests - INFO - Sourcing env file /var/lib/xtesting/conf/env_file


export OS_IDENTITY_API_VERSION=3
export OS_PROJECT_DOMAIN_NAME=Default
export OS_USER_DOMAIN_NAME=Default
export OS_PROJECT_NAME=admin
export OS_TENANT_NAME=admin
export OS_USERNAME=admin
export OS_PASSWORD=opnfv_secret
export OS_REGION_NAME=RegionOne
export OS_INTERFACE=internal
export OS_ENDPOINT_TYPE="internal"
export OS_CACERT="/etc/ssl/certs/ca-certificates.crt"
export SDN_CONTROLLER_USER=admin
export SDN_CONTROLLER_RESTCONFPORT=8282
export SDN_CONTROLLER_PASSWORD=admin
export SDN_CONTROLLER_WEBPORT=8282
export SDN_CONTROLLER_IP=10.16.0.107
export VOLUME_DEVICE_NAME=sdc
export OS_AUTH_URL=http://172.16.10.36:35357/v3

2019-08-19 07:48:48,995 - xtesting.ci.run_tests - INFO - TESTS TO BE EXECUTED:

+---------------+---------------+------------------------------------------+-------------------------------------------------+
|     TIERS     |     ORDER     |               DESCRIPTION                |                    TESTCASES                    |
+---------------+---------------+------------------------------------------+-------------------------------------------------+
|     smoke     |       1       |     Set of basic Functional tests to     |     neutron-tempest-plugin-api rally_sanity     |
|               |               |      validate the OPNFV scenarios.       |          refstack_defcore tempest_full          |
|               |               |                                          |      tempest_scenario patrole neutron_trunk     |
|               |               |                                          |         networking-bgpvpn networking-sfc        |
|               |               |                                          |                     barbican                    |
+---------------+---------------+------------------------------------------+-------------------------------------------------+

2019-08-19 07:48:49,030 - xtesting.ci.run_tests - INFO - Loading test case 'neutron-tempest-plugin-api'...
2019-08-19 07:48:53,463 - xtesting.ci.run_tests - INFO - Running test case 'neutron-tempest-plugin-api'...
2019-08-19 08:00:07,594 - xtesting.core.testcase - INFO - The results were successfully pushed to DB
2019-08-19 08:00:07,595 - xtesting.ci.run_tests - INFO - Test result:

+------------------------------------+------------------+------------------+----------------+
|             TEST CASE              |     PROJECT      |     DURATION     |     RESULT     |
+------------------------------------+------------------+------------------+----------------+
|     neutron-tempest-plugin-api     |     functest     |      11:14       |      FAIL      |
+------------------------------------+------------------+------------------+----------------+

2019-08-19 08:00:18,090 - xtesting.ci.run_tests - ERROR - The test case 'neutron-tempest-plugin-api' failed.
2019-08-19 08:00:18,125 - xtesting.ci.run_tests - INFO - Loading test case 'rally_sanity'...
2019-08-19 08:00:20,569 - xtesting.ci.run_tests - INFO - Running test case 'rally_sanity'...
2019-08-19 08:30:35,682 - xtesting.core.testcase - INFO - The results were successfully pushed to DB
2019-08-19 08:30:35,683 - xtesting.ci.run_tests - INFO - Test result:

+----------------------+------------------+------------------+----------------+
|      TEST CASE       |     PROJECT      |     DURATION     |     RESULT     |
+----------------------+------------------+------------------+----------------+
|     rally_sanity     |     functest     |      30:15       |      PASS      |
+----------------------+------------------+------------------+----------------+

2019-08-19 08:30:46,030 - xtesting.ci.run_tests - INFO - Loading test case 'refstack_defcore'...
2019-08-19 08:30:49,845 - xtesting.ci.run_tests - INFO - Running test case 'refstack_defcore'...
2019-08-19 08:38:52,006 - xtesting.core.testcase - INFO - The results were successfully pushed to DB
2019-08-19 08:38:52,007 - xtesting.ci.run_tests - INFO - Test result:

+--------------------------+------------------+------------------+----------------+
|        TEST CASE         |     PROJECT      |     DURATION     |     RESULT     |
+--------------------------+------------------+------------------+----------------+
|     refstack_defcore     |     functest     |      08:02       |      PASS      |
+--------------------------+------------------+------------------+----------------+

2019-08-19 08:39:02,480 - xtesting.ci.run_tests - INFO - Loading test case 'tempest_full'...
2019-08-19 08:39:06,132 - xtesting.ci.run_tests - INFO - Running test case 'tempest_full'...
2019-08-19 09:28:45,414 - xtesting.core.testcase - INFO - The results were successfully pushed to DB
2019-08-19 09:28:45,414 - xtesting.ci.run_tests - INFO - Test result:

+----------------------+------------------+------------------+----------------+
|      TEST CASE       |     PROJECT      |     DURATION     |     RESULT     |
+----------------------+------------------+------------------+----------------+
|     tempest_full     |     functest     |      49:38       |      FAIL      |
+----------------------+------------------+------------------+----------------+

2019-08-19 09:28:55,797 - xtesting.ci.run_tests - ERROR - The test case 'tempest_full' failed.
2019-08-19 09:28:55,831 - xtesting.ci.run_tests - INFO - Loading test case 'tempest_scenario'...
2019-08-19 09:28:59,795 - xtesting.ci.run_tests - INFO - Running test case 'tempest_scenario'...
2019-08-19 09:39:26,970 - xtesting.core.testcase - INFO - The results were successfully pushed to DB
2019-08-19 09:39:26,970 - xtesting.ci.run_tests - INFO - Test result:

+--------------------------+------------------+------------------+----------------+
|        TEST CASE         |     PROJECT      |     DURATION     |     RESULT     |
+--------------------------+------------------+------------------+----------------+
|     tempest_scenario     |     functest     |      10:27       |      PASS      |
+--------------------------+------------------+------------------+----------------+

2019-08-19 09:39:37,716 - xtesting.ci.run_tests - INFO - Loading test case 'patrole'...
2019-08-19 09:39:41,290 - xtesting.ci.run_tests - INFO - Running test case 'patrole'...
2019-08-19 09:42:48,854 - xtesting.core.testcase - INFO - The results were successfully pushed to DB
2019-08-19 09:42:48,855 - xtesting.ci.run_tests - INFO - Test result:

+-------------------+------------------+------------------+----------------+
|     TEST CASE     |     PROJECT      |     DURATION     |     RESULT     |
+-------------------+------------------+------------------+----------------+
|      patrole      |     functest     |      03:07       |      PASS      |
+-------------------+------------------+------------------+----------------+

2019-08-19 09:42:58,849 - xtesting.ci.run_tests - INFO - Loading test case 'neutron_trunk'...
2019-08-19 09:43:02,489 - xtesting.ci.run_tests - INFO - Running test case 'neutron_trunk'...
2019-08-19 09:45:46,214 - xtesting.core.testcase - INFO - The results were successfully pushed to DB
2019-08-19 09:45:46,214 - xtesting.ci.run_tests - INFO - Test result:

+-----------------------+------------------+------------------+----------------+
|       TEST CASE       |     PROJECT      |     DURATION     |     RESULT     |
+-----------------------+------------------+------------------+----------------+
|     neutron_trunk     |     functest     |      02:43       |      PASS      |
+-----------------------+------------------+------------------+----------------+

2019-08-19 09:45:55,977 - xtesting.ci.run_tests - INFO - Loading test case 'networking-bgpvpn'...
2019-08-19 09:46:00,046 - functest.opnfv_tests.openstack.tempest.tempest - WARNING - Cannot find Neutron extension: bgpvpn
2019-08-19 09:46:00,617 - xtesting.ci.run_tests - INFO - Skipping test case 'networking-bgpvpn'...
2019-08-19 09:46:00,617 - xtesting.ci.run_tests - INFO - Test result:

+---------------------------+------------------+------------------+----------------+
|         TEST CASE         |     PROJECT      |     DURATION     |     RESULT     |
+---------------------------+------------------+------------------+----------------+
|     networking-bgpvpn     |     functest     |      00:00       |      SKIP      |
+---------------------------+------------------+------------------+----------------+

2019-08-19 09:46:00,659 - xtesting.ci.run_tests - INFO - Loading test case 'networking-sfc'...
2019-08-19 09:46:04,689 - functest.opnfv_tests.openstack.tempest.tempest - WARNING - Cannot find Neutron extension: sfc
2019-08-19 09:46:05,322 - xtesting.ci.run_tests - INFO - Skipping test case 'networking-sfc'...
2019-08-19 09:46:05,322 - xtesting.ci.run_tests - INFO - Test result:

+------------------------+------------------+------------------+----------------+
|       TEST CASE        |     PROJECT      |     DURATION     |     RESULT     |
+------------------------+------------------+------------------+----------------+
|     networking-sfc     |     functest     |      00:00       |      SKIP      |
+------------------------+------------------+------------------+----------------+

2019-08-19 09:46:05,364 - xtesting.ci.run_tests - INFO - Loading test case 'barbican'...
2019-08-19 09:46:09,319 - xtesting.ci.run_tests - INFO - Running test case 'barbican'...
2019-08-19 09:48:50,811 - xtesting.core.testcase - INFO - The results were successfully pushed to DB
2019-08-19 09:48:50,811 - xtesting.ci.run_tests - INFO - Test result:

+-------------------+------------------+------------------+----------------+
|     TEST CASE     |     PROJECT      |     DURATION     |     RESULT     |
+-------------------+------------------+------------------+----------------+
|      barbican     |     functest     |      02:41       |      PASS      |
+-------------------+------------------+------------------+----------------+

2019-08-19 09:49:00,521 - xtesting.ci.run_tests - INFO - Xtesting report:

+------------------------------------+------------------+---------------+------------------+----------------+
|             TEST CASE              |     PROJECT      |      TIER     |     DURATION     |     RESULT     |
+------------------------------------+------------------+---------------+------------------+----------------+
|     neutron-tempest-plugin-api     |     functest     |     smoke     |      11:14       |      FAIL      |
|            rally_sanity            |     functest     |     smoke     |      30:15       |      PASS      |
|          refstack_defcore          |     functest     |     smoke     |      08:02       |      PASS      |
|            tempest_full            |     functest     |     smoke     |      49:38       |      FAIL      |
|          tempest_scenario          |     functest     |     smoke     |      10:27       |      PASS      |
|              patrole               |     functest     |     smoke     |      03:07       |      PASS      |
|           neutron_trunk            |     functest     |     smoke     |      02:43       |      PASS      |
|         networking-bgpvpn          |     functest     |     smoke     |      00:00       |      SKIP      |
|           networking-sfc           |     functest     |     smoke     |      00:00       |      SKIP      |
|              barbican              |     functest     |     smoke     |      02:41       |      PASS      |
+------------------------------------+------------------+---------------+------------------+----------------+

2019-08-19 09:49:00,529 - xtesting.ci.run_tests - INFO - Execution exit value: Result.EX_ERROR
Functest: Pulling Functest Docker image opnfv/functest-benchmarking:hunter ...
Running Functest tier 'benchmarking'. CMD: docker run --rm  -e INSTALLER_TYPE=fuel -e INSTALLER_IP=10.20.0.2     -e NODE_NAME=ericsson-virtual3 -e DEPLOY_SCENARIO=os-odl-sfc-noha     -e BUILD_TAG=jenkins-functest-fuel-virtual-daily-hunter-619 -e DEPLOY_TYPE=virt -e CI_LOOP=daily     -e TEST_DB_URL=http://testresults.opnfv.org/test/api/v1/results -e ENERGY_RECORDER_API_URL=http://energy.opnfv.fr/resources     -e DEBUG=true -e POD_ARCH=x86_64 -e BLOCK_MIGRATION=false -e SDN_CONTROLLER_RESTCONFPORT=8080 -e IMAGE_PROPERTIES=hw_disk_bus:scsi,hw_scsi_model:virtio-scsi -e FLAVOR_EXTRA_SPECS= -v /home/jenkins/opnfv/functest/images:/home/opnfv/functest/images -v /home/jenkins/opnfv/functest/results/hunter:/home/opnfv/functest/results -v /var/lib/opnfv/mcp.rsa:/root/.ssh/id_rsa       -v /home/jenkins/opnfv-openrc.sh:/home/opnfv/functest/conf/env_file      -v /tmp/tmp.OQ2MNBpOB7:/usr/lib/python2.7/site-packages/functest/opnfv_tests/openstack/tempest/custom_tests/tempest_conf.yaml  opnfv/functest-benchmarking:hunter /bin/bash -c 'run_tests -r -t all'
2019-08-19 09:49:04,674 - xtesting.ci.run_tests - INFO - Deployment description:

+--------------------------------------+----------------------------------------------------------+
|               ENV VAR                |                          VALUE                           |
+--------------------------------------+----------------------------------------------------------+
|              BUILD_TAG               |      jenkins-functest-fuel-virtual-daily-hunter-619      |
|             TEST_DB_URL              |     http://testresults.opnfv.org/test/api/v1/results     |
|     ENERGY_RECORDER_API_PASSWORD     |                                                          |
|               CI_LOOP                |                          daily                           |
|                DEBUG                 |                           true                           |
|            INSTALLER_TYPE            |                           fuel                           |
|       ENERGY_RECORDER_API_URL        |             http://energy.opnfv.fr/resources             |
|           DEPLOY_SCENARIO            |                     os-odl-sfc-noha                      |
|       ENERGY_RECORDER_API_USER       |                                                          |
|              NODE_NAME               |                    ericsson-virtual3                     |
+--------------------------------------+----------------------------------------------------------+

2019-08-19 09:49:04,679 - xtesting.ci.run_tests - INFO - Sourcing env file /var/lib/xtesting/conf/env_file


export OS_IDENTITY_API_VERSION=3
export OS_PROJECT_DOMAIN_NAME=Default
export OS_USER_DOMAIN_NAME=Default
export OS_PROJECT_NAME=admin
export OS_TENANT_NAME=admin
export OS_USERNAME=admin
export OS_PASSWORD=opnfv_secret
export OS_REGION_NAME=RegionOne
export OS_INTERFACE=internal
export OS_ENDPOINT_TYPE="internal"
export OS_CACERT="/etc/ssl/certs/ca-certificates.crt"
export SDN_CONTROLLER_USER=admin
export SDN_CONTROLLER_RESTCONFPORT=8282
export SDN_CONTROLLER_PASSWORD=admin
export SDN_CONTROLLER_WEBPORT=8282
export SDN_CONTROLLER_IP=10.16.0.107
export VOLUME_DEVICE_NAME=sdc
export OS_AUTH_URL=http://172.16.10.36:35357/v3

2019-08-19 09:49:04,680 - xtesting.ci.run_tests - INFO - TESTS TO BE EXECUTED:

+----------------------+---------------+-------------------------------------------------+-------------------------------------------+
|        TIERS         |     ORDER     |                   DESCRIPTION                   |                 TESTCASES                 |
+----------------------+---------------+-------------------------------------------------+-------------------------------------------+
|     benchmarking     |       2       |     Run several OpenStack performance tools     |     rally_full rally_jobs vmtp shaker     |
|                      |               |     https://docs.openstack.org/performance-     |                                           |
|                      |               |       docs/latest/methodologies/tools.html      |                                           |
+----------------------+---------------+-------------------------------------------------+-------------------------------------------+

2019-08-19 09:49:04,693 - xtesting.ci.run_tests - INFO - Loading test case 'rally_full'...
2019-08-19 09:49:07,542 - xtesting.ci.run_tests - INFO - Running test case 'rally_full'...
2019-08-19 12:25:44,550 - xtesting.core.testcase - INFO - The results were successfully pushed to DB
2019-08-19 12:25:44,550 - xtesting.ci.run_tests - INFO - Test result:

+--------------------+------------------+------------------+----------------+
|     TEST CASE      |     PROJECT      |     DURATION     |     RESULT     |
+--------------------+------------------+------------------+----------------+
|     rally_full     |     functest     |      156:37      |      PASS      |
+--------------------+------------------+------------------+----------------+

2019-08-19 12:25:55,911 - xtesting.ci.run_tests - INFO - Loading test case 'rally_jobs'...
2019-08-19 12:25:58,211 - xtesting.ci.run_tests - INFO - Running test case 'rally_jobs'...
2019-08-19 13:16:01,780 - xtesting.core.testcase - INFO - The results were successfully pushed to DB
2019-08-19 13:16:01,780 - xtesting.ci.run_tests - INFO - Test result:

+--------------------+------------------+------------------+----------------+
|     TEST CASE      |     PROJECT      |     DURATION     |     RESULT     |
+--------------------+------------------+------------------+----------------+
|     rally_jobs     |     functest     |      50:03       |      PASS      |
+--------------------+------------------+------------------+----------------+

2019-08-19 13:16:13,158 - xtesting.ci.run_tests - INFO - Loading test case 'vmtp'...
2019-08-19 13:16:15,585 - xtesting.ci.run_tests - INFO - Running test case 'vmtp'...
2019-08-19 13:35:03,651 - xtesting.core.testcase - INFO - The results were successfully pushed to DB
2019-08-19 13:35:03,651 - xtesting.ci.run_tests - INFO - Test result:

+-------------------+------------------+------------------+----------------+
|     TEST CASE     |     PROJECT      |     DURATION     |     RESULT     |
+-------------------+------------------+------------------+----------------+
|        vmtp       |     functest     |      18:48       |      PASS      |
+-------------------+------------------+------------------+----------------+

2019-08-19 13:35:07,878 - xtesting.ci.run_tests - INFO - Loading test case 'shaker'...
2019-08-19 13:35:10,147 - xtesting.ci.run_tests - INFO - Running test case 'shaker'...
2019-08-19 14:36:39,245 - functest.opnfv_tests.openstack.shaker.shaker - ERROR - cannot get report files
Traceback (most recent call last):
  File "/usr/lib/python2.7/site-packages/functest/opnfv_tests/openstack/shaker/shaker.py", line 125, in execute
    scpc.get('report.json', self.res_dir)
  File "/usr/lib/python2.7/site-packages/scp.py", line 217, in get
    self._recv_all()
  File "/usr/lib/python2.7/site-packages/scp.py", line 367, in _recv_all
    raise SCPException(asunicode(msg[1:]))
SCPException: scp: report.json: No such file or directory
2019-08-19 14:36:39,575 - xtesting.core.testcase - INFO - The results were successfully pushed to DB
2019-08-19 14:36:39,575 - xtesting.ci.run_tests - INFO - Test result:

+-------------------+------------------+------------------+----------------+
|     TEST CASE     |     PROJECT      |     DURATION     |     RESULT     |
+-------------------+------------------+------------------+----------------+
|       shaker      |     functest     |      61:29       |      FAIL      |
+-------------------+------------------+------------------+----------------+

2019-08-19 14:36:59,563 - xtesting.ci.run_tests - ERROR - The test case 'shaker' failed.
2019-08-19 14:36:59,564 - xtesting.ci.run_tests - INFO - Xtesting report:

+--------------------+------------------+----------------------+------------------+----------------+
|     TEST CASE      |     PROJECT      |         TIER         |     DURATION     |     RESULT     |
+--------------------+------------------+----------------------+------------------+----------------+
|     rally_full     |     functest     |     benchmarking     |      156:37      |      PASS      |
|     rally_jobs     |     functest     |     benchmarking     |      50:03       |      PASS      |
|        vmtp        |     functest     |     benchmarking     |      18:48       |      PASS      |
|       shaker       |     functest     |     benchmarking     |      61:29       |      FAIL      |
+--------------------+------------------+----------------------+------------------+----------------+

2019-08-19 14:36:59,568 - xtesting.ci.run_tests - INFO - Execution exit value: Result.EX_ERROR
Functest: Pulling Functest Docker image opnfv/functest-features:hunter ...
Running Functest tier 'features'. CMD: docker run --rm  -e INSTALLER_TYPE=fuel -e INSTALLER_IP=10.20.0.2     -e NODE_NAME=ericsson-virtual3 -e DEPLOY_SCENARIO=os-odl-sfc-noha     -e BUILD_TAG=jenkins-functest-fuel-virtual-daily-hunter-619 -e DEPLOY_TYPE=virt -e CI_LOOP=daily     -e TEST_DB_URL=http://testresults.opnfv.org/test/api/v1/results -e ENERGY_RECORDER_API_URL=http://energy.opnfv.fr/resources     -e DEBUG=true -e POD_ARCH=x86_64 -e BLOCK_MIGRATION=false -e SDN_CONTROLLER_RESTCONFPORT=8080 -e IMAGE_PROPERTIES=hw_disk_bus:scsi,hw_scsi_model:virtio-scsi -e FLAVOR_EXTRA_SPECS= -v /home/jenkins/opnfv/functest/images:/home/opnfv/functest/images -v /home/jenkins/opnfv/functest/results/hunter:/home/opnfv/functest/results -v /var/lib/opnfv/mcp.rsa:/root/.ssh/id_rsa       -v /home/jenkins/opnfv-openrc.sh:/home/opnfv/functest/conf/env_file      -v /tmp/tmp.OQ2MNBpOB7:/usr/lib/python2.7/site-packages/functest/opnfv_tests/openstack/tempest/custom_tests/tempest_conf.yaml  opnfv/functest-features:hunter /bin/bash -c 'run_tests -r -t all'
2019-08-19 14:37:03,326 - xtesting.ci.run_tests - INFO - Deployment description:

+--------------------------------------+----------------------------------------------------------+
|               ENV VAR                |                          VALUE                           |
+--------------------------------------+----------------------------------------------------------+
|              BUILD_TAG               |      jenkins-functest-fuel-virtual-daily-hunter-619      |
|             TEST_DB_URL              |     http://testresults.opnfv.org/test/api/v1/results     |
|     ENERGY_RECORDER_API_PASSWORD     |                                                          |
|               CI_LOOP                |                          daily                           |
|                DEBUG                 |                           true                           |
|            INSTALLER_TYPE            |                           fuel                           |
|       ENERGY_RECORDER_API_URL        |             http://energy.opnfv.fr/resources             |
|           DEPLOY_SCENARIO            |                     os-odl-sfc-noha                      |
|       ENERGY_RECORDER_API_USER       |                                                          |
|              NODE_NAME               |                    ericsson-virtual3                     |
+--------------------------------------+----------------------------------------------------------+

2019-08-19 14:37:03,331 - xtesting.ci.run_tests - INFO - Sourcing env file /var/lib/xtesting/conf/env_file


export OS_IDENTITY_API_VERSION=3
export OS_PROJECT_DOMAIN_NAME=Default
export OS_USER_DOMAIN_NAME=Default
export OS_PROJECT_NAME=admin
export OS_TENANT_NAME=admin
export OS_USERNAME=admin
export OS_PASSWORD=opnfv_secret
export OS_REGION_NAME=RegionOne
export OS_INTERFACE=internal
export OS_ENDPOINT_TYPE="internal"
export OS_CACERT="/etc/ssl/certs/ca-certificates.crt"
export SDN_CONTROLLER_USER=admin
export SDN_CONTROLLER_RESTCONFPORT=8282
export SDN_CONTROLLER_PASSWORD=admin
export SDN_CONTROLLER_WEBPORT=8282
export SDN_CONTROLLER_IP=10.16.0.107
export VOLUME_DEVICE_NAME=sdc
export OS_AUTH_URL=http://172.16.10.36:35357/v3

2019-08-19 14:37:03,332 - xtesting.ci.run_tests - INFO - TESTS TO BE EXECUTED:

+------------------+---------------+-------------------------------------------+----------------------------------------------+
|      TIERS       |     ORDER     |                DESCRIPTION                |                  TESTCASES                   |
+------------------+---------------+-------------------------------------------+----------------------------------------------+
|     features     |       3       |     Test suites from feature projects     |     doctor-notification functest-odl-sfc     |
|                  |               |           integrated in functest          |                                              |
+------------------+---------------+-------------------------------------------+----------------------------------------------+

2019-08-19 14:37:03,348 - xtesting.ci.run_tests - INFO - Loading test case 'doctor-notification'...
2019-08-19 14:37:03,425 - xtesting.ci.run_tests - INFO - Running test case 'doctor-notification'...
2019-08-19 14:37:03,425 - xtesting.core.feature - INFO - Calling doctor-test
2019-08-19 14:40:20,713 - xtesting.core.testcase - INFO - The results were successfully pushed to DB
2019-08-19 14:40:20,714 - xtesting.ci.run_tests - INFO - Test result:

+-----------------------------+-----------------+------------------+----------------+
|          TEST CASE          |     PROJECT     |     DURATION     |     RESULT     |
+-----------------------------+-----------------+------------------+----------------+
|     doctor-notification     |      doctor     |      03:17       |      PASS      |
+-----------------------------+-----------------+------------------+----------------+

2019-08-19 14:40:20,744 - xtesting.ci.run_tests - INFO - Loading test case 'functest-odl-sfc'...
2019-08-19 14:40:21,893 - xtesting.ci.run_tests - INFO - Running test case 'functest-odl-sfc'...
2019-08-19 14:40:22,023 - SSH utils - ERROR - Authentication failed.
2019-08-19 14:40:22,024 - xtesting.ci.run_tests - ERROR - 

Please fix the testcase functest-odl-sfc.
All exceptions should be caught by the testcase instead!

Traceback (most recent call last):
  File "/usr/lib/python2.7/site-packages/xtesting/ci/run_tests.py", line 171, in run_test
    test_case.run()
  File "/usr/lib/python2.7/site-packages/sfc/tests/functest/run_sfc_tests.py", line 125, in run
    COMMON_CONFIG.installer_key_file)
  File "/usr/lib/python2.7/site-packages/opnfv/deployment/factory.py", line 45, in get_handler
    pkey_file=pkey_file)
  File "/usr/lib/python2.7/site-packages/opnfv/deployment/fuel/adapter.py", line 40, in __init__
    pkey_file=pkey_file)
  File "/usr/lib/python2.7/site-packages/opnfv/deployment/manager.py", line 332, in __init__
    'Cannot establish connection to the installer node!')
Exception: Cannot establish connection to the installer node!
2019-08-19 14:40:22,025 - xtesting.ci.run_tests - ERROR - The test case 'functest-odl-sfc' failed.
2019-08-19 14:40:22,026 - xtesting.core.testcase - ERROR - Please run test before getting the duration
2019-08-19 14:40:22,026 - xtesting.ci.run_tests - INFO - Xtesting report:

+-----------------------------+-------------------+------------------+------------------+----------------+
|          TEST CASE          |      PROJECT      |       TIER       |     DURATION     |     RESULT     |
+-----------------------------+-------------------+------------------+------------------+----------------+
|     doctor-notification     |       doctor      |     features     |      03:17       |      PASS      |
|       functest-odl-sfc      |        sfc        |     features     |      XX:XX       |      FAIL      |
|      barometercollectd      |     barometer     |     features     |      00:00       |      SKIP      |
|             vgpu            |      functest     |     features     |      00:00       |      SKIP      |
|         stor4nfv_os         |      stor4nfv     |     features     |      00:00       |      SKIP      |
+-----------------------------+-------------------+------------------+------------------+----------------+

2019-08-19 14:40:22,030 - xtesting.ci.run_tests - INFO - Execution exit value: Result.EX_ERROR
Functest: Pulling Functest Docker image opnfv/functest-vnf:hunter ...
Running Functest tier 'vnf'. CMD: docker run --rm  -e INSTALLER_TYPE=fuel -e INSTALLER_IP=10.20.0.2     -e NODE_NAME=ericsson-virtual3 -e DEPLOY_SCENARIO=os-odl-sfc-noha     -e BUILD_TAG=jenkins-functest-fuel-virtual-daily-hunter-619 -e DEPLOY_TYPE=virt -e CI_LOOP=daily     -e TEST_DB_URL=http://testresults.opnfv.org/test/api/v1/results -e ENERGY_RECORDER_API_URL=http://energy.opnfv.fr/resources     -e DEBUG=true -e POD_ARCH=x86_64 -e BLOCK_MIGRATION=false -e SDN_CONTROLLER_RESTCONFPORT=8080 -e IMAGE_PROPERTIES=hw_disk_bus:scsi,hw_scsi_model:virtio-scsi -e FLAVOR_EXTRA_SPECS= -v /home/jenkins/opnfv/functest/images:/home/opnfv/functest/images -v /home/jenkins/opnfv/functest/results/hunter:/home/opnfv/functest/results -v /var/lib/opnfv/mcp.rsa:/root/.ssh/id_rsa       -v /home/jenkins/opnfv-openrc.sh:/home/opnfv/functest/conf/env_file      -v /tmp/tmp.OQ2MNBpOB7:/usr/lib/python2.7/site-packages/functest/opnfv_tests/openstack/tempest/custom_tests/tempest_conf.yaml  opnfv/functest-vnf:hunter /bin/bash -c 'run_tests -r -t all'
2019-08-19 14:40:25,687 - xtesting.ci.run_tests - INFO - Deployment description:

+--------------------------------------+----------------------------------------------------------+
|               ENV VAR                |                          VALUE                           |
+--------------------------------------+----------------------------------------------------------+
|              BUILD_TAG               |      jenkins-functest-fuel-virtual-daily-hunter-619      |
|             TEST_DB_URL              |     http://testresults.opnfv.org/test/api/v1/results     |
|     ENERGY_RECORDER_API_PASSWORD     |                                                          |
|               CI_LOOP                |                          daily                           |
|                DEBUG                 |                           true                           |
|            INSTALLER_TYPE            |                           fuel                           |
|       ENERGY_RECORDER_API_URL        |             http://energy.opnfv.fr/resources             |
|           DEPLOY_SCENARIO            |                     os-odl-sfc-noha                      |
|       ENERGY_RECORDER_API_USER       |                                                          |
|              NODE_NAME               |                    ericsson-virtual3                     |
+--------------------------------------+----------------------------------------------------------+

2019-08-19 14:40:25,692 - xtesting.ci.run_tests - INFO - Sourcing env file /var/lib/xtesting/conf/env_file


export OS_IDENTITY_API_VERSION=3
export OS_PROJECT_DOMAIN_NAME=Default
export OS_USER_DOMAIN_NAME=Default
export OS_PROJECT_NAME=admin
export OS_TENANT_NAME=admin
export OS_USERNAME=admin
export OS_PASSWORD=opnfv_secret
export OS_REGION_NAME=RegionOne
export OS_INTERFACE=internal
export OS_ENDPOINT_TYPE="internal"
export OS_CACERT="/etc/ssl/certs/ca-certificates.crt"
export SDN_CONTROLLER_USER=admin
export SDN_CONTROLLER_RESTCONFPORT=8282
export SDN_CONTROLLER_PASSWORD=admin
export SDN_CONTROLLER_WEBPORT=8282
export SDN_CONTROLLER_IP=10.16.0.107
export VOLUME_DEVICE_NAME=sdc
export OS_AUTH_URL=http://172.16.10.36:35357/v3

2019-08-19 14:40:25,693 - xtesting.ci.run_tests - INFO - TESTS TO BE EXECUTED:

+---------------+---------------+---------------------------------------+----------------------------------------+
|     TIERS     |     ORDER     |              DESCRIPTION              |               TESTCASES                |
+---------------+---------------+---------------------------------------+----------------------------------------+
|      vnf      |       4       |     Collection of VNF test cases.     |     cloudify cloudify_ims heat_ims     |
|               |               |                                       |         vyos_vrouter juju_epc          |
+---------------+---------------+---------------------------------------+----------------------------------------+

2019-08-19 14:40:25,705 - xtesting.ci.run_tests - INFO - Loading test case 'cloudify'...
2019-08-19 14:40:28,003 - xtesting.ci.run_tests - INFO - Running test case 'cloudify'...
2019-08-19 14:45:46,300 - functest.core.cloudify - INFO - Attemps running status of the Manager
2019-08-19 14:46:16,903 - functest.core.cloudify - INFO - The current manager status is running
2019-08-19 14:46:17,521 - functest.core.cloudify - INFO - Secrets API successfully reached
2019-08-19 14:46:17,521 - functest.core.cloudify - INFO - Cloudify Manager is up and running
2019-08-19 14:46:17,853 - xtesting.core.testcase - INFO - The results were successfully pushed to DB
2019-08-19 14:46:17,853 - xtesting.ci.run_tests - INFO - Test result:

+-------------------+------------------+------------------+----------------+
|     TEST CASE     |     PROJECT      |     DURATION     |     RESULT     |
+-------------------+------------------+------------------+----------------+
|      cloudify     |     functest     |      05:50       |      PASS      |
+-------------------+------------------+------------------+----------------+

2019-08-19 14:46:36,377 - xtesting.ci.run_tests - INFO - Loading test case 'cloudify_ims'...
2019-08-19 14:46:38,430 - xtesting.ci.run_tests - INFO - Running test case 'cloudify_ims'...
2019-08-19 14:50:30,876 - functest.core.cloudify - INFO - Attemps running status of the Manager
2019-08-19 14:51:01,384 - functest.core.cloudify - INFO - The current manager status is running
2019-08-19 14:51:01,787 - functest.core.cloudify - INFO - Secrets API successfully reached
2019-08-19 14:51:01,788 - functest.core.cloudify - INFO - Cloudify Manager is up and running
2019-08-19 14:51:03,357 - functest.core.cloudify - INFO - Put private keypair in manager
Build timed out (after 600 minutes). Marking the build as aborted.
New run name is '619 Suite: daily Scenario: os-odl-sfc-noha'
Build was aborted
No emails were triggered.
Finished: ABORTED